Hospital Service Area,Hospital County,Operating Certificate Number,Permanent Facility Id,Facility Name,Age Group,Zip Code - 3 digits,Gender,Race,Ethnicity,Length of Stay,Type of Admission,Patient Disposition,Discharge Year,CCS Diagnosis Code,CCS Diagnosis Description,CCS Procedure Code,CCS Procedure Description,APR DRG Code,APR DRG Description,APR MDC Code,APR MDC Description,APR Severity of Illness Code,APR Severity of Illness Description,APR Risk of Mortality,APR Medical Surgical Description,Payment Typology 1,Payment Typology 2,Payment Typology 3,Birth Weight,Abortion Edit Indicator,Emergency Department Indicator,Total Charges,Total Costs
New York City,Manhattan,7002032,001469,Mount Sinai St. Luke's,70 or Older,100,F,White,Spanish/Hispanic,2,Emergency,Home or Self Care,2017,175,Other female genital disorders,193,DX ULTRASOUND HEART,532,Menstrual & other female reproductive system disorders,13,Diseases and Disorders of the Female Reproductive System,2,Moderate,Minor,Medical,Medicaid,Medicaid,Self-Pay,,N,Y,21266.55,7119.44
New York City,Bronx,7000006,001169,Montefiore Medical Center - Henry & Lucy Moses Div,30 to 49,104,F,Black/African American,Not Span/Hispanic,1,Emergency,Home or Self Care,2017,046,Benign neoplasm of uterus,000,NO PROC,532,Menstrual & other female reproductive system disorders,13,Diseases and Disorders of the Female Reproductive System,2,Moderate,Minor,Medical,Medicaid,,,,N,Y,22442.84,2923.72
New York City,Bronx,7000006,001169,Montefiore Medical Center - Henry & Lucy Moses Div,30 to 49,104,F,Black/African American,Not Span/Hispanic,4,Emergency,Home or Self Care,2017,169,Endometriosis,000,NO PROC,532,Menstrual & other female reproductive system disorders,13,Diseases and Disorders of the Female Reproductive System,2,Moderate,Minor,Medical,Medicaid,,,,N,Y,36774.84,8076.42
New York City,Bronx,7000006,001169,Montefiore Medical Center - Henry & Lucy Moses Div,0 to 17,104,F,Other Race,Not Span/Hispanic,2,Emergency,Home or Self Care,2017,175,Other female genital disorders,000,NO PROC,532,Menstrual & other female reproductive system disorders,13,Diseases and Disorders of the Female Reproductive System,2,Moderate,Minor,Medical,Medicaid,,,,N,N,26881.53,6296.66
New York City,Bronx,7000006,001169,Montefiore Medical Center - Henry & Lucy Moses Div,0 to 17,104,F,Other Race,Spanish/Hispanic,1,Emergency,Home or Self Care,2017,175,Other female genital disorders,222,BLOOD TRANSFUSION,532,Menstrual & other female reproductive system disorders,13,Diseases and Disorders of the Female Reproductive System,2,Moderate,Minor,Medical,Medicaid,,,,N,Y,22818.64,4302.29
New York City,Bronx,7000006,001169,Montefiore Medical Center - Henry & Lucy Moses Div,18 to 29,104,F,Black/African American,Not Span/Hispanic,1,Emergency,Home or Self Care,2017,171,Menstrual disorders,041,OT NON-OR THER PRC RESP,532,Menstrual & other female reproductive system disorders,13,Diseases and Disorders of the Female Reproductive System,1,Minor,Minor,Medical,Medicaid,,,,N,Y,19012.41,3842.21
New York City,Bronx,7000006,003058,Montefiore Med Center - Jack D Weiler Hosp of A Einstein College Div,18 to 29,104,F,Black/African American,Not Span/Hispanic,1,Emergency,Home or Self Care,2017,174,Female infertility,222,BLOOD TRANSFUSION,532,Menstrual & other female reproductive system disorders,13,Diseases and Disorders of the Female Reproductive System,2,Moderate,Minor,Medical,Medicaid,,,,N,Y,25582.12,5389.18
New York City,Bronx,7000006,003058,Montefiore Med Center - Jack D Weiler Hosp of A Einstein College Div,18 to 29,104,F,White,Not Span/Hispanic,2,Emergency,Home or Self Care,2017,172,Ovarian cyst,196,DX ULTRASOUND AB/RETRO,532,Menstrual & other female reproductive system disorders,13,Diseases and Disorders of the Female Reproductive System,1,Minor,Moderate,Medical,Blue Cross/Blue Shield,,,,N,Y,36898.74,7524.75
New York City,Kings,7001033,001315,Kingsbrook Jewish Medical Center,30 to 49,112,F,Black/African American,Not Span/Hispanic,1,Emergency,Home or Self Care,2017,172,Ovarian cyst,000,NO PROC,532,Menstrual & other female reproductive system disorders,13,Diseases and Disorders of the Female Reproductive System,1,Minor,Minor,Medical,Medicaid,Medicaid,Self-Pay,,N,Y,13647.00,3186.39
Hudson Valley,Orange,3523000,000699,Orange Regional Medical Center,50 to 69,109,F,Other Race,Spanish/Hispanic,3,Emergency,Home or Self Care,2017,170,Prolapse of female genital organs,222,BLOOD TRANSFUSION,532,Menstrual & other female reproductive system disorders,13,Diseases and Disorders of the Female Reproductive System,2,Moderate,Minor,Medical,Private Health Insurance,,,,N,Y,28079.29,12094.78
Hudson Valley,Orange,3523000,000699,Orange Regional Medical Center,30 to 49,109,F,Other Race,Spanish/Hispanic,2,Emergency,Home or Self Care,2017,175,Other female genital disorders,000,NO PROC,532,Menstrual & other female reproductive system disorders,13,Diseases and Disorders of the Female Reproductive System,2,Moderate,Minor,Medical,Blue Cross/Blue Shield,,,,N,Y,16930.89,3915.41
New York City,Bronx,7000006,001169,Montefiore Medical Center - Henry & Lucy Moses Div,30 to 49,104,F,Black/African American,Not Span/Hispanic,2,Emergency,Home or Self Care,2017,046,Benign neoplasm of uterus,000,NO PROC,532,Menstrual & other female reproductive system disorders,13,Diseases and Disorders of the Female Reproductive System,2,Moderate,Minor,Medical,Private Health Insurance,,,,N,Y,29935.41,4725.59
New York City,Bronx,7000006,001169,Montefiore Medical Center - Henry & Lucy Moses Div,30 to 49,104,F,Other Race,Not Span/Hispanic,2,Emergency,Home or Self Care,2017,169,Endometriosis,000,NO PROC,532,Menstrual & other female reproductive system disorders,13,Diseases and Disorders of the Female Reproductive System,2,Moderate,Minor,Medical,Private Health Insurance,,,,N,Y,36426.75,5860.65
New York City,Bronx,7000006,003058,Montefiore Med Center - Jack D Weiler Hosp of A Einstein College Div,30 to 49,104,F,Black/African American,Not Span/Hispanic,1,Emergency,Home or Self Care,2017,171,Menstrual disorders,222,BLOOD TRANSFUSION,532,Menstrual & other female reproductive system disorders,13,Diseases and Disorders of the Female Reproductive System,2,Moderate,Minor,Medical,Medicaid,,,,N,Y,32321.24,6285.40
Hudson Valley,Westchester,5904001,001072,Montefiore New Rochelle Hospital,70 or Older,108,F,White,Unknown,4,Emergency,Home or Self Care,2017,175,Other female genital disorders,019,OT THER PRCS EYELIDS,532,Menstrual & other female reproductive system disorders,13,Diseases and Disorders of the Female Reproductive System,2,Moderate,Moderate,Medical,Medicare,Medicare,Private Health Insurance,,N,N,26561.00,14373.63
New York City,Bronx,7000006,003058,Montefiore Med Center - Jack D Weiler Hosp of A Einstein College Div,30 to 49,104,F,Other Race,Spanish/Hispanic,2,Emergency,Home or Self Care,2017,175,Other female genital disorders,058,HEMODIALYSIS,532,Menstrual & other female reproductive system disorders,13,Diseases and Disorders of the Female Reproductive System,3,Major,Major,Medical,Medicare,Medicaid,,,N,Y,23871.14,4325.64
New York City,Bronx,7000006,003058,Montefiore Med Center - Jack D Weiler Hosp of A Einstein College Div,30 to 49,104,F,Black/African American,Not Span/Hispanic,2,Emergency,Home or Self Care,2017,169,Endometriosis,222,BLOOD TRANSFUSION,532,Menstrual & other female reproductive system disorders,13,Diseases and Disorders of the Female Reproductive System,2,Moderate,Minor,Medical,Medicaid,,,,N,Y,38924.61,6170.58
New York City,Kings,7001037,001320,University Hospital of Brooklyn,70 or Older,112,F,Black/African American,Not Span/Hispanic,28,Emergency,Home w/ Home Health Services,2017,175,Other female genital disorders,222,BLOOD TRANSFUSION,532,Menstrual & other female reproductive system disorders,13,Diseases and Disorders of the Female Reproductive System,3,Major,Major,Medical,Medicare,Medicare,Self-Pay,,N,Y,114611.00,89732.41
New York City,Kings,7001037,001320,University Hospital of Brooklyn,50 to 69,112,F,Black/African American,Not Span/Hispanic,1,Elective,Home or Self Care,2017,237,Complication of device; implant or graft,132,OT OR THER PRC; FEM ORG,532,Menstrual & other female reproductive system disorders,13,Diseases and Disorders of the Female Reproductive System,2,Moderate,Minor,Medical,Medicaid,Medicaid,Self-Pay,,N,N,15299.00,8736.74
New York City,Kings,7002002,001324,Mount Sinai Brooklyn,70 or Older,100,F,White,Not Span/Hispanic,5,Emergency,Home or Self Care,2017,175,Other female genital disorders,179,CT SCAN ABDOMEN,532,Menstrual & other female reproductive system disorders,13,Diseases and Disorders of the Female Reproductive System,1,Minor,Minor,Medical,Medicare,Blue Cross/Blue Shield,Self-Pay,,N,Y,39539.20,6259.93
New York City,Manhattan,7002024,001456,Mount Sinai Hospital,50 to 69,100,F,Other Race,Not Span/Hispanic,16,Emergency,Hospice - Medical Facility,2017,175,Other female genital disorders,179,CT SCAN ABDOMEN,532,Menstrual & other female reproductive system disorders,13,Diseases and Disorders of the Female Reproductive System,2,Moderate,Major,Medical,Medicaid,Medicaid,Self-Pay,,N,Y,114955.72,39855.85
New York City,Manhattan,7002053,001463,NYU Langone Hospitals,70 or Older,112,F,White,Not Span/Hispanic,1,Elective,Home or Self Care,2017,175,Other female genital disorders,130,OT DX PRCS; FEMALE ORGN,532,Menstrual & other female reproductive system disorders,13,Diseases and Disorders of the Female Reproductive System,1,Minor,Minor,Medical,Medicare,,,,N,N,42450.38,12792.75
New York City,Manhattan,7002032,001469,Mount Sinai St. Luke's,30 to 49,100,F,White,Not Span/Hispanic,1,Emergency,Home or Self Care,2017,175,Other female genital disorders,196,DX ULTRASOUND AB/RETRO,532,Menstrual & other female reproductive system disorders,13,Diseases and Disorders of the Female Reproductive System,2,Moderate,Minor,Medical,Blue Cross/Blue Shield,Self-Pay,,,N,Y,24775.67,6194.45
Long Island,Nassau,2950002,000528,Nassau University Medical Center,30 to 49,115,F,White,Not Span/Hispanic,2,Emergency,Home or Self Care,2017,173,Menopausal disorders,222,BLOOD TRANSFUSION,532,Menstrual & other female reproductive system disorders,13,Diseases and Disorders of the Female Reproductive System,3,Major,Moderate,Medical,Medicaid,Medicaid,Self-Pay,,N,N,13082.28,5547.69
Long Island,Nassau,2950002,000528,Nassau University Medical Center,30 to 49,117,F,White,Not Span/Hispanic,1,Emergency,Home or Self Care,2017,175,Other female genital disorders,222,BLOOD TRANSFUSION,532,Menstrual & other female reproductive system disorders,13,Diseases and Disorders of the Female Reproductive System,2,Moderate,Minor,Medical,Self-Pay,Self-Pay,,,N,N,9300.61,5345.96
Long Island,Nassau,2950002,000528,Nassau University Medical Center,30 to 49,115,F,Other Race,Not Span/Hispanic,1,Emergency,Home or Self Care,2017,171,Menstrual disorders,222,BLOOD TRANSFUSION,532,Menstrual & other female reproductive system disorders,13,Diseases and Disorders of the Female Reproductive System,2,Moderate,Minor,Medical,Blue Cross/Blue Shield,Self-Pay,,,N,Y,15436.89,6922.55
Long Island,Nassau,2950002,000528,Nassau University Medical Center,18 to 29,115,F,White,Not Span/Hispanic,1,Emergency,Home or Self Care,2017,169,Endometriosis,222,BLOOD TRANSFUSION,532,Menstrual & other female reproductive system disorders,13,Diseases and Disorders of the Female Reproductive System,1,Minor,Minor,Medical,Private Health Insurance,Medicaid,Self-Pay,,N,Y,9148.57,3922.68
Hudson Valley,Westchester,7002054,001047,New York Presbyterian Hospital - Westchester Division,18 to 29,105,F,White,Not Span/Hispanic,5,Emergency,Home or Self Care,2017,051,Other endocrine disorders,000,NO PROC,532,Menstrual & other female reproductive system disorders,13,Diseases and Disorders of the Female Reproductive System,2,Moderate,Minor,Medical,Private Health Insurance,Self-Pay,,,N,N,27038.90,6344.13
New York City,Kings,7001021,001306,New York - Presbyterian Brooklyn Methodist Hospital,50 to 69,112,F,Black/African American,Not Span/Hispanic,3,Emergency,Home or Self Care,2017,046,Benign neoplasm of uterus,000,NO PROC,532,Menstrual & other female reproductive system disorders,13,Diseases and Disorders of the Female Reproductive System,2,Moderate,Minor,Medical,Blue Cross/Blue Shield,Self-Pay,,,N,Y,28557.00,6709.25
New York City,Kings,7001021,001306,New York - Presbyterian Brooklyn Methodist Hospital,30 to 49,112,F,Black/African American,Not Span/Hispanic,1,Emergency,Home or Self Care,2017,175,Other female genital disorders,222,BLOOD TRANSFUSION,532,Menstrual & other female reproductive system disorders,13,Diseases and Disorders of the Female Reproductive System,2,Moderate,Minor,Medical,Private Health Insurance,Self-Pay,,,N,Y,15872.18,5241.34
New York City,Kings,7001021,001306,New York - Presbyterian Brooklyn Methodist Hospital,30 to 49,112,F,Black/African American,Not Span/Hispanic,2,Emergency,Home or Self Care,2017,046,Benign neoplasm of uterus,222,BLOOD TRANSFUSION,532,Menstrual & other female reproductive system disorders,13,Diseases and Disorders of the Female Reproductive System,2,Moderate,Minor,Medical,Medicaid,Medicaid,Self-Pay,,N,Y,14959.99,4424.58
New York City,Kings,7001021,001306,New York - Presbyterian Brooklyn Methodist Hospital,30 to 49,112,F,Other Race,Not Span/Hispanic,1,Emergency,Home or Self Care,2017,046,Benign neoplasm of uterus,222,BLOOD TRANSFUSION,532,Menstrual & other female reproductive system disorders,13,Diseases and Disorders of the Female Reproductive System,2,Moderate,Minor,Medical,Blue Cross/Blue Shield,Self-Pay,,,N,Y,12432.27,3009.75
New York City,Kings,7001021,001306,New York - Presbyterian Brooklyn Methodist Hospital,18 to 29,113,F,Other Race,Not Span/Hispanic,1,Emergency,Home or Self Care,2017,172,Ovarian cyst,000,NO PROC,532,Menstrual & other female reproductive system disorders,13,Diseases and Disorders of the Female Reproductive System,1,Minor,Minor,Medical,Private Health Insurance,Self-Pay,,,N,Y,9508.93,2504.36
New York City,Manhattan,7002024,001456,Mount Sinai Hospital,30 to 49,100,F,Other Race,Not Span/Hispanic,1,Emergency,Home or Self Care,2017,172,Ovarian cyst,000,NO PROC,532,Menstrual & other female reproductive system disorders,13,Diseases and Disorders of the Female Reproductive System,1,Minor,Minor,Medical,Medicaid,Medicaid,Self-Pay,,N,Y,15513.93,4706.20
New York City,Manhattan,7002054,001458,New York Presbyterian Hospital - New York Weill Cornell Center,18 to 29,104,F,Multi-racial,Spanish/Hispanic,2,Emergency,Home or Self Care,2017,046,Benign neoplasm of uterus,222,BLOOD TRANSFUSION,532,Menstrual & other female reproductive system disorders,13,Diseases and Disorders of the Female Reproductive System,1,Minor,Minor,Medical,Private Health Insurance,Self-Pay,,,N,Y,21580.85,5431.53
New York City,Manhattan,7002054,001464,New York Presbyterian Hospital - Columbia Presbyterian Center,30 to 49,104,F,Multi-racial,Not Span/Hispanic,1,Emergency,Home or Self Care,2017,169,Endometriosis,222,BLOOD TRANSFUSION,532,Menstrual & other female reproductive system disorders,13,Diseases and Disorders of the Female Reproductive System,1,Minor,Minor,Medical,Medicaid,Medicaid,Self-Pay,,N,Y,10321.85,2628.52
New York City,Manhattan,7002054,001464,New York Presbyterian Hospital - Columbia Presbyterian Center,18 to 29,100,F,Other Race,Spanish/Hispanic,1,Emergency,Home or Self Care,2017,175,Other female genital disorders,222,BLOOD TRANSFUSION,532,Menstrual & other female reproductive system disorders,13,Diseases and Disorders of the Female Reproductive System,3,Major,Minor,Medical,Blue Cross/Blue Shield,Self-Pay,,,N,Y,12309.49,3257.03
New York City,Manhattan,7002032,001469,Mount Sinai St. Luke's,50 to 69,100,F,Black/African American,Spanish/Hispanic,6,Emergency,Home or Self Care,2017,175,Other female genital disorders,130,OT DX PRCS; FEMALE ORGN,532,Menstrual & other female reproductive system disorders,13,Diseases and Disorders of the Female Reproductive System,3,Major,Major,Medical,Medicaid,Self-Pay,,,N,Y,57845.95,15839.40
New York City,Manhattan,7002032,001469,Mount Sinai St. Luke's,30 to 49,100,F,Black/African American,Not Span/Hispanic,2,Emergency,Home or Self Care,2017,046,Benign neoplasm of uterus,222,BLOOD TRANSFUSION,532,Menstrual & other female reproductive system disorders,13,Diseases and Disorders of the Female Reproductive System,2,Moderate,Minor,Medical,Medicaid,Medicaid,Self-Pay,,N,Y,28484.53,6722.84
New York City,Manhattan,7002054,003975,New York Presbyterian Hospital - Allen Hospital,30 to 49,104,F,Multi-racial,Multi-ethnic,2,Emergency,Home or Self Care,2017,171,Menstrual disorders,070,UP GASTRO ENDOSC/BIOPSY,532,Menstrual & other female reproductive system disorders,13,Diseases and Disorders of the Female Reproductive System,1,Minor,Minor,Medical,Private Health Insurance,Medicaid,Self-Pay,,N,Y,28206.45,7579.23
Central NY,Onondaga,3301008,000636,Crouse Hospital,30 to 49,132,F,Black/African American,Not Span/Hispanic,4,Emergency,Home or Self Care,2017,046,Benign neoplasm of uterus,070,UP GASTRO ENDOSC/BIOPSY,532,Menstrual & other female reproductive system disorders,13,Diseases and Disorders of the Female Reproductive System,2,Moderate,Minor,Medical,Medicaid,,,,N,Y,15867.40,7199.00
Capital/Adirond,Columbia,1001000,000146,Columbia Memorial Hospital,70 or Older,125,F,White,Not Span/Hispanic,3,Elective,Skilled Nursing Home,2017,237,Complication of device; implant or graft,098,OT NON-OR GI THER PRCS,532,Menstrual & other female reproductive system disorders,13,Diseases and Disorders of the Female Reproductive System,2,Moderate,Moderate,Medical,Medicare,Blue Cross/Blue Shield,,,N,N,19575.69,6710.25
Hudson Valley,Westchester,5903001,001061,Montefiore Mount Vernon Hospital,30 to 49,105,F,Black/African American,Not Span/Hispanic,2,Emergency,Home or Self Care,2017,175,Other female genital disorders,222,BLOOD TRANSFUSION,532,Menstrual & other female reproductive system disorders,13,Diseases and Disorders of the Female Reproductive System,2,Moderate,Minor,Medical,Private Health Insurance,Self-Pay,,,N,N,12970.00,5905.60
New York City,Bronx,7000001,001178,Bronx-Lebanon Hospital Center - Concourse Division,30 to 49,104,F,Other Race,Unknown,4,Emergency,Home or Self Care,2017,046,Benign neoplasm of uterus,000,NO PROC,532,Menstrual & other female reproductive system disorders,13,Diseases and Disorders of the Female Reproductive System,2,Moderate,Minor,Medical,Medicare,Medicaid,,,N,Y,13224.65,13786.71
New York City,Manhattan,7002024,001456,Mount Sinai Hospital,18 to 29,113,F,Other Race,Not Span/Hispanic,3,Emergency,Home or Self Care,2017,044,Neoplasms of unspecified nature or uncertain behavior,198,MAG RESONANCE IMAGING,532,Menstrual & other female reproductive system disorders,13,Diseases and Disorders of the Female Reproductive System,2,Moderate,Minor,Medical,Medicaid,Medicaid,Self-Pay,,N,Y,32483.96,9575.87
New York City,Manhattan,7002053,001463,NYU Langone Hospitals,30 to 49,112,F,Black/African American,Not Span/Hispanic,5,Emergency,Home w/ Home Health Services,2017,175,Other female genital disorders,130,OT DX PRCS; FEMALE ORGN,532,Menstrual & other female reproductive system disorders,13,Diseases and Disorders of the Female Reproductive System,2,Moderate,Minor,Medical,Medicaid,,,,N,Y,95066.98,26538.15
Western NY,Erie,1401014,000207,Buffalo General Medical Center,70 or Older,142,F,Black/African American,Not Span/Hispanic,12,Emergency,Home or Self Care,2017,175,Other female genital disorders,054,OT VASC CATH; NOT HEART,532,Menstrual & other female reproductive system disorders,13,Diseases and Disorders of the Female Reproductive System,2,Moderate,Moderate,Medical,Medicare,Medicaid,Self-Pay,,N,Y,28619.30,12647.29
Western NY,Erie,1401014,003067,Millard Fillmore Suburban Hospital,30 to 49,142,F,Black/African American,Not Span/Hispanic,1,Elective,Home or Self Care,2017,171,Menstrual disorders,000,NO PROC,532,Menstrual & other female reproductive system disorders,13,Diseases and Disorders of the Female Reproductive System,2,Moderate,Minor,Medical,Medicaid,Self-Pay,,,N,N,1581.16,1155.27
Western NY,Erie,1401014,003067,Millard Fillmore Suburban Hospital,50 to 69,142,F,Black/African American,Not Span/Hispanic,3,Emergency,Home or Self Care,2017,171,Menstrual disorders,222,BLOOD TRANSFUSION,532,Menstrual & other female reproductive system disorders,13,Diseases and Disorders of the Female Reproductive System,2,Moderate,Minor,Medical,Medicaid,Self-Pay,,,N,Y,12841.31,5972.79
Capital/Adirond,Rensselaer,4102002,000756,Samaritan Hospital,18 to 29,121,F,White,Not Span/Hispanic,1,Urgent,Home or Self Care,2017,175,Other female genital disorders,000,NO PROC,532,Menstrual & other female reproductive system disorders,13,Diseases and Disorders of the Female Reproductive System,1,Minor,Minor,Medical,Medicaid,Self-Pay,Self-Pay,,N,N,1509.70,914.19
New York City,Bronx,7000006,001168,Montefiore Medical Center-Wakefield Hospital,30 to 49,104,F,Black/African American,Not Span/Hispanic,1,Emergency,Home or Self Care,2017,046,Benign neoplasm of uterus,000,NO PROC,532,Menstrual & other female reproductive system disorders,13,Diseases and Disorders of the Female Reproductive System,1,Minor,Minor,Medical,Private Health Insurance,,,,N,Y,25776.13,3495.62
New York City,Bronx,7000006,001169,Montefiore Medical Center - Henry & Lucy Moses Div,50 to 69,104,F,Black/African American,Not Span/Hispanic,3,Emergency,Home or Self Care,2017,046,Benign neoplasm of uterus,000,NO PROC,532,Menstrual & other female reproductive system disorders,13,Diseases and Disorders of the Female Reproductive System,1,Minor,Minor,Medical,Medicare,,,,N,Y,27448.90,5962.71
New York City,Bronx,7000006,001169,Montefiore Medical Center - Henry & Lucy Moses Div,30 to 49,106,F,Other Race,Spanish/Hispanic,2,Emergency,Inpatient Rehabilitation Facility,2017,175,Other female genital disorders,000,NO PROC,532,Menstrual & other female reproductive system disorders,13,Diseases and Disorders of the Female Reproductive System,2,Moderate,Minor,Medical,Medicaid,,,,N,Y,22669.37,4389.65
New York City,Bronx,7000006,003058,Montefiore Med Center - Jack D Weiler Hosp of A Einstein College Div,30 to 49,104,F,Other Race,Spanish/Hispanic,1,Emergency,Home or Self Care,2017,175,Other female genital disorders,000,NO PROC,532,Menstrual & other female reproductive system disorders,13,Diseases and Disorders of the Female Reproductive System,2,Moderate,Moderate,Medical,Medicare,Medicaid,,,N,Y,30430.24,4292.94
New York City,Bronx,7000006,003058,Montefiore Med Center - Jack D Weiler Hosp of A Einstein College Div,50 to 69,104,F,Other Race,Spanish/Hispanic,3,Emergency,Home w/ Home Health Services,2017,175,Other female genital disorders,000,NO PROC,532,Menstrual & other female reproductive system disorders,13,Diseases and Disorders of the Female Reproductive System,3,Major,Moderate,Medical,Medicaid,,,,N,Y,31457.36,6475.49
New York City,Bronx,7000006,003058,Montefiore Med Center - Jack D Weiler Hosp of A Einstein College Div,30 to 49,104,F,Other Race,Spanish/Hispanic,1,Emergency,Home or Self Care,2017,175,Other female genital disorders,000,NO PROC,532,Menstrual & other female reproductive system disorders,13,Diseases and Disorders of the Female Reproductive System,2,Moderate,Minor,Medical,Medicaid,,,,N,Y,30745.06,6446.17
New York City,Manhattan,7002002,001439,Mount Sinai Beth Israel,30 to 49,100,F,Other Race,Unknown,2,Emergency,Home or Self Care,2017,175,Other female genital disorders,231,OTHER THERAPEUTIC PRCS,532,Menstrual & other female reproductive system disorders,13,Diseases and Disorders of the Female Reproductive System,2,Moderate,Minor,Medical,Private Health Insurance,Self-Pay,,,N,Y,29258.99,8061.05