Hospital Service Area,Hospital County,Operating Certificate Number,Permanent Facility Id,Facility Name,Age Group,Zip Code - 3 digits,Gender,Race,Ethnicity,Length of Stay,Type of Admission,Patient Disposition,Discharge Year,CCS Diagnosis Code,CCS Diagnosis Description,CCS Procedure Code,CCS Procedure Description,APR DRG Code,APR DRG Description,APR MDC Code,APR MDC Description,APR Severity of Illness Code,APR Severity of Illness Description,APR Risk of Mortality,APR Medical Surgical Description,Payment Typology 1,Payment Typology 2,Payment Typology 3,Birth Weight,Abortion Edit Indicator,Emergency Department Indicator,Total Charges,Total Costs
Long Island,Nassau,2908000,000511,NYU Langone Hospital-Long Island,30 to 49,115,F,White,Not Span/Hispanic,1,Elective,Home or Self Care,2020,GEN020,PROLAPSE OF FEMALE GENITAL ORGANS,,,532,MENSTRUAL & OTHER FEMALE REPRODUCTIVE SYSTEM DISORDERS,13,DISEASES AND DISORDERS OF THE FEMALE REPRODUCTIVE SYSTEM,1,Minor,Minor,Medical,Blue Cross/Blue Shield,,,,,N,6941.74,2536.85
Long Island,Nassau,2908000,000511,NYU Langone Hospital-Long Island,70 or Older,110,F,White,Not Span/Hispanic,2,Emergency,Home or Self Care,2020,GEN023,MENOPAUSAL DISORDERS,,,532,MENSTRUAL & OTHER FEMALE REPRODUCTIVE SYSTEM DISORDERS,13,DISEASES AND DISORDERS OF THE FEMALE REPRODUCTIVE SYSTEM,2,Moderate,Moderate,Medical,Medicare,Federal/State/Local/VA,,,,Y,33959.31,8893.58
Long Island,Nassau,2908000,000511,NYU Langone Hospital-Long Island,30 to 49,117,F,White,Not Span/Hispanic,1,Emergency,Home or Self Care,2020,GEN021,MENSTRUAL DISORDERS,ADM001,TRANSFUSION OF BLOOD AND BLOOD PRODUCTS,532,MENSTRUAL & OTHER FEMALE REPRODUCTIVE SYSTEM DISORDERS,13,DISEASES AND DISORDERS OF THE FEMALE REPRODUCTIVE SYSTEM,3,Major,Major,Medical,Medicare,Private Health Insurance,,,,Y,34973.98,8620.2
Long Island,Nassau,2908000,000511,NYU Langone Hospital-Long Island,70 or Older,117,F,White,Not Span/Hispanic,2,Emergency,Home w/ Home Health Services,2020,GEN023,MENOPAUSAL DISORDERS,ADM001,TRANSFUSION OF BLOOD AND BLOOD PRODUCTS,532,MENSTRUAL & OTHER FEMALE REPRODUCTIVE SYSTEM DISORDERS,13,DISEASES AND DISORDERS OF THE FEMALE REPRODUCTIVE SYSTEM,2,Moderate,Moderate,Medical,Private Health Insurance,,,,,Y,51653.6,8751.45
Long Island,Nassau,2908000,000511,NYU Langone Hospital-Long Island,30 to 49,114,F,Other Race,Not Span/Hispanic,2,Emergency,Home or Self Care,2020,GEN022,BENIGN OVARIAN CYST,,,532,MENSTRUAL & OTHER FEMALE REPRODUCTIVE SYSTEM DISORDERS,13,DISEASES AND DISORDERS OF THE FEMALE REPRODUCTIVE SYSTEM,1,Minor,Minor,Medical,Private Health Insurance,,,,,Y,37607.04,8064.27
Long Island,Nassau,2908000,000511,NYU Langone Hospital-Long Island,18 to 29,115,F,Other Race,Not Span/Hispanic,2,Emergency,Home or Self Care,2020,GEN025,OTHER SPECIFIED FEMALE GENITAL DISORDERS,,,532,MENSTRUAL & OTHER FEMALE REPRODUCTIVE SYSTEM DISORDERS,13,DISEASES AND DISORDERS OF THE FEMALE REPRODUCTIVE SYSTEM,2,Moderate,Minor,Medical,Medicaid,,,,,Y,73738.03,8702.35
Long Island,Nassau,2908000,000511,NYU Langone Hospital-Long Island,50 to 69,115,F,Black/African American,Not Span/Hispanic,1,Emergency,Home or Self Care,2020,NEO073,BENIGN NEOPLASMS,GIS004,GI SYSTEM ENDOSCOPY WITHOUT BIOPSY (DIAGNOSTIC),532,MENSTRUAL & OTHER FEMALE REPRODUCTIVE SYSTEM DISORDERS,13,DISEASES AND DISORDERS OF THE FEMALE REPRODUCTIVE SYSTEM,1,Minor,Minor,Medical,Medicare,Blue Cross/Blue Shield,,,,Y,71517.56,14796.85
Long Island,Nassau,2908000,000511,NYU Langone Hospital-Long Island,30 to 49,119,F,White,Not Span/Hispanic,1,Elective,Home or Self Care,2020,GEN019,ENDOMETRIOSIS,GNR009,"RETROPERITONEAL PROCEDURES, NEC",532,MENSTRUAL & OTHER FEMALE REPRODUCTIVE SYSTEM DISORDERS,13,DISEASES AND DISORDERS OF THE FEMALE REPRODUCTIVE SYSTEM,1,Minor,Minor,Medical,Blue Cross/Blue Shield,,,,,N,42642.76,7894.18
Long Island,Nassau,2908000,000511,NYU Langone Hospital-Long Island,50 to 69,115,F,Other Race,Not Span/Hispanic,1,Emergency,Home or Self Care,2020,GEN021,MENSTRUAL DISORDERS,OTR004,ISOLATION PROCEDURES,532,MENSTRUAL & OTHER FEMALE REPRODUCTIVE SYSTEM DISORDERS,13,DISEASES AND DISORDERS OF THE FEMALE REPRODUCTIVE SYSTEM,2,Moderate,Moderate,Medical,Blue Cross/Blue Shield,,,,,Y,18018.22,3922.99
Long Island,Nassau,2908000,000511,NYU Langone Hospital-Long Island,30 to 49,115,F,Other Race,Not Span/Hispanic,1,Emergency,Left Against Medical Advice,2020,GEN025,OTHER SPECIFIED FEMALE GENITAL DISORDERS,,,532,MENSTRUAL & OTHER FEMALE REPRODUCTIVE SYSTEM DISORDERS,13,DISEASES AND DISORDERS OF THE FEMALE REPRODUCTIVE SYSTEM,1,Minor,Minor,Medical,Medicaid,,,,,Y,21671.51,3888.47
Long Island,Nassau,2908000,000511,NYU Langone Hospital-Long Island,30 to 49,115,F,Other Race,Spanish/Hispanic,1,Emergency,Home w/ Home Health Services,2020,GEN025,OTHER SPECIFIED FEMALE GENITAL DISORDERS,OTR004,ISOLATION PROCEDURES,532,MENSTRUAL & OTHER FEMALE REPRODUCTIVE SYSTEM DISORDERS,13,DISEASES AND DISORDERS OF THE FEMALE REPRODUCTIVE SYSTEM,2,Moderate,Moderate,Medical,Medicaid,,,,,Y,39364.45,8190.16
Long Island,Nassau,2908000,000511,NYU Langone Hospital-Long Island,50 to 69,117,F,White,Not Span/Hispanic,1,Elective,Home or Self Care,2020,NEO032,FEMALE REPRODUCTIVE SYSTEM CANCERS - CERVIX,FRS010,FEMALE UPPER GENITAL TRACT EXCISION,532,MENSTRUAL & OTHER FEMALE REPRODUCTIVE SYSTEM DISORDERS,13,DISEASES AND DISORDERS OF THE FEMALE REPRODUCTIVE SYSTEM,2,Moderate,Moderate,Medical,Private Health Insurance,,,,,N,41050.34,7269.01
Long Island,Nassau,2908000,000511,NYU Langone Hospital-Long Island,18 to 29,110,F,White,Not Span/Hispanic,2,Emergency,Home or Self Care,2020,GEN022,BENIGN OVARIAN CYST,,,532,MENSTRUAL & OTHER FEMALE REPRODUCTIVE SYSTEM DISORDERS,13,DISEASES AND DISORDERS OF THE FEMALE REPRODUCTIVE SYSTEM,1,Minor,Minor,Medical,Medicaid,,,,,Y,37500.78,9837.78
Long Island,Nassau,2908000,000511,NYU Langone Hospital-Long Island,50 to 69,115,F,Black/African American,Not Span/Hispanic,1,Emergency,Home or Self Care,2020,GEN025,OTHER SPECIFIED FEMALE GENITAL DISORDERS,ADM001,TRANSFUSION OF BLOOD AND BLOOD PRODUCTS,532,MENSTRUAL & OTHER FEMALE REPRODUCTIVE SYSTEM DISORDERS,13,DISEASES AND DISORDERS OF THE FEMALE REPRODUCTIVE SYSTEM,1,Minor,Minor,Medical,Blue Cross/Blue Shield,,,,,Y,56668.29,7885.9
Long Island,Nassau,2908000,000511,NYU Langone Hospital-Long Island,30 to 49,115,F,Black/African American,Not Span/Hispanic,1,Emergency,Home or Self Care,2020,GEN021,MENSTRUAL DISORDERS,ADM001,TRANSFUSION OF BLOOD AND BLOOD PRODUCTS,532,MENSTRUAL & OTHER FEMALE REPRODUCTIVE SYSTEM DISORDERS,13,DISEASES AND DISORDERS OF THE FEMALE REPRODUCTIVE SYSTEM,2,Moderate,Minor,Medical,Blue Cross/Blue Shield,,,,,Y,34052.37,7168.67
Long Island,Nassau,2908000,000511,NYU Langone Hospital-Long Island,18 to 29,115,F,Black/African American,Not Span/Hispanic,1,Emergency,Home or Self Care,2020,GEN021,MENSTRUAL DISORDERS,ADM001,TRANSFUSION OF BLOOD AND BLOOD PRODUCTS,532,MENSTRUAL & OTHER FEMALE REPRODUCTIVE SYSTEM DISORDERS,13,DISEASES AND DISORDERS OF THE FEMALE REPRODUCTIVE SYSTEM,2,Moderate,Minor,Medical,Medicaid,,,,,Y,26245.08,4855.67
Long Island,Nassau,2908000,000511,NYU Langone Hospital-Long Island,50 to 69,113,F,Other Race,Not Span/Hispanic,1,Emergency,Home or Self Care,2020,NEO073,BENIGN NEOPLASMS,,,532,MENSTRUAL & OTHER FEMALE REPRODUCTIVE SYSTEM DISORDERS,13,DISEASES AND DISORDERS OF THE FEMALE REPRODUCTIVE SYSTEM,2,Moderate,Minor,Medical,Blue Cross/Blue Shield,,,,,Y,31855.54,7404.48
Long Island,Nassau,2908000,000511,NYU Langone Hospital-Long Island,18 to 29,117,F,Black/African American,Not Span/Hispanic,1,Emergency,Home or Self Care,2020,GEN022,BENIGN OVARIAN CYST,OTR004,ISOLATION PROCEDURES,532,MENSTRUAL & OTHER FEMALE REPRODUCTIVE SYSTEM DISORDERS,13,DISEASES AND DISORDERS OF THE FEMALE REPRODUCTIVE SYSTEM,3,Major,Moderate,Medical,Private Health Insurance,,,,,Y,31747.04,5928.22
Long Island,Nassau,2908000,000511,NYU Langone Hospital-Long Island,18 to 29,OOS,F,Black/African American,Not Span/Hispanic,1,Emergency,Home or Self Care,2020,GEN022,BENIGN OVARIAN CYST,,,532,MENSTRUAL & OTHER FEMALE REPRODUCTIVE SYSTEM DISORDERS,13,DISEASES AND DISORDERS OF THE FEMALE REPRODUCTIVE SYSTEM,1,Minor,Minor,Medical,Blue Cross/Blue Shield,,,,,Y,36157.9,6390.97
Long Island,Nassau,2908000,000511,NYU Langone Hospital-Long Island,0 to 17,117,F,White,Not Span/Hispanic,2,Emergency,Home or Self Care,2020,GEN019,ENDOMETRIOSIS,,,532,MENSTRUAL & OTHER FEMALE REPRODUCTIVE SYSTEM DISORDERS,13,DISEASES AND DISORDERS OF THE FEMALE REPRODUCTIVE SYSTEM,1,Minor,Minor,Medical,Private Health Insurance,Blue Cross/Blue Shield,,,,Y,29186.6,7358.89
Long Island,Nassau,2908000,000511,NYU Langone Hospital-Long Island,30 to 49,115,F,Other Race,Spanish/Hispanic,5,Emergency,Home or Self Care,2020,NEO073,BENIGN NEOPLASMS,ADM002,TRANSFUSION OF PLASMA,532,MENSTRUAL & OTHER FEMALE REPRODUCTIVE SYSTEM DISORDERS,13,DISEASES AND DISORDERS OF THE FEMALE REPRODUCTIVE SYSTEM,2,Moderate,Minor,Medical,Private Health Insurance,,,,,Y,83458.04,17715.01
Long Island,Nassau,2908000,000511,NYU Langone Hospital-Long Island,70 or Older,117,F,White,Not Span/Hispanic,1,Emergency,Home or Self Care,2020,GEN020,PROLAPSE OF FEMALE GENITAL ORGANS,,,532,MENSTRUAL & OTHER FEMALE REPRODUCTIVE SYSTEM DISORDERS,13,DISEASES AND DISORDERS OF THE FEMALE REPRODUCTIVE SYSTEM,2,Moderate,Moderate,Medical,Medicare,,,,,Y,21806.99,4684.4
Long Island,Nassau,2908000,000511,NYU Langone Hospital-Long Island,0 to 17,115,F,Black/African American,Not Span/Hispanic,2,Emergency,Home or Self Care,2020,GEN021,MENSTRUAL DISORDERS,ADM001,TRANSFUSION OF BLOOD AND BLOOD PRODUCTS,532,MENSTRUAL & OTHER FEMALE REPRODUCTIVE SYSTEM DISORDERS,13,DISEASES AND DISORDERS OF THE FEMALE REPRODUCTIVE SYSTEM,2,Moderate,Minor,Medical,Medicaid,,,,,Y,39873.12,8166.65
Long Island,Nassau,2908000,000511,NYU Langone Hospital-Long Island,18 to 29,115,F,White,Not Span/Hispanic,1,Emergency,Home or Self Care,2020,GEN022,BENIGN OVARIAN CYST,OTR004,ISOLATION PROCEDURES,532,MENSTRUAL & OTHER FEMALE REPRODUCTIVE SYSTEM DISORDERS,13,DISEASES AND DISORDERS OF THE FEMALE REPRODUCTIVE SYSTEM,1,Minor,Minor,Medical,Blue Cross/Blue Shield,,,,,Y,35246.45,6155.68
Long Island,Nassau,2908000,000511,NYU Langone Hospital-Long Island,50 to 69,115,F,Black/African American,Not Span/Hispanic,7,Emergency,Home w/ Home Health Services,2020,NEO073,BENIGN NEOPLASMS,,,532,MENSTRUAL & OTHER FEMALE REPRODUCTIVE SYSTEM DISORDERS,13,DISEASES AND DISORDERS OF THE FEMALE REPRODUCTIVE SYSTEM,2,Moderate,Minor,Medical,Medicare,,,,,Y,109518,36491.67
