Hospital Service Area,Hospital County,Operating Certificate Number,Permanent Facility Id,Facility Name,Age Group,Zip Code - 3 digits,Gender,Race,Ethnicity,Length of Stay,Type of Admission,Patient Disposition,Discharge Year,CCS Diagnosis Code,CCS Diagnosis Description,CCS Procedure Code,CCS Procedure Description,APR DRG Code,APR DRG Description,APR MDC Code,APR MDC Description,APR Severity of Illness Code,APR Severity of Illness Description,APR Risk of Mortality,APR Medical Surgical Description,Payment Typology 1,Payment Typology 2,Payment Typology 3,Birth Weight,Abortion Edit Indicator,Emergency Department Indicator,Total Charges,Total Costs
Long Island,Nassau,2908000,000511,NYU Winthrop Hospital,50 to 69,115,F,White,Not Span/Hispanic,2,Emergency,Home or Self Care,2017,084,Headache; including migraine,000,NO PROC,054,Migraine & other headaches,01,Diseases and Disorders of the Nervous System,1,Minor,Minor,Medical,Private Health Insurance,,,,N,Y,77433.96,12506.28
Long Island,Nassau,2908000,000511,NYU Winthrop Hospital,50 to 69,110,M,White,Not Span/Hispanic,1,Emergency,Home or Self Care,2017,084,Headache; including migraine,000,NO PROC,054,Migraine & other headaches,01,Diseases and Disorders of the Nervous System,2,Moderate,Moderate,Medical,Medicaid,Medicaid,,,N,Y,34928.89,6382.66
Long Island,Nassau,2908000,000511,NYU Winthrop Hospital,30 to 49,114,F,Black/African American,Not Span/Hispanic,2,Emergency,Home or Self Care,2017,084,Headache; including migraine,000,NO PROC,054,Migraine & other headaches,01,Diseases and Disorders of the Nervous System,1,Minor,Minor,Medical,Blue Cross/Blue Shield,,,,N,Y,51571.85,6494.31
Long Island,Nassau,2908000,000511,NYU Winthrop Hospital,18 to 29,117,F,White,Not Span/Hispanic,2,Emergency,Home or Self Care,2017,084,Headache; including migraine,000,NO PROC,054,Migraine & other headaches,01,Diseases and Disorders of the Nervous System,1,Minor,Minor,Medical,Private Health Insurance,,,,N,Y,35963.12,4952.87
Long Island,Nassau,2908000,000511,NYU Winthrop Hospital,30 to 49,117,F,Other Race,Spanish/Hispanic,5,Emergency,Home or Self Care,2017,084,Headache; including migraine,000,NO PROC,054,Migraine & other headaches,01,Diseases and Disorders of the Nervous System,3,Major,Major,Medical,Private Health Insurance,,,,N,Y,76509.25,10497.66
Long Island,Nassau,2908000,000511,NYU Winthrop Hospital,18 to 29,115,M,White,Not Span/Hispanic,1,Emergency,Home or Self Care,2017,084,Headache; including migraine,000,NO PROC,054,Migraine & other headaches,01,Diseases and Disorders of the Nervous System,2,Moderate,Minor,Medical,Private Health Insurance,,,,N,Y,42622.68,7293.34
Long Island,Nassau,2908000,000511,NYU Winthrop Hospital,30 to 49,115,M,White,Not Span/Hispanic,1,Emergency,Home or Self Care,2017,238,Complications of surgical procedures or medical care,000,NO PROC,054,Migraine & other headaches,01,Diseases and Disorders of the Nervous System,1,Minor,Minor,Medical,Blue Cross/Blue Shield,,,,N,Y,15684.19,2795.25
Long Island,Nassau,2908000,000511,NYU Winthrop Hospital,50 to 69,115,F,White,Not Span/Hispanic,3,Emergency,Home or Self Care,2017,084,Headache; including migraine,000,NO PROC,054,Migraine & other headaches,01,Diseases and Disorders of the Nervous System,1,Minor,Minor,Medical,Private Health Insurance,,,,N,Y,29997.76,6015.16
Long Island,Nassau,2908000,000511,NYU Winthrop Hospital,30 to 49,114,M,Black/African American,Not Span/Hispanic,2,Emergency,Home or Self Care,2017,084,Headache; including migraine,000,NO PROC,054,Migraine & other headaches,01,Diseases and Disorders of the Nervous System,1,Minor,Minor,Medical,Blue Cross/Blue Shield,,,,N,Y,40174.15,6772.72
Long Island,Nassau,2908000,000511,NYU Winthrop Hospital,50 to 69,113,F,White,Not Span/Hispanic,1,Emergency,Home or Self Care,2017,084,Headache; including migraine,000,NO PROC,054,Migraine & other headaches,01,Diseases and Disorders of the Nervous System,2,Moderate,Minor,Medical,Blue Cross/Blue Shield,,,,N,Y,43884.14,5200.87
Long Island,Nassau,2908000,000511,NYU Winthrop Hospital,50 to 69,115,M,Black/African American,Not Span/Hispanic,2,Emergency,Home w/ Home Health Services,2017,084,Headache; including migraine,193,DX ULTRASOUND HEART,054,Migraine & other headaches,01,Diseases and Disorders of the Nervous System,2,Moderate,Moderate,Medical,Medicaid,Medicaid,,,N,Y,56388.18,8190.33
Long Island,Nassau,2908000,000511,NYU Winthrop Hospital,50 to 69,117,F,White,Not Span/Hispanic,1,Emergency,Home or Self Care,2017,084,Headache; including migraine,000,NO PROC,054,Migraine & other headaches,01,Diseases and Disorders of the Nervous System,1,Minor,Minor,Medical,Federal/State/Local/VA,,,,N,Y,23657.70,3099.47
Long Island,Nassau,2908000,000511,NYU Winthrop Hospital,50 to 69,112,F,White,Not Span/Hispanic,3,Emergency,Home w/ Home Health Services,2017,084,Headache; including migraine,000,NO PROC,054,Migraine & other headaches,01,Diseases and Disorders of the Nervous System,2,Moderate,Minor,Medical,Blue Cross/Blue Shield,,,,N,Y,36717.94,6002.71
Long Island,Nassau,2908000,000511,NYU Winthrop Hospital,50 to 69,115,F,White,Not Span/Hispanic,1,Emergency,Home or Self Care,2017,084,Headache; including migraine,000,NO PROC,054,Migraine & other headaches,01,Diseases and Disorders of the Nervous System,1,Minor,Minor,Medical,Private Health Insurance,Medicare,,,N,N,3338.00,1015.24
Long Island,Nassau,2908000,000511,NYU Winthrop Hospital,18 to 29,117,F,White,Not Span/Hispanic,4,Emergency,Home or Self Care,2017,084,Headache; including migraine,000,NO PROC,054,Migraine & other headaches,01,Diseases and Disorders of the Nervous System,1,Minor,Minor,Medical,Federal/State/Local/VA,,,,N,Y,27839.42,6678.22
Long Island,Nassau,2908000,000511,NYU Winthrop Hospital,30 to 49,117,F,White,Not Span/Hispanic,2,Emergency,Home or Self Care,2017,084,Headache; including migraine,000,NO PROC,054,Migraine & other headaches,01,Diseases and Disorders of the Nervous System,1,Minor,Minor,Medical,Private Health Insurance,,,,N,Y,51683.10,7464.01
Long Island,Nassau,2908000,000511,NYU Winthrop Hospital,30 to 49,115,F,White,Spanish/Hispanic,6,Emergency,Home or Self Care,2017,084,Headache; including migraine,004,DIAGNOSTIC SPINAL TAP,054,Migraine & other headaches,01,Diseases and Disorders of the Nervous System,2,Moderate,Minor,Medical,Medicaid,,,,N,Y,137639.66,28508.10
Long Island,Nassau,2908000,000511,NYU Winthrop Hospital,50 to 69,118,M,White,Not Span/Hispanic,4,Emergency,Home or Self Care,2017,084,Headache; including migraine,000,NO PROC,054,Migraine & other headaches,01,Diseases and Disorders of the Nervous System,2,Moderate,Minor,Medical,Medicare,Medicare,,,N,Y,78500.88,15752.92
Long Island,Nassau,2908000,000511,NYU Winthrop Hospital,50 to 69,115,F,White,Not Span/Hispanic,1,Emergency,Home or Self Care,2017,084,Headache; including migraine,000,NO PROC,054,Migraine & other headaches,01,Diseases and Disorders of the Nervous System,2,Moderate,Minor,Medical,Federal/State/Local/VA,,,,N,N,3338.00,1015.24
Long Island,Nassau,2908000,000511,NYU Winthrop Hospital,30 to 49,110,F,White,Not Span/Hispanic,1,Emergency,Home or Self Care,2017,084,Headache; including migraine,008,OT NON-OR THER NERV SYS,054,Migraine & other headaches,01,Diseases and Disorders of the Nervous System,2,Moderate,Minor,Medical,Medicare,Medicare,,,N,Y,46837.40,10441.09
Long Island,Nassau,2908000,000511,NYU Winthrop Hospital,70 or Older,115,F,White,Not Span/Hispanic,2,Emergency,Home or Self Care,2017,084,Headache; including migraine,201,CARDIAC STRESS TESTS,054,Migraine & other headaches,01,Diseases and Disorders of the Nervous System,2,Moderate,Minor,Medical,Medicare,Medicare,,,N,Y,60955.93,10928.02
Long Island,Nassau,2908000,000511,NYU Winthrop Hospital,0 to 17,115,M,White,Not Span/Hispanic,3,Emergency,Home or Self Care,2017,084,Headache; including migraine,070,UP GASTRO ENDOSC/BIOPSY,054,Migraine & other headaches,01,Diseases and Disorders of the Nervous System,1,Minor,Minor,Medical,Private Health Insurance,,,,N,Y,34123.49,7094.20
Long Island,Nassau,2908000,000511,NYU Winthrop Hospital,50 to 69,OOS,F,White,Not Span/Hispanic,3,Emergency,Home or Self Care,2017,084,Headache; including migraine,000,NO PROC,054,Migraine & other headaches,01,Diseases and Disorders of the Nervous System,1,Minor,Minor,Medical,Blue Cross/Blue Shield,Medicare,,,N,Y,24465.02,5025.76
Long Island,Nassau,2908000,000511,NYU Winthrop Hospital,50 to 69,117,F,White,Not Span/Hispanic,2,Emergency,Home or Self Care,2017,084,Headache; including migraine,004,DIAGNOSTIC SPINAL TAP,054,Migraine & other headaches,01,Diseases and Disorders of the Nervous System,1,Minor,Minor,Medical,Private Health Insurance,,,,N,Y,68624.28,7585.84
Long Island,Nassau,2908000,000511,NYU Winthrop Hospital,50 to 69,113,M,Other Race,Not Span/Hispanic,1,Emergency,Home or Self Care,2017,084,Headache; including migraine,000,NO PROC,054,Migraine & other headaches,01,Diseases and Disorders of the Nervous System,1,Minor,Minor,Medical,Miscellaneous/Other,Medicaid,Medicaid,,N,Y,19091.11,3070.39
Long Island,Nassau,2908000,000511,NYU Winthrop Hospital,50 to 69,115,F,White,Not Span/Hispanic,1,Emergency,Home or Self Care,2017,084,Headache; including migraine,000,NO PROC,054,Migraine & other headaches,01,Diseases and Disorders of the Nervous System,1,Minor,Minor,Medical,Private Health Insurance,,,,N,Y,35789.12,3800.78
Long Island,Nassau,2908000,000511,NYU Winthrop Hospital,30 to 49,115,F,Black/African American,Not Span/Hispanic,8,Emergency,Home or Self Care,2017,084,Headache; including migraine,004,DIAGNOSTIC SPINAL TAP,054,Migraine & other headaches,01,Diseases and Disorders of the Nervous System,1,Minor,Minor,Medical,Blue Cross/Blue Shield,,,,N,Y,157544.64,32265.78
Long Island,Nassau,2908000,000511,NYU Winthrop Hospital,50 to 69,OOS,M,Black/African American,Not Span/Hispanic,2,Emergency,Home or Self Care,2017,084,Headache; including migraine,000,NO PROC,054,Migraine & other headaches,01,Diseases and Disorders of the Nervous System,1,Minor,Minor,Medical,Federal/State/Local/VA,,,,N,Y,42658.67,8780.50
Long Island,Nassau,2908000,000511,NYU Winthrop Hospital,50 to 69,115,F,White,Spanish/Hispanic,1,Emergency,Home or Self Care,2017,084,Headache; including migraine,000,NO PROC,054,Migraine & other headaches,01,Diseases and Disorders of the Nervous System,1,Minor,Minor,Medical,Federal/State/Local/VA,,,,N,Y,31596.50,4311.85
Long Island,Nassau,2908000,000511,NYU Winthrop Hospital,18 to 29,117,M,White,Not Span/Hispanic,1,Emergency,Home or Self Care,2017,084,Headache; including migraine,000,NO PROC,054,Migraine & other headaches,01,Diseases and Disorders of the Nervous System,1,Minor,Minor,Medical,Private Health Insurance,,,,N,N,3338.00,1015.24
Long Island,Nassau,2908000,000511,NYU Winthrop Hospital,50 to 69,117,F,White,Not Span/Hispanic,2,Emergency,Home or Self Care,2017,084,Headache; including migraine,193,DX ULTRASOUND HEART,054,Migraine & other headaches,01,Diseases and Disorders of the Nervous System,2,Moderate,Minor,Medical,Blue Cross/Blue Shield,Blue Cross/Blue Shield,,,N,N,6676.00,2030.48
Long Island,Nassau,2908000,000511,NYU Winthrop Hospital,50 to 69,115,F,Black/African American,Not Span/Hispanic,1,Urgent,Home or Self Care,2017,084,Headache; including migraine,000,NO PROC,054,Migraine & other headaches,01,Diseases and Disorders of the Nervous System,1,Minor,Minor,Medical,Medicare,Medicare,Medicaid,,N,Y,54392.17,8028.25
Long Island,Nassau,2908000,000511,NYU Winthrop Hospital,30 to 49,110,F,White,Not Span/Hispanic,3,Emergency,Home or Self Care,2017,084,Headache; including migraine,000,NO PROC,054,Migraine & other headaches,01,Diseases and Disorders of the Nervous System,2,Moderate,Minor,Medical,Medicaid,,,,N,Y,75589.70,12877.88
Long Island,Nassau,2908000,000511,NYU Winthrop Hospital,50 to 69,115,F,White,Not Span/Hispanic,1,Emergency,Home or Self Care,2017,653,"Delirium, dementia, and amnestic and other cognitive disorders",000,NO PROC,054,Migraine & other headaches,01,Diseases and Disorders of the Nervous System,1,Minor,Minor,Medical,Private Health Insurance,,,,N,Y,40349.71,4850.54
Long Island,Nassau,2908000,000511,NYU Winthrop Hospital,0 to 17,115,M,Other Race,Spanish/Hispanic,1,Emergency,Home or Self Care,2017,653,"Delirium, dementia, and amnestic and other cognitive disorders",000,NO PROC,054,Migraine & other headaches,01,Diseases and Disorders of the Nervous System,2,Moderate,Minor,Medical,Private Health Insurance,,,,N,Y,28958.58,3624.45
Long Island,Nassau,2908000,000511,NYU Winthrop Hospital,50 to 69,110,F,White,Not Span/Hispanic,1,Emergency,Home or Self Care,2017,084,Headache; including migraine,188,CEREBRAL ARTERIOGRAM,054,Migraine & other headaches,01,Diseases and Disorders of the Nervous System,1,Minor,Minor,Medical,Private Health Insurance,,,,N,Y,58949.73,10877.90
Long Island,Nassau,2908000,000511,NYU Winthrop Hospital,18 to 29,115,F,Other Race,Not Span/Hispanic,4,Emergency,Home or Self Care,2017,084,Headache; including migraine,000,NO PROC,054,Migraine & other headaches,01,Diseases and Disorders of the Nervous System,2,Moderate,Minor,Medical,Private Health Insurance,,,,N,Y,51413.64,10372.14
Long Island,Nassau,2908000,000511,NYU Winthrop Hospital,50 to 69,115,F,White,Not Span/Hispanic,6,Emergency,Home or Self Care,2017,084,Headache; including migraine,000,NO PROC,054,Migraine & other headaches,01,Diseases and Disorders of the Nervous System,1,Minor,Minor,Medical,Federal/State/Local/VA,,,,N,Y,50227.81,10333.11
Long Island,Nassau,2908000,000511,NYU Winthrop Hospital,70 or Older,115,F,White,Not Span/Hispanic,1,Emergency,Home or Self Care,2017,084,Headache; including migraine,000,NO PROC,054,Migraine & other headaches,01,Diseases and Disorders of the Nervous System,2,Moderate,Moderate,Medical,Medicare,Medicare,Private Health Insurance,,N,Y,58546.72,10975.26
Long Island,Nassau,2908000,000511,NYU Winthrop Hospital,30 to 49,100,M,White,Not Span/Hispanic,7,Emergency,Home or Self Care,2017,653,"Delirium, dementia, and amnestic and other cognitive disorders",199,ELECTROENCEPHALOGRAM,054,Migraine & other headaches,01,Diseases and Disorders of the Nervous System,3,Major,Minor,Medical,Medicaid,Medicaid,,,N,Y,96928.00,23961.41
Long Island,Nassau,2908000,000511,NYU Winthrop Hospital,30 to 49,115,F,Black/African American,Not Span/Hispanic,1,Emergency,Home or Self Care,2017,084,Headache; including migraine,004,DIAGNOSTIC SPINAL TAP,054,Migraine & other headaches,01,Diseases and Disorders of the Nervous System,1,Minor,Minor,Medical,Private Health Insurance,,,,N,Y,53900.29,9301.66
Long Island,Nassau,2908000,000511,NYU Winthrop Hospital,18 to 29,117,M,White,Not Span/Hispanic,1,Emergency,Home or Self Care,2017,084,Headache; including migraine,004,DIAGNOSTIC SPINAL TAP,054,Migraine & other headaches,01,Diseases and Disorders of the Nervous System,1,Minor,Minor,Medical,Blue Cross/Blue Shield,,,,N,Y,41805.47,5673.74
Long Island,Nassau,2908000,000511,NYU Winthrop Hospital,30 to 49,117,F,White,Not Span/Hispanic,2,Emergency,Home or Self Care,2017,084,Headache; including migraine,000,NO PROC,054,Migraine & other headaches,01,Diseases and Disorders of the Nervous System,2,Moderate,Minor,Medical,Private Health Insurance,,,,N,Y,70116.89,8229.32
Long Island,Nassau,2908000,000511,NYU Winthrop Hospital,0 to 17,115,F,White,Not Span/Hispanic,1,Urgent,Home or Self Care,2017,084,Headache; including migraine,199,ELECTROENCEPHALOGRAM,054,Migraine & other headaches,01,Diseases and Disorders of the Nervous System,1,Minor,Minor,Medical,Private Health Insurance,Medicaid,,,N,N,28392.00,4105.69
Long Island,Nassau,2908000,000511,NYU Winthrop Hospital,30 to 49,115,M,White,Spanish/Hispanic,2,Emergency,Home or Self Care,2017,084,Headache; including migraine,004,DIAGNOSTIC SPINAL TAP,054,Migraine & other headaches,01,Diseases and Disorders of the Nervous System,2,Moderate,Minor,Medical,Private Health Insurance,,,,N,Y,47997.53,6128.22
Long Island,Nassau,2908000,000511,NYU Winthrop Hospital,18 to 29,117,F,White,Not Span/Hispanic,24,Emergency,Home or Self Care,2017,084,Headache; including migraine,070,UP GASTRO ENDOSC/BIOPSY,054,Migraine & other headaches,01,Diseases and Disorders of the Nervous System,3,Major,Moderate,Medical,Private Health Insurance,,,,N,Y,150967.97,34347.17
Long Island,Nassau,2908000,000511,NYU Winthrop Hospital,30 to 49,118,F,Black/African American,Not Span/Hispanic,1,Emergency,Home or Self Care,2017,084,Headache; including migraine,004,DIAGNOSTIC SPINAL TAP,054,Migraine & other headaches,01,Diseases and Disorders of the Nervous System,1,Minor,Minor,Medical,Private Health Insurance,,,,N,Y,67808.04,11083.56
Long Island,Nassau,2908000,000511,NYU Winthrop Hospital,30 to 49,117,M,Black/African American,Not Span/Hispanic,2,Emergency,Left Against Medical Advice,2017,084,Headache; including migraine,070,UP GASTRO ENDOSC/BIOPSY,054,Migraine & other headaches,01,Diseases and Disorders of the Nervous System,2,Moderate,Moderate,Medical,Medicaid,Medicaid,,,N,Y,44765.43,7513.64
Long Island,Nassau,2908000,000511,NYU Winthrop Hospital,70 or Older,115,M,White,Not Span/Hispanic,1,Emergency,Left Against Medical Advice,2017,084,Headache; including migraine,000,NO PROC,054,Migraine & other headaches,01,Diseases and Disorders of the Nervous System,3,Major,Moderate,Medical,Blue Cross/Blue Shield,Private Health Insurance,Medicare,,N,Y,14024.01,2449.77
Long Island,Nassau,2908000,000511,NYU Winthrop Hospital,50 to 69,117,F,White,Not Span/Hispanic,2,Emergency,Home or Self Care,2017,084,Headache; including migraine,198,MAG RESONANCE IMAGING,054,Migraine & other headaches,01,Diseases and Disorders of the Nervous System,1,Minor,Minor,Medical,Medicare,Private Health Insurance,,,N,Y,78471.49,11140.61
Long Island,Nassau,2908000,000511,NYU Winthrop Hospital,50 to 69,OOS,M,White,Not Span/Hispanic,2,Emergency,Home or Self Care,2017,084,Headache; including migraine,004,DIAGNOSTIC SPINAL TAP,054,Migraine & other headaches,01,Diseases and Disorders of the Nervous System,2,Moderate,Minor,Medical,Blue Cross/Blue Shield,,,,N,Y,52137.57,11486.55
Long Island,Nassau,2908000,000511,NYU Winthrop Hospital,30 to 49,115,M,White,Not Span/Hispanic,2,Emergency,Home or Self Care,2017,084,Headache; including migraine,000,NO PROC,054,Migraine & other headaches,01,Diseases and Disorders of the Nervous System,1,Minor,Minor,Medical,Medicaid,Medicaid,,,N,Y,32189.22,6527.64
Long Island,Nassau,2908000,000511,NYU Winthrop Hospital,0 to 17,117,M,White,Not Span/Hispanic,2,Emergency,Home or Self Care,2017,084,Headache; including migraine,198,MAG RESONANCE IMAGING,054,Migraine & other headaches,01,Diseases and Disorders of the Nervous System,1,Minor,Minor,Medical,Blue Cross/Blue Shield,,,,N,Y,32143.31,4828.91
Long Island,Nassau,2908000,000511,NYU Winthrop Hospital,30 to 49,115,M,White,Spanish/Hispanic,5,Emergency,Home w/ Home Health Services,2017,084,Headache; including migraine,000,NO PROC,054,Migraine & other headaches,01,Diseases and Disorders of the Nervous System,2,Moderate,Moderate,Medical,Private Health Insurance,,,,N,Y,75947.98,13473.23
Long Island,Nassau,2908000,000511,NYU Winthrop Hospital,70 or Older,115,F,Black/African American,Not Span/Hispanic,6,Emergency,Home or Self Care,2017,084,Headache; including migraine,062,OT DX CARDIOVASC PRCS,054,Migraine & other headaches,01,Diseases and Disorders of the Nervous System,2,Moderate,Moderate,Medical,Medicare,Medicare,,,N,Y,102872.93,21167.01
Long Island,Nassau,2908000,000511,NYU Winthrop Hospital,50 to 69,117,F,Other Race,Spanish/Hispanic,1,Emergency,Home or Self Care,2017,084,Headache; including migraine,203,ELECTROGR CARDIAC MONIT,054,Migraine & other headaches,01,Diseases and Disorders of the Nervous System,2,Moderate,Minor,Medical,Blue Cross/Blue Shield,,,,N,Y,40364.06,5496.51
Long Island,Nassau,2908000,000511,NYU Winthrop Hospital,0 to 17,110,M,White,Not Span/Hispanic,2,Emergency,Home or Self Care,2017,084,Headache; including migraine,004,DIAGNOSTIC SPINAL TAP,054,Migraine & other headaches,01,Diseases and Disorders of the Nervous System,3,Major,Minor,Medical,Private Health Insurance,,,,N,Y,48882.84,6626.97
Long Island,Nassau,2908000,000511,NYU Winthrop Hospital,18 to 29,117,F,White,Spanish/Hispanic,9,Emergency,Home w/ Home Health Services,2017,084,Headache; including migraine,199,ELECTROENCEPHALOGRAM,054,Migraine & other headaches,01,Diseases and Disorders of the Nervous System,2,Moderate,Minor,Medical,Medicaid,Medicaid,,,N,Y,174982.80,24998.65
Long Island,Nassau,2908000,000511,NYU Winthrop Hospital,30 to 49,115,F,Black/African American,Not Span/Hispanic,3,Emergency,Home or Self Care,2017,084,Headache; including migraine,004,DIAGNOSTIC SPINAL TAP,054,Migraine & other headaches,01,Diseases and Disorders of the Nervous System,2,Moderate,Minor,Medical,Private Health Insurance,,,,N,Y,62158.46,9008.29
Long Island,Nassau,2908000,000511,NYU Winthrop Hospital,0 to 17,117,F,White,Not Span/Hispanic,5,Emergency,Home or Self Care,2017,084,Headache; including migraine,000,NO PROC,054,Migraine & other headaches,01,Diseases and Disorders of the Nervous System,2,Moderate,Minor,Medical,Private Health Insurance,,,,N,Y,32053.50,8212.93
Long Island,Nassau,2908000,000511,NYU Winthrop Hospital,30 to 49,118,M,White,Not Span/Hispanic,2,Emergency,Home or Self Care,2017,084,Headache; including migraine,004,DIAGNOSTIC SPINAL TAP,054,Migraine & other headaches,01,Diseases and Disorders of the Nervous System,1,Minor,Minor,Medical,Private Health Insurance,,,,N,Y,51983.55,10397.81
Long Island,Nassau,2908000,000511,NYU Winthrop Hospital,30 to 49,114,M,Black/African American,Not Span/Hispanic,1,Emergency,Home or Self Care,2017,084,Headache; including migraine,025,DX PRCS ON EAR,054,Migraine & other headaches,01,Diseases and Disorders of the Nervous System,1,Minor,Minor,Medical,Blue Cross/Blue Shield,,,,N,Y,16163.70,2948.25
Long Island,Nassau,2908000,000511,NYU Winthrop Hospital,50 to 69,115,M,Black/African American,Not Span/Hispanic,3,Emergency,Home w/ Home Health Services,2017,084,Headache; including migraine,000,NO PROC,054,Migraine & other headaches,01,Diseases and Disorders of the Nervous System,2,Moderate,Moderate,Medical,Medicaid,Medicaid,,,N,Y,59116.05,9123.79
Long Island,Nassau,2908000,000511,NYU Winthrop Hospital,30 to 49,115,F,White,Spanish/Hispanic,5,Emergency,Home or Self Care,2017,084,Headache; including migraine,000,NO PROC,054,Migraine & other headaches,01,Diseases and Disorders of the Nervous System,1,Minor,Minor,Medical,Medicaid,Medicaid,,,N,Y,111324.34,21157.53
Long Island,Nassau,2908000,000511,NYU Winthrop Hospital,30 to 49,115,F,Black/African American,Not Span/Hispanic,1,Emergency,Left Against Medical Advice,2017,084,Headache; including migraine,000,NO PROC,054,Migraine & other headaches,01,Diseases and Disorders of the Nervous System,1,Minor,Minor,Medical,Private Health Insurance,,,,N,Y,23671.18,3854.44
Long Island,Nassau,2908000,000511,NYU Winthrop Hospital,30 to 49,115,M,White,Spanish/Hispanic,2,Emergency,Home or Self Care,2017,084,Headache; including migraine,004,DIAGNOSTIC SPINAL TAP,054,Migraine & other headaches,01,Diseases and Disorders of the Nervous System,2,Moderate,Minor,Medical,Medicaid,,,,N,Y,83455.36,14022.39
Long Island,Nassau,2908000,000511,NYU Winthrop Hospital,30 to 49,115,F,White,Not Span/Hispanic,3,Emergency,Home or Self Care,2017,084,Headache; including migraine,000,NO PROC,054,Migraine & other headaches,01,Diseases and Disorders of the Nervous System,1,Minor,Minor,Medical,Private Health Insurance,,,,N,Y,51852.21,12510.81
Long Island,Nassau,2908000,000511,NYU Winthrop Hospital,50 to 69,115,F,Black/African American,Not Span/Hispanic,5,Emergency,Home w/ Home Health Services,2017,238,Complications of surgical procedures or medical care,005,INS CATHETER/SPNL STIM,054,Migraine & other headaches,01,Diseases and Disorders of the Nervous System,3,Major,Moderate,Medical,Medicaid,,,,N,Y,77771.80,16049.10