Hospital Service Area,Hospital County,Operating Certificate Number,Permanent Facility Id,Facility Name,Age Group,Zip Code - 3 digits,Gender,Race,Ethnicity,Length of Stay,Type of Admission,Patient Disposition,Discharge Year,CCS Diagnosis Code,CCS Diagnosis Description,CCS Procedure Code,CCS Procedure Description,APR DRG Code,APR DRG Description,APR MDC Code,APR MDC Description,APR Severity of Illness Code,APR Severity of Illness Description,APR Risk of Mortality,APR Medical Surgical Description,Payment Typology 1,Payment Typology 2,Payment Typology 3,Birth Weight,Abortion Edit Indicator,Emergency Department Indicator,Total Charges,Total Costs
Long Island,Suffolk,5123000,000885,Brookhaven Memorial Hospital Medical Center Inc,50 to 69,140,F,White,Not Span/Hispanic,3,Emergency,Home or Self Care,2017,653,"Delirium, dementia, and amnestic and other cognitive disorders",000,NO PROC,054,Migraine & other headaches,01,Diseases and Disorders of the Nervous System,2,Moderate,Minor,Medical,Medicare,,,,N,Y,47351.04,5528.40
Long Island,Suffolk,5123000,000885,Brookhaven Memorial Hospital Medical Center Inc,50 to 69,119,F,White,Not Span/Hispanic,4,Emergency,Home or Self Care,2017,084,Headache; including migraine,092,OTHER BOWEL DX PRCS,054,Migraine & other headaches,01,Diseases and Disorders of the Nervous System,2,Moderate,Minor,Medical,Private Health Insurance,,,,N,Y,52706.84,8574.24
Long Island,Suffolk,5123000,000885,Brookhaven Memorial Hospital Medical Center Inc,50 to 69,117,M,White,Not Span/Hispanic,2,Emergency,Skilled Nursing Home,2017,084,Headache; including migraine,000,NO PROC,054,Migraine & other headaches,01,Diseases and Disorders of the Nervous System,3,Major,Major,Medical,Medicare,Medicare,Medicaid,,N,Y,40558.94,4982.35
Long Island,Suffolk,5123000,000885,Brookhaven Memorial Hospital Medical Center Inc,30 to 49,119,F,White,Not Span/Hispanic,1,Emergency,Left Against Medical Advice,2017,084,Headache; including migraine,004,DIAGNOSTIC SPINAL TAP,054,Migraine & other headaches,01,Diseases and Disorders of the Nervous System,1,Minor,Minor,Medical,Blue Cross/Blue Shield,,,,N,Y,15130.75,1958.11
Long Island,Suffolk,5123000,000885,Brookhaven Memorial Hospital Medical Center Inc,18 to 29,117,F,White,Not Span/Hispanic,1,Emergency,Home or Self Care,2017,084,Headache; including migraine,000,NO PROC,054,Migraine & other headaches,01,Diseases and Disorders of the Nervous System,2,Moderate,Minor,Medical,Private Health Insurance,,,,N,Y,9105.49,1639.82
Long Island,Suffolk,5123000,000885,Brookhaven Memorial Hospital Medical Center Inc,30 to 49,119,F,Other Race,Not Span/Hispanic,1,Emergency,Left Against Medical Advice,2017,084,Headache; including migraine,000,NO PROC,054,Migraine & other headaches,01,Diseases and Disorders of the Nervous System,2,Moderate,Minor,Medical,Private Health Insurance,,,,N,Y,8930.00,1673.47
Long Island,Suffolk,5123000,000885,Brookhaven Memorial Hospital Medical Center Inc,50 to 69,119,F,White,Not Span/Hispanic,6,Emergency,Home or Self Care,2017,084,Headache; including migraine,000,NO PROC,054,Migraine & other headaches,01,Diseases and Disorders of the Nervous System,2,Moderate,Minor,Medical,Private Health Insurance,,,,N,Y,49225.93,8543.48
Long Island,Suffolk,5123000,000885,Brookhaven Memorial Hospital Medical Center Inc,18 to 29,117,M,White,Not Span/Hispanic,1,Emergency,Left Against Medical Advice,2017,084,Headache; including migraine,000,NO PROC,054,Migraine & other headaches,01,Diseases and Disorders of the Nervous System,1,Minor,Minor,Medical,Self-Pay,,,,N,Y,10691.55,1861.20
Long Island,Suffolk,5123000,000885,Brookhaven Memorial Hospital Medical Center Inc,50 to 69,119,M,White,Not Span/Hispanic,1,Emergency,Home or Self Care,2017,653,"Delirium, dementia, and amnestic and other cognitive disorders",000,NO PROC,054,Migraine & other headaches,01,Diseases and Disorders of the Nervous System,2,Moderate,Moderate,Medical,Blue Cross/Blue Shield,,,,N,Y,35116.28,3778.44
Long Island,Suffolk,5123000,000885,Brookhaven Memorial Hospital Medical Center Inc,50 to 69,117,F,White,Not Span/Hispanic,1,Emergency,Home or Self Care,2017,084,Headache; including migraine,000,NO PROC,054,Migraine & other headaches,01,Diseases and Disorders of the Nervous System,2,Moderate,Minor,Medical,Medicare,Medicare,,,N,Y,25611.68,2663.00
Long Island,Suffolk,5123000,000885,Brookhaven Memorial Hospital Medical Center Inc,30 to 49,117,F,Black/African American,Not Span/Hispanic,1,Emergency,Left Against Medical Advice,2017,084,Headache; including migraine,000,NO PROC,054,Migraine & other headaches,01,Diseases and Disorders of the Nervous System,1,Minor,Minor,Medical,Private Health Insurance,,,,N,Y,7719.05,1551.76
Long Island,Suffolk,5123000,000885,Brookhaven Memorial Hospital Medical Center Inc,18 to 29,119,M,Black/African American,Not Span/Hispanic,5,Emergency,Home or Self Care,2017,084,Headache; including migraine,000,NO PROC,054,Migraine & other headaches,01,Diseases and Disorders of the Nervous System,2,Moderate,Minor,Medical,Self-Pay,,,,N,Y,38704.53,7226.10
Long Island,Suffolk,5123000,000885,Brookhaven Memorial Hospital Medical Center Inc,50 to 69,117,F,White,Not Span/Hispanic,1,Emergency,Home or Self Care,2017,084,Headache; including migraine,000,NO PROC,054,Migraine & other headaches,01,Diseases and Disorders of the Nervous System,1,Minor,Minor,Medical,Blue Cross/Blue Shield,Private Health Insurance,,,N,Y,8116.05,1555.57
Long Island,Suffolk,5123000,000885,Brookhaven Memorial Hospital Medical Center Inc,50 to 69,117,F,White,Not Span/Hispanic,2,Emergency,Home or Self Care,2017,084,Headache; including migraine,219,ALCO/DRUG REHAB/DETOX,054,Migraine & other headaches,01,Diseases and Disorders of the Nervous System,2,Moderate,Minor,Medical,Medicare,Medicare,Medicaid,,N,Y,13792.63,2829.19
Long Island,Suffolk,5123000,000885,Brookhaven Memorial Hospital Medical Center Inc,70 or Older,119,F,White,Not Span/Hispanic,3,Emergency,Skilled Nursing Home,2017,084,Headache; including migraine,000,NO PROC,054,Migraine & other headaches,01,Diseases and Disorders of the Nervous System,3,Major,Moderate,Medical,Medicare,Medicare,Private Health Insurance,,N,Y,70436.95,7759.91
Long Island,Suffolk,5123000,000885,Brookhaven Memorial Hospital Medical Center Inc,18 to 29,117,F,White,Not Span/Hispanic,1,Emergency,Home or Self Care,2017,084,Headache; including migraine,000,NO PROC,054,Migraine & other headaches,01,Diseases and Disorders of the Nervous System,2,Moderate,Moderate,Medical,Medicaid,,,,N,Y,11351.86,1940.22
Long Island,Suffolk,5123000,000885,Brookhaven Memorial Hospital Medical Center Inc,18 to 29,117,M,White,Not Span/Hispanic,1,Emergency,Home or Self Care,2017,084,Headache; including migraine,219,ALCO/DRUG REHAB/DETOX,054,Migraine & other headaches,01,Diseases and Disorders of the Nervous System,2,Moderate,Minor,Medical,Private Health Insurance,,,,N,Y,11243.73,2073.87
Long Island,Suffolk,5123000,000885,Brookhaven Memorial Hospital Medical Center Inc,70 or Older,117,F,White,Not Span/Hispanic,6,Emergency,Home w/ Home Health Services,2017,084,Headache; including migraine,000,NO PROC,054,Migraine & other headaches,01,Diseases and Disorders of the Nervous System,2,Moderate,Moderate,Medical,Medicare,Medicare,Blue Cross/Blue Shield,,N,Y,46330.27,8332.55
Long Island,Suffolk,5123000,000885,Brookhaven Memorial Hospital Medical Center Inc,50 to 69,117,F,White,Not Span/Hispanic,1,Emergency,Home or Self Care,2017,084,Headache; including migraine,219,ALCO/DRUG REHAB/DETOX,054,Migraine & other headaches,01,Diseases and Disorders of the Nervous System,2,Moderate,Minor,Medical,Medicare,Medicare,Medicaid,,N,Y,16400.24,2216.80
Long Island,Suffolk,5123000,000885,Brookhaven Memorial Hospital Medical Center Inc,50 to 69,119,F,White,Not Span/Hispanic,1,Emergency,Home or Self Care,2017,084,Headache; including migraine,000,NO PROC,054,Migraine & other headaches,01,Diseases and Disorders of the Nervous System,1,Minor,Minor,Medical,Blue Cross/Blue Shield,Medicare,,,N,Y,39880.90,4101.23
Long Island,Suffolk,5123000,000885,Brookhaven Memorial Hospital Medical Center Inc,30 to 49,117,F,White,Not Span/Hispanic,1,Emergency,Home or Self Care,2017,084,Headache; including migraine,219,ALCO/DRUG REHAB/DETOX,054,Migraine & other headaches,01,Diseases and Disorders of the Nervous System,1,Minor,Minor,Medical,Private Health Insurance,,,,N,Y,14566.54,2444.95
Long Island,Suffolk,5123000,000885,Brookhaven Memorial Hospital Medical Center Inc,30 to 49,119,F,White,Not Span/Hispanic,4,Emergency,Home or Self Care,2017,084,Headache; including migraine,070,UP GASTRO ENDOSC/BIOPSY,054,Migraine & other headaches,01,Diseases and Disorders of the Nervous System,1,Minor,Minor,Medical,Private Health Insurance,Medicaid,,,N,Y,44223.09,7682.70
Long Island,Suffolk,5123000,000885,Brookhaven Memorial Hospital Medical Center Inc,50 to 69,117,M,White,Not Span/Hispanic,1,Emergency,Home or Self Care,2017,084,Headache; including migraine,000,NO PROC,054,Migraine & other headaches,01,Diseases and Disorders of the Nervous System,1,Minor,Minor,Medical,Medicare,Medicare,Private Health Insurance,,N,Y,40317.26,2887.81
Long Island,Suffolk,5123000,000885,Brookhaven Memorial Hospital Medical Center Inc,30 to 49,119,F,White,Not Span/Hispanic,2,Emergency,Home or Self Care,2017,084,Headache; including migraine,198,MAG RESONANCE IMAGING,054,Migraine & other headaches,01,Diseases and Disorders of the Nervous System,2,Moderate,Minor,Medical,Private Health Insurance,,,,N,Y,55529.55,5918.12
Long Island,Suffolk,5123000,000885,Brookhaven Memorial Hospital Medical Center Inc,70 or Older,117,F,Black/African American,Not Span/Hispanic,2,Emergency,Home or Self Care,2017,084,Headache; including migraine,000,NO PROC,054,Migraine & other headaches,01,Diseases and Disorders of the Nervous System,2,Moderate,Moderate,Medical,Medicare,Medicare,Medicaid,,N,Y,42971.44,4986.09
Long Island,Suffolk,5123000,000885,Brookhaven Memorial Hospital Medical Center Inc,30 to 49,119,F,Other Race,Not Span/Hispanic,2,Emergency,Home or Self Care,2017,084,Headache; including migraine,000,NO PROC,054,Migraine & other headaches,01,Diseases and Disorders of the Nervous System,2,Moderate,Minor,Medical,Private Health Insurance,,,,N,Y,29664.68,4295.25
Long Island,Suffolk,5123000,000885,Brookhaven Memorial Hospital Medical Center Inc,18 to 29,117,M,White,Not Span/Hispanic,2,Emergency,Home or Self Care,2017,084,Headache; including migraine,000,NO PROC,054,Migraine & other headaches,01,Diseases and Disorders of the Nervous System,2,Moderate,Minor,Medical,Blue Cross/Blue Shield,,,,N,Y,19571.29,3029.46
Long Island,Suffolk,5123000,000885,Brookhaven Memorial Hospital Medical Center Inc,50 to 69,117,F,Other Race,Not Span/Hispanic,1,Emergency,Home or Self Care,2017,084,Headache; including migraine,000,NO PROC,054,Migraine & other headaches,01,Diseases and Disorders of the Nervous System,2,Moderate,Minor,Medical,Medicare,Medicare,Medicaid,,N,Y,20703.83,2192.92
Long Island,Suffolk,5123000,000885,Brookhaven Memorial Hospital Medical Center Inc,50 to 69,119,M,White,Not Span/Hispanic,1,Emergency,Home or Self Care,2017,084,Headache; including migraine,000,NO PROC,054,Migraine & other headaches,01,Diseases and Disorders of the Nervous System,2,Moderate,Moderate,Medical,Private Health Insurance,,,,N,Y,23870.54,2947.35
Long Island,Suffolk,5123000,000885,Brookhaven Memorial Hospital Medical Center Inc,30 to 49,119,F,White,Not Span/Hispanic,1,Emergency,Left Against Medical Advice,2017,084,Headache; including migraine,000,NO PROC,054,Migraine & other headaches,01,Diseases and Disorders of the Nervous System,2,Moderate,Minor,Medical,Private Health Insurance,,,,N,Y,20150.78,2100.20
