Hospital Service Area,Hospital County,Operating Certificate Number,Permanent Facility Id,Facility Name,Age Group,Zip Code - 3 digits,Gender,Race,Ethnicity,Length of Stay,Type of Admission,Patient Disposition,Discharge Year,CCS Diagnosis Code,CCS Diagnosis Description,CCS Procedure Code,CCS Procedure Description,APR DRG Code,APR DRG Description,APR MDC Code,APR MDC Description,APR Severity of Illness Code,APR Severity of Illness Description,APR Risk of Mortality,APR Medical Surgical Description,Payment Typology 1,Payment Typology 2,Payment Typology 3,Birth Weight,Abortion Edit Indicator,Emergency Department Indicator,Total Charges,Total Costs
New York City,Manhattan,7002001,001438,Bellevue Hospital Center,30 to 49,112,F,White,Not Span/Hispanic,1,Emergency,Home or Self Care,2019,NVS010,HEADACHE; INCLUDING MIGRAINE,IMG007,COMPUTERIZED TOMOGRAPHY (CT) WITHOUT CONTRAST,054,MIGRAINE & OTHER HEADACHES,01,DISEASES AND DISORDERS OF THE NERVOUS SYSTEM,1,Minor,Minor,Medical,Medicaid,Medicaid,,,,true,18919.72,12574.05
New York City,Manhattan,7002001,001438,Bellevue Hospital Center,50 to 69,112,M,Other Race,Not Span/Hispanic,72,Emergency,Home w/ Home Health Services,2019,NVS010,HEADACHE; INCLUDING MIGRAINE,ADM021,"ADMINISTRATION OF THERAPEUTIC SUBSTANCES, NEC",054,MIGRAINE & OTHER HEADACHES,01,DISEASES AND DISORDERS OF THE NERVOUS SYSTEM,2,Moderate,Minor,Medical,Medicaid,,,,,true,346487.5,230275.59
New York City,Manhattan,7002001,001438,Bellevue Hospital Center,18 to 29,111,M,Other Race,Not Span/Hispanic,5,Emergency,Home or Self Care,2019,NVS010,HEADACHE; INCLUDING MIGRAINE,ADM021,"ADMINISTRATION OF THERAPEUTIC SUBSTANCES, NEC",054,MIGRAINE & OTHER HEADACHES,01,DISEASES AND DISORDERS OF THE NERVOUS SYSTEM,1,Minor,Minor,Medical,Medicaid,Medicaid,,,,true,27295.34,18140.48
New York City,Manhattan,7002001,001438,Bellevue Hospital Center,18 to 29,113,M,Other Race,Spanish/Hispanic,2,Emergency,Home or Self Care,2019,NVS010,HEADACHE; INCLUDING MIGRAINE,,,054,MIGRAINE & OTHER HEADACHES,01,DISEASES AND DISORDERS OF THE NERVOUS SYSTEM,1,Minor,Minor,Medical,Medicaid,,,,,false,12523.41,8323.06
New York City,Manhattan,7002001,001438,Bellevue Hospital Center,30 to 49,100,M,Other Race,Not Span/Hispanic,2,Emergency,Home or Self Care,2019,NVS010,HEADACHE; INCLUDING MIGRAINE,IMG007,COMPUTERIZED TOMOGRAPHY (CT) WITHOUT CONTRAST,054,MIGRAINE & OTHER HEADACHES,01,DISEASES AND DISORDERS OF THE NERVOUS SYSTEM,2,Moderate,Minor,Medical,Self-Pay,,,,,true,18411.16,12236.06
New York City,Manhattan,7002001,001438,Bellevue Hospital Center,18 to 29,117,M,White,Not Span/Hispanic,2,Emergency,Home or Self Care,2019,NVS010,HEADACHE; INCLUDING MIGRAINE,IMG006,COMPUTERIZED TOMOGRAPHY (CT) WITH CONTRAST,054,MIGRAINE & OTHER HEADACHES,01,DISEASES AND DISORDERS OF THE NERVOUS SYSTEM,1,Minor,Minor,Medical,Blue Cross/Blue Shield,,,,,true,23667.42,15729.37
New York City,Manhattan,7002001,001438,Bellevue Hospital Center,18 to 29,114,F,Black/African American,Not Span/Hispanic,2,Emergency,Home or Self Care,2019,NVS010,HEADACHE; INCLUDING MIGRAINE,IMG005,MAGNETIC RESONANCE IMAGING (MRI),054,MIGRAINE & OTHER HEADACHES,01,DISEASES AND DISORDERS OF THE NERVOUS SYSTEM,1,Minor,Minor,Medical,Medicaid,,,,,true,26356.49,17516.52
New York City,Manhattan,7002001,001438,Bellevue Hospital Center,30 to 49,112,F,Other Race,Spanish/Hispanic,1,Emergency,Home or Self Care,2019,NVS010,HEADACHE; INCLUDING MIGRAINE,IMG008,ULTRASONOGRAPHY,054,MIGRAINE & OTHER HEADACHES,01,DISEASES AND DISORDERS OF THE NERVOUS SYSTEM,1,Minor,Minor,Medical,Medicare,Medicare,Medicaid,,,true,16587.88,11024.31
New York City,Manhattan,7002001,001438,Bellevue Hospital Center,50 to 69,112,F,Black/African American,Not Span/Hispanic,1,Emergency,Home or Self Care,2019,NVS010,HEADACHE; INCLUDING MIGRAINE,ADM021,"ADMINISTRATION OF THERAPEUTIC SUBSTANCES, NEC",054,MIGRAINE & OTHER HEADACHES,01,DISEASES AND DISORDERS OF THE NERVOUS SYSTEM,2,Moderate,Moderate,Medical,Blue Cross/Blue Shield,,,,,true,11925.15,7925.45
New York City,Manhattan,7002001,001438,Bellevue Hospital Center,30 to 49,104,F,Other Race,Not Span/Hispanic,1,Emergency,Home or Self Care,2019,NVS010,HEADACHE; INCLUDING MIGRAINE,MAM008,CARDIAC MONITORING,054,MIGRAINE & OTHER HEADACHES,01,DISEASES AND DISORDERS OF THE NERVOUS SYSTEM,1,Minor,Minor,Medical,Self-Pay,,,,,true,7290.01,4844.94
New York City,Manhattan,7002001,001438,Bellevue Hospital Center,0 to 17,104,F,Other Race,Unknown,1,Emergency,Home or Self Care,2019,NVS010,HEADACHE; INCLUDING MIGRAINE,MAM011,ELECTROENCEPHALOGRAM (EEG),054,MIGRAINE & OTHER HEADACHES,01,DISEASES AND DISORDERS OF THE NERVOUS SYSTEM,2,Moderate,Minor,Medical,Medicaid,,,,,true,18517.6,12306.8
New York City,Manhattan,7002001,001438,Bellevue Hospital Center,18 to 29,112,F,Other Race,Spanish/Hispanic,1,Urgent,Home or Self Care,2019,NVS010,HEADACHE; INCLUDING MIGRAINE,IMG005,MAGNETIC RESONANCE IMAGING (MRI),054,MIGRAINE & OTHER HEADACHES,01,DISEASES AND DISORDERS OF THE NERVOUS SYSTEM,1,Minor,Minor,Medical,Medicaid,,,,,false,8942.9,5943.45
New York City,Manhattan,7002001,001438,Bellevue Hospital Center,50 to 69,113,F,Other Race,Not Span/Hispanic,2,Emergency,Home or Self Care,2019,NVS010,HEADACHE; INCLUDING MIGRAINE,CNS002,LUMBAR PUNCTURE,054,MIGRAINE & OTHER HEADACHES,01,DISEASES AND DISORDERS OF THE NERVOUS SYSTEM,2,Moderate,Minor,Medical,Medicaid,,,,,true,24743.26,16444.37
New York City,Manhattan,7002001,001438,Bellevue Hospital Center,30 to 49,112,F,Black/African American,Not Span/Hispanic,1,Urgent,Home or Self Care,2019,NVS010,HEADACHE; INCLUDING MIGRAINE,IMG005,MAGNETIC RESONANCE IMAGING (MRI),054,MIGRAINE & OTHER HEADACHES,01,DISEASES AND DISORDERS OF THE NERVOUS SYSTEM,1,Minor,Minor,Medical,Medicaid,,,,,false,14852.63,9871.06
New York City,Manhattan,7002001,001438,Bellevue Hospital Center,50 to 69,117,F,Other Race,Not Span/Hispanic,1,Urgent,Home or Self Care,2019,NVS010,HEADACHE; INCLUDING MIGRAINE,IMG005,MAGNETIC RESONANCE IMAGING (MRI),054,MIGRAINE & OTHER HEADACHES,01,DISEASES AND DISORDERS OF THE NERVOUS SYSTEM,1,Minor,Minor,Medical,Private Health Insurance,,,,,false,14692.79,9764.83
New York City,Manhattan,7002001,001438,Bellevue Hospital Center,18 to 29,104,F,Other Race,Spanish/Hispanic,1,Emergency,Home or Self Care,2019,NVS010,HEADACHE; INCLUDING MIGRAINE,IMG007,COMPUTERIZED TOMOGRAPHY (CT) WITHOUT CONTRAST,054,MIGRAINE & OTHER HEADACHES,01,DISEASES AND DISORDERS OF THE NERVOUS SYSTEM,1,Minor,Minor,Medical,Medicaid,,,,,true,17410.98,11571.34
New York City,Manhattan,7002001,001438,Bellevue Hospital Center,18 to 29,112,M,Black/African American,Not Span/Hispanic,3,Emergency,Home or Self Care,2019,NVS010,HEADACHE; INCLUDING MIGRAINE,MAM011,ELECTROENCEPHALOGRAM (EEG),054,MIGRAINE & OTHER HEADACHES,01,DISEASES AND DISORDERS OF THE NERVOUS SYSTEM,2,Moderate,Minor,Medical,Medicaid,,,,,true,35372.72,23508.71
New York City,Manhattan,7002001,001438,Bellevue Hospital Center,30 to 49,113,M,Other Race,Unknown,1,Emergency,Home or Self Care,2019,NVS011,NEUROCOGNITIVE DISORDERS,MAM011,ELECTROENCEPHALOGRAM (EEG),054,MIGRAINE & OTHER HEADACHES,01,DISEASES AND DISORDERS OF THE NERVOUS SYSTEM,2,Moderate,Moderate,Medical,Self-Pay,,,,,true,25308.99,16820.35
New York City,Manhattan,7002001,001438,Bellevue Hospital Center,30 to 49,112,M,Other Race,Spanish/Hispanic,1,Emergency,Home or Self Care,2019,NVS010,HEADACHE; INCLUDING MIGRAINE,ADM021,"ADMINISTRATION OF THERAPEUTIC SUBSTANCES, NEC",054,MIGRAINE & OTHER HEADACHES,01,DISEASES AND DISORDERS OF THE NERVOUS SYSTEM,2,Moderate,Minor,Medical,Private Health Insurance,,,,,true,7964.01,5292.88
New York City,Manhattan,7002001,001438,Bellevue Hospital Center,30 to 49,112,M,Black/African American,Unknown,9,Emergency,Court/Law Enforcement,2019,NVS011,NEUROCOGNITIVE DISORDERS,IMG008,ULTRASONOGRAPHY,054,MIGRAINE & OTHER HEADACHES,01,DISEASES AND DISORDERS OF THE NERVOUS SYSTEM,3,Major,Minor,Medical,Private Health Insurance,Medicaid,,,,true,70793.1,47049.09
New York City,Manhattan,7002001,001438,Bellevue Hospital Center,50 to 69,114,F,Black/African American,Not Span/Hispanic,2,Urgent,Home or Self Care,2019,NVS010,HEADACHE; INCLUDING MIGRAINE,IMG005,MAGNETIC RESONANCE IMAGING (MRI),054,MIGRAINE & OTHER HEADACHES,01,DISEASES AND DISORDERS OF THE NERVOUS SYSTEM,1,Minor,Minor,Medical,Self-Pay,,,,,false,20152.67,13393.46
New York City,Manhattan,7002001,001438,Bellevue Hospital Center,18 to 29,117,M,White,Not Span/Hispanic,6,Emergency,Short-term Hospital,2019,NVS010,HEADACHE; INCLUDING MIGRAINE,RES007,AIRWAY INTUBATION,054,MIGRAINE & OTHER HEADACHES,01,DISEASES AND DISORDERS OF THE NERVOUS SYSTEM,4,Extreme,Extreme,Medical,Private Health Insurance,Medicaid,,,,true,77498.51,51505.51
New York City,Manhattan,7002001,001438,Bellevue Hospital Center,50 to 69,112,F,Black/African American,Not Span/Hispanic,1,Emergency,Home or Self Care,2019,NVS010,HEADACHE; INCLUDING MIGRAINE,ADM020,"ADMINISTRATION OF DIAGNOSTIC SUBSTANCES, NEC",054,MIGRAINE & OTHER HEADACHES,01,DISEASES AND DISORDERS OF THE NERVOUS SYSTEM,1,Minor,Minor,Medical,Private Health Insurance,,,,,true,21194.21,14085.67
New York City,Manhattan,7002001,001438,Bellevue Hospital Center,0 to 17,100,M,Black/African American,Not Span/Hispanic,1,Emergency,Home or Self Care,2019,NVS010,HEADACHE; INCLUDING MIGRAINE,,,054,MIGRAINE & OTHER HEADACHES,01,DISEASES AND DISORDERS OF THE NERVOUS SYSTEM,1,Minor,Minor,Medical,Medicaid,,,,,true,6770.86,4499.91
New York City,Manhattan,7002001,001438,Bellevue Hospital Center,30 to 49,111,F,Other Race,Spanish/Hispanic,3,Emergency,Home or Self Care,2019,NVS010,HEADACHE; INCLUDING MIGRAINE,CNS002,LUMBAR PUNCTURE,054,MIGRAINE & OTHER HEADACHES,01,DISEASES AND DISORDERS OF THE NERVOUS SYSTEM,2,Moderate,Minor,Medical,Medicaid,,,,,true,37414.75,24865.84
New York City,Manhattan,7002001,001438,Bellevue Hospital Center,30 to 49,100,M,Other Race,Not Span/Hispanic,1,Emergency,Home or Self Care,2019,NVS010,HEADACHE; INCLUDING MIGRAINE,ADM017,ADMINISTRATION OF NUTRITIONAL AND ELECTROLYTIC SUBSTANCES,054,MIGRAINE & OTHER HEADACHES,01,DISEASES AND DISORDERS OF THE NERVOUS SYSTEM,2,Moderate,Minor,Medical,Medicaid,,,,,true,15345.03,10198.31
New York City,Manhattan,7002001,001438,Bellevue Hospital Center,18 to 29,,F,Other Race,Spanish/Hispanic,1,Emergency,Home or Self Care,2019,NVS010,HEADACHE; INCLUDING MIGRAINE,ADM021,"ADMINISTRATION OF THERAPEUTIC SUBSTANCES, NEC",054,MIGRAINE & OTHER HEADACHES,01,DISEASES AND DISORDERS OF THE NERVOUS SYSTEM,1,Minor,Minor,Medical,Medicaid,,,,,true,7222.26,4799.91
New York City,Manhattan,7002001,001438,Bellevue Hospital Center,0 to 17,114,F,Other Race,Unknown,1,Elective,Home or Self Care,2019,NVS010,HEADACHE; INCLUDING MIGRAINE,MAM011,ELECTROENCEPHALOGRAM (EEG),054,MIGRAINE & OTHER HEADACHES,01,DISEASES AND DISORDERS OF THE NERVOUS SYSTEM,1,Minor,Minor,Medical,Medicaid,,,,,false,10414.46,6921.45
New York City,Manhattan,7002001,001438,Bellevue Hospital Center,50 to 69,112,F,Black/African American,Spanish/Hispanic,2,Emergency,Home w/ Home Health Services,2019,NVS010,HEADACHE; INCLUDING MIGRAINE,ADM017,ADMINISTRATION OF NUTRITIONAL AND ELECTROLYTIC SUBSTANCES,054,MIGRAINE & OTHER HEADACHES,01,DISEASES AND DISORDERS OF THE NERVOUS SYSTEM,3,Major,Minor,Medical,Medicaid,,,,,true,25955.37,17249.94
New York City,Manhattan,7002001,001438,Bellevue Hospital Center,30 to 49,112,F,Other Race,Spanish/Hispanic,1,Emergency,Home or Self Care,2019,NVS010,HEADACHE; INCLUDING MIGRAINE,ADM017,ADMINISTRATION OF NUTRITIONAL AND ELECTROLYTIC SUBSTANCES,054,MIGRAINE & OTHER HEADACHES,01,DISEASES AND DISORDERS OF THE NERVOUS SYSTEM,1,Minor,Minor,Medical,Medicaid,,,,,true,9425.84,6264.41
New York City,Manhattan,7002001,001438,Bellevue Hospital Center,50 to 69,113,M,Other Race,Not Span/Hispanic,1,Emergency,Home or Self Care,2019,NVS010,HEADACHE; INCLUDING MIGRAINE,ADM017,ADMINISTRATION OF NUTRITIONAL AND ELECTROLYTIC SUBSTANCES,054,MIGRAINE & OTHER HEADACHES,01,DISEASES AND DISORDERS OF THE NERVOUS SYSTEM,2,Moderate,Minor,Medical,Medicaid,,,,,true,13048.38,8671.95
New York City,Manhattan,7002001,001438,Bellevue Hospital Center,18 to 29,104,M,Black/African American,Not Span/Hispanic,4,Emergency,Home or Self Care,2019,NVS010,HEADACHE; INCLUDING MIGRAINE,CNS002,LUMBAR PUNCTURE,054,MIGRAINE & OTHER HEADACHES,01,DISEASES AND DISORDERS OF THE NERVOUS SYSTEM,3,Major,Minor,Medical,Private Health Insurance,,,,,true,39434.37,26208.08
New York City,Manhattan,7002001,001438,Bellevue Hospital Center,50 to 69,100,M,White,Unknown,1,Emergency,Home or Self Care,2019,NVS010,HEADACHE; INCLUDING MIGRAINE,IMG007,COMPUTERIZED TOMOGRAPHY (CT) WITHOUT CONTRAST,054,MIGRAINE & OTHER HEADACHES,01,DISEASES AND DISORDERS OF THE NERVOUS SYSTEM,2,Moderate,Minor,Medical,Medicaid,,,,,true,20159.85,13398.24
