Hospital Service Area,Hospital County,Operating Certificate Number,Permanent Facility Id,Facility Name,Age Group,Zip Code - 3 digits,Gender,Race,Ethnicity,Length of Stay,Type of Admission,Patient Disposition,Discharge Year,CCS Diagnosis Code,CCS Diagnosis Description,CCS Procedure Code,CCS Procedure Description,APR DRG Code,APR DRG Description,APR MDC Code,APR MDC Description,APR Severity of Illness Code,APR Severity of Illness Description,APR Risk of Mortality,APR Medical Surgical Description,Payment Typology 1,Payment Typology 2,Payment Typology 3,Birth Weight,Abortion Edit Indicator,Emergency Department Indicator,Total Charges,Total Costs
New York City,Bronx,7000006,001169,Montefiore Medical Center - Henry & Lucy Moses Div,50 to 69,104,F,Black/African American,Not Span/Hispanic,1,Emergency,Home or Self Care,2020,NVS010,HEADACHE; INCLUDING MIGRAINE,ADM021,"ADMINISTRATION OF THERAPEUTIC SUBSTANCES, NEC",054,MIGRAINE & OTHER HEADACHES,01,DISEASES AND DISORDERS OF THE NERVOUS SYSTEM,2,Moderate,Minor,Medical,Medicare,Medicaid,,,,Y,27923.88,3380.66
New York City,Bronx,7000006,001168,Montefiore Medical Center-Wakefield Hospital,50 to 69,104,F,Black/African American,Unknown,1,Emergency,Home or Self Care,2020,NVS010,HEADACHE; INCLUDING MIGRAINE,,,054,MIGRAINE & OTHER HEADACHES,01,DISEASES AND DISORDERS OF THE NERVOUS SYSTEM,1,Minor,Minor,Medical,Medicare,,,,,Y,24730,3744.35
New York City,Bronx,7000006,001169,Montefiore Medical Center - Henry & Lucy Moses Div,0 to 17,104,F,Black/African American,Not Span/Hispanic,2,Emergency,Home or Self Care,2020,NVS010,HEADACHE; INCLUDING MIGRAINE,ADM021,"ADMINISTRATION OF THERAPEUTIC SUBSTANCES, NEC",054,MIGRAINE & OTHER HEADACHES,01,DISEASES AND DISORDERS OF THE NERVOUS SYSTEM,1,Minor,Minor,Medical,Private Health Insurance,Medicaid,,,,Y,30217.69,4563.97
New York City,Bronx,7000006,001169,Montefiore Medical Center - Henry & Lucy Moses Div,30 to 49,104,F,Other Race,Spanish/Hispanic,2,Emergency,Home or Self Care,2020,NVS010,HEADACHE; INCLUDING MIGRAINE,,,054,MIGRAINE & OTHER HEADACHES,01,DISEASES AND DISORDERS OF THE NERVOUS SYSTEM,3,Major,Moderate,Medical,Medicaid,,,,,Y,20743.11,3292.79
Hudson Valley,Westchester,5903001,001061,Montefiore Mount Vernon Hospital,50 to 69,105,F,Black/African American,Unknown,2,Emergency,Home or Self Care,2020,NVS010,HEADACHE; INCLUDING MIGRAINE,,,054,MIGRAINE & OTHER HEADACHES,01,DISEASES AND DISORDERS OF THE NERVOUS SYSTEM,1,Minor,Minor,Medical,Private Health Insurance,Self-Pay,,,,Y,26083.87,7285.09
Hudson Valley,Westchester,5903001,001061,Montefiore Mount Vernon Hospital,30 to 49,105,F,Black/African American,Not Span/Hispanic,3,Emergency,Left Against Medical Advice,2020,NVS010,HEADACHE; INCLUDING MIGRAINE,,,054,MIGRAINE & OTHER HEADACHES,01,DISEASES AND DISORDERS OF THE NERVOUS SYSTEM,2,Moderate,Moderate,Medical,Medicaid,Medicaid,Self-Pay,,,Y,31113.63,9106
New York City,Bronx,7000006,001169,Montefiore Medical Center - Henry & Lucy Moses Div,30 to 49,104,F,Black/African American,Not Span/Hispanic,4,Emergency,Home or Self Care,2020,NVS010,HEADACHE; INCLUDING MIGRAINE,,,054,MIGRAINE & OTHER HEADACHES,01,DISEASES AND DISORDERS OF THE NERVOUS SYSTEM,1,Minor,Minor,Medical,Medicaid,,,,,Y,55820.69,9607.16
New York City,Bronx,7000006,003058,Montefiore Med Center - Jack D Weiler Hosp of A Einstein College Div,30 to 49,104,F,Other Race,Spanish/Hispanic,5,Emergency,Home or Self Care,2020,NVS010,HEADACHE; INCLUDING MIGRAINE,,,054,MIGRAINE & OTHER HEADACHES,01,DISEASES AND DISORDERS OF THE NERVOUS SYSTEM,1,Minor,Minor,Medical,Medicaid,,,,,Y,72049.86,11925.98
New York City,Bronx,7000006,001169,Montefiore Medical Center - Henry & Lucy Moses Div,50 to 69,107,F,Other Race,Spanish/Hispanic,1,Emergency,Home or Self Care,2020,NVS010,HEADACHE; INCLUDING MIGRAINE,ADM017,ADMINISTRATION OF NUTRITIONAL AND ELECTROLYTIC SUBSTANCES,054,MIGRAINE & OTHER HEADACHES,01,DISEASES AND DISORDERS OF THE NERVOUS SYSTEM,4,Extreme,Major,Medical,Private Health Insurance,,,,,Y,45256.74,4603.12
Hudson Valley,Westchester,5901000,001039,NewYork-Presbyterian/Hudson Valley Hospital,50 to 69,105,F,White,Not Span/Hispanic,3,Emergency,Home or Self Care,2020,NVS010,HEADACHE; INCLUDING MIGRAINE,ADM021,"ADMINISTRATION OF THERAPEUTIC SUBSTANCES, NEC",054,MIGRAINE & OTHER HEADACHES,01,DISEASES AND DISORDERS OF THE NERVOUS SYSTEM,1,Minor,Minor,Medical,Blue Cross/Blue Shield,,,,,Y,34011.85,9202.39
New York City,Bronx,7000006,001169,Montefiore Medical Center - Henry & Lucy Moses Div,30 to 49,104,M,Other Race,Spanish/Hispanic,3,Emergency,Home or Self Care,2020,NVS010,HEADACHE; INCLUDING MIGRAINE,,,054,MIGRAINE & OTHER HEADACHES,01,DISEASES AND DISORDERS OF THE NERVOUS SYSTEM,1,Minor,Minor,Medical,Private Health Insurance,,,,,Y,47699.72,6477.04
Hudson Valley,Westchester,5903001,001061,Montefiore Mount Vernon Hospital,50 to 69,,F,Multi-racial,Multi-ethnic,3,Emergency,Left Against Medical Advice,2020,NVS010,HEADACHE; INCLUDING MIGRAINE,,,054,MIGRAINE & OTHER HEADACHES,01,DISEASES AND DISORDERS OF THE NERVOUS SYSTEM,2,Moderate,Minor,Medical,Medicare,Medicare,Self-Pay,,,Y,28249.93,8854.81
New York City,Manhattan,7002054,003975,New York Presbyterian Hospital - Allen Hospital,70 or Older,104,F,Multi-racial,Not Span/Hispanic,1,Emergency,Home or Self Care,2020,NVS010,HEADACHE; INCLUDING MIGRAINE,IMG005,MAGNETIC RESONANCE IMAGING (MRI),054,MIGRAINE & OTHER HEADACHES,01,DISEASES AND DISORDERS OF THE NERVOUS SYSTEM,2,Moderate,Minor,Medical,Medicare,Blue Cross/Blue Shield,Self-Pay,,,Y,29060.01,6026.02
New York City,Manhattan,7002054,003975,New York Presbyterian Hospital - Allen Hospital,50 to 69,100,M,Multi-racial,Multi-ethnic,2,Emergency,Home or Self Care,2020,NVS010,HEADACHE; INCLUDING MIGRAINE,IMG005,MAGNETIC RESONANCE IMAGING (MRI),054,MIGRAINE & OTHER HEADACHES,01,DISEASES AND DISORDERS OF THE NERVOUS SYSTEM,2,Moderate,Moderate,Medical,Private Health Insurance,Self-Pay,,,,Y,47046.77,9495.16
New York City,Bronx,7000006,001169,Montefiore Medical Center - Henry & Lucy Moses Div,50 to 69,104,F,White,Not Span/Hispanic,3,Emergency,Home or Self Care,2020,NVS010,HEADACHE; INCLUDING MIGRAINE,,,054,MIGRAINE & OTHER HEADACHES,01,DISEASES AND DISORDERS OF THE NERVOUS SYSTEM,2,Moderate,Moderate,Medical,Medicare,,,,,Y,53386.33,7668.38
New York City,Bronx,7000006,001169,Montefiore Medical Center - Henry & Lucy Moses Div,50 to 69,112,M,Other Race,Spanish/Hispanic,3,Emergency,Home or Self Care,2020,NVS010,HEADACHE; INCLUDING MIGRAINE,,,054,MIGRAINE & OTHER HEADACHES,01,DISEASES AND DISORDERS OF THE NERVOUS SYSTEM,1,Minor,Minor,Medical,Medicare,Medicaid,,,,Y,40659.02,5879.06
New York City,Manhattan,7002054,001464,New York-Presbyterian Hospital - Columbia Presbyterian Center,30 to 49,100,F,Multi-racial,Multi-ethnic,3,Emergency,Home or Self Care,2020,NVS010,HEADACHE; INCLUDING MIGRAINE,IMG005,MAGNETIC RESONANCE IMAGING (MRI),054,MIGRAINE & OTHER HEADACHES,01,DISEASES AND DISORDERS OF THE NERVOUS SYSTEM,1,Minor,Minor,Medical,Medicaid,Medicaid,Self-Pay,,,Y,53748.29,11384.75
New York City,Manhattan,7002054,001464,New York-Presbyterian Hospital - Columbia Presbyterian Center,0 to 17,100,M,White,Spanish/Hispanic,3,Elective,Home or Self Care,2020,NVS010,HEADACHE; INCLUDING MIGRAINE,CNS002,LUMBAR PUNCTURE,054,MIGRAINE & OTHER HEADACHES,01,DISEASES AND DISORDERS OF THE NERVOUS SYSTEM,2,Moderate,Minor,Medical,Medicaid,Medicaid,Self-Pay,,,Y,76488.87,15952.91
New York City,Manhattan,7002054,001464,New York-Presbyterian Hospital - Columbia Presbyterian Center,18 to 29,104,F,Other Race,Multi-ethnic,2,Emergency,Home or Self Care,2020,NVS010,HEADACHE; INCLUDING MIGRAINE,CNS002,LUMBAR PUNCTURE,054,MIGRAINE & OTHER HEADACHES,01,DISEASES AND DISORDERS OF THE NERVOUS SYSTEM,2,Moderate,Minor,Medical,Medicaid,Medicaid,Self-Pay,,,Y,36144.81,7408.96
New York City,Manhattan,7002054,001464,New York-Presbyterian Hospital - Columbia Presbyterian Center,30 to 49,100,F,Other Race,Not Span/Hispanic,2,Emergency,Home or Self Care,2020,NVS010,HEADACHE; INCLUDING MIGRAINE,,,054,MIGRAINE & OTHER HEADACHES,01,DISEASES AND DISORDERS OF THE NERVOUS SYSTEM,1,Minor,Minor,Medical,Medicaid,Self-Pay,,,,Y,45109.75,9252.67
New York City,Manhattan,7002054,001464,New York-Presbyterian Hospital - Columbia Presbyterian Center,50 to 69,100,F,Other Race,Not Span/Hispanic,2,Emergency,Home w/ Home Health Services,2020,NVS010,HEADACHE; INCLUDING MIGRAINE,ADM005,ADMINISTRATION OF THROMBOLYTICS AND PLATELET INHIBITORS,054,MIGRAINE & OTHER HEADACHES,01,DISEASES AND DISORDERS OF THE NERVOUS SYSTEM,1,Minor,Minor,Medical,Medicare,Medicare,Self-Pay,,,Y,60493.94,18270.69
New York City,Manhattan,7002054,001464,New York-Presbyterian Hospital - Columbia Presbyterian Center,0 to 17,OOS,F,Multi-racial,Not Span/Hispanic,1,Emergency,Home or Self Care,2020,NVS010,HEADACHE; INCLUDING MIGRAINE,ADM021,"ADMINISTRATION OF THERAPEUTIC SUBSTANCES, NEC",054,MIGRAINE & OTHER HEADACHES,01,DISEASES AND DISORDERS OF THE NERVOUS SYSTEM,1,Minor,Minor,Medical,Blue Cross/Blue Shield,Self-Pay,,,,Y,23690.29,4807.7
New York City,Manhattan,7002054,001464,New York-Presbyterian Hospital - Columbia Presbyterian Center,18 to 29,100,F,White,Spanish/Hispanic,6,Urgent,Home or Self Care,2020,NVS010,HEADACHE; INCLUDING MIGRAINE,ADM021,"ADMINISTRATION OF THERAPEUTIC SUBSTANCES, NEC",054,MIGRAINE & OTHER HEADACHES,01,DISEASES AND DISORDERS OF THE NERVOUS SYSTEM,1,Minor,Minor,Medical,Medicaid,Medicaid,Self-Pay,,,Y,63866.38,14089.44
New York City,Manhattan,7002054,001464,New York-Presbyterian Hospital - Columbia Presbyterian Center,30 to 49,104,M,Other Race,Not Span/Hispanic,2,Emergency,Home or Self Care,2020,NVS010,HEADACHE; INCLUDING MIGRAINE,,,054,MIGRAINE & OTHER HEADACHES,01,DISEASES AND DISORDERS OF THE NERVOUS SYSTEM,2,Moderate,Minor,Medical,Private Health Insurance,Self-Pay,,,,Y,42746.56,8391.96
New York City,Manhattan,7002054,001464,New York-Presbyterian Hospital - Columbia Presbyterian Center,50 to 69,104,F,Multi-racial,Spanish/Hispanic,1,Emergency,Home or Self Care,2020,NVS010,HEADACHE; INCLUDING MIGRAINE,,,054,MIGRAINE & OTHER HEADACHES,01,DISEASES AND DISORDERS OF THE NERVOUS SYSTEM,2,Moderate,Minor,Medical,Medicaid,Medicaid,Self-Pay,,,Y,30124.43,6708.3
New York City,Manhattan,7002054,001464,New York-Presbyterian Hospital - Columbia Presbyterian Center,30 to 49,104,F,Multi-racial,Spanish/Hispanic,1,Emergency,Home or Self Care,2020,NVS010,HEADACHE; INCLUDING MIGRAINE,,,054,MIGRAINE & OTHER HEADACHES,01,DISEASES AND DISORDERS OF THE NERVOUS SYSTEM,3,Major,Major,Medical,Medicare,Medicare,Medicaid,,,Y,30770.65,6256.58
New York City,Queens,7003010,001637,New York - Presbyterian/Queens,30 to 49,114,F,Other Race,Not Span/Hispanic,10,Emergency,Home or Self Care,2020,NVS010,HEADACHE; INCLUDING MIGRAINE,CNS002,LUMBAR PUNCTURE,054,MIGRAINE & OTHER HEADACHES,01,DISEASES AND DISORDERS OF THE NERVOUS SYSTEM,2,Moderate,Minor,Medical,Private Health Insurance,Self-Pay,,,,Y,110047.09,23509.65
New York City,Queens,7003010,001637,New York - Presbyterian/Queens,30 to 49,113,F,White,Not Span/Hispanic,11,Emergency,Home or Self Care,2020,NVS010,HEADACHE; INCLUDING MIGRAINE,CNS002,LUMBAR PUNCTURE,054,MIGRAINE & OTHER HEADACHES,01,DISEASES AND DISORDERS OF THE NERVOUS SYSTEM,3,Major,Moderate,Medical,"Managed Care, Unspecified",Medicaid,Self-Pay,,,Y,113457.3,23858.98
New York City,Queens,7003010,001637,New York - Presbyterian/Queens,50 to 69,112,F,Black/African American,Not Span/Hispanic,2,Emergency,Home or Self Care,2020,NVS010,HEADACHE; INCLUDING MIGRAINE,ADM016,ADMINISTRATION OF ANTI-INFLAMMATORY AGENTS,054,MIGRAINE & OTHER HEADACHES,01,DISEASES AND DISORDERS OF THE NERVOUS SYSTEM,2,Moderate,Minor,Medical,Private Health Insurance,Self-Pay,,,,Y,19997.18,4516.94
New York City,Queens,7003010,001637,New York - Presbyterian/Queens,30 to 49,113,M,White,Not Span/Hispanic,2,Emergency,Home or Self Care,2020,NVS010,HEADACHE; INCLUDING MIGRAINE,ADM021,"ADMINISTRATION OF THERAPEUTIC SUBSTANCES, NEC",054,MIGRAINE & OTHER HEADACHES,01,DISEASES AND DISORDERS OF THE NERVOUS SYSTEM,1,Minor,Minor,Medical,"Managed Care, Unspecified",Medicaid,Self-Pay,,,Y,18044.13,4170.22
New York City,Queens,7003010,001637,New York - Presbyterian/Queens,70 or Older,113,F,White,Not Span/Hispanic,2,Emergency,Home or Self Care,2020,NVS010,HEADACHE; INCLUDING MIGRAINE,ADM015,ADMINISTRATION OF ANTIBIOTICS,054,MIGRAINE & OTHER HEADACHES,01,DISEASES AND DISORDERS OF THE NERVOUS SYSTEM,1,Minor,Minor,Medical,Blue Cross/Blue Shield,Medicare,Self-Pay,,,Y,24733.43,4894.11
New York City,Kings,7002053,001304,NYU Langone Hospital-Brooklyn,18 to 29,112,M,Other Race,Not Span/Hispanic,1,Emergency,Home or Self Care,2020,NVS010,HEADACHE; INCLUDING MIGRAINE,CNS002,LUMBAR PUNCTURE,054,MIGRAINE & OTHER HEADACHES,01,DISEASES AND DISORDERS OF THE NERVOUS SYSTEM,1,Minor,Minor,Medical,Private Health Insurance,,,,,Y,49252.22,6006.77
New York City,Manhattan,7002054,001458,New York-Presbyterian Hospital - New York Weill Cornell Center,30 to 49,OOS,F,Other Race,Not Span/Hispanic,3,Emergency,Home or Self Care,2020,NVS010,HEADACHE; INCLUDING MIGRAINE,ADM014,REGIONAL ANESTHESIA,054,MIGRAINE & OTHER HEADACHES,01,DISEASES AND DISORDERS OF THE NERVOUS SYSTEM,1,Minor,Minor,Medical,Private Health Insurance,Self-Pay,,,,Y,47681.6,9713.05
New York City,Kings,7001037,001320,University Hospital of Brooklyn,18 to 29,112,F,Black/African American,Not Span/Hispanic,2,Emergency,Home or Self Care,2020,NVS010,HEADACHE; INCLUDING MIGRAINE,ADM021,"ADMINISTRATION OF THERAPEUTIC SUBSTANCES, NEC",054,MIGRAINE & OTHER HEADACHES,01,DISEASES AND DISORDERS OF THE NERVOUS SYSTEM,2,Moderate,Minor,Medical,Medicaid,Medicaid,Self-Pay,,,Y,24319,10056.77
New York City,Manhattan,7002054,001458,New York-Presbyterian Hospital - New York Weill Cornell Center,18 to 29,113,M,Black/African American,Not Span/Hispanic,1,Emergency,Home or Self Care,2020,NVS010,HEADACHE; INCLUDING MIGRAINE,,,054,MIGRAINE & OTHER HEADACHES,01,DISEASES AND DISORDERS OF THE NERVOUS SYSTEM,2,Moderate,Minor,Medical,"Managed Care, Unspecified",Medicaid,Self-Pay,,,Y,16569.63,3637.97
New York City,Manhattan,7002054,001458,New York-Presbyterian Hospital - New York Weill Cornell Center,50 to 69,113,F,Other Race,Not Span/Hispanic,2,Emergency,Home or Self Care,2020,NVS010,HEADACHE; INCLUDING MIGRAINE,ADM021,"ADMINISTRATION OF THERAPEUTIC SUBSTANCES, NEC",054,MIGRAINE & OTHER HEADACHES,01,DISEASES AND DISORDERS OF THE NERVOUS SYSTEM,1,Minor,Minor,Medical,Medicaid,Self-Pay,,,,Y,49548.74,9860.94
New York City,Kings,7001021,001306,New York - Presbyterian Brooklyn Methodist Hospital,0 to 17,112,F,Black/African American,Not Span/Hispanic,1,Emergency,Home or Self Care,2020,NVS010,HEADACHE; INCLUDING MIGRAINE,,,054,MIGRAINE & OTHER HEADACHES,01,DISEASES AND DISORDERS OF THE NERVOUS SYSTEM,1,Minor,Minor,Medical,"Managed Care, Unspecified",Medicaid,Self-Pay,,,Y,7670.6,2003.87
New York City,Manhattan,7002054,001458,New York-Presbyterian Hospital - New York Weill Cornell Center,18 to 29,112,F,Other Race,Not Span/Hispanic,2,Emergency,Home or Self Care,2020,NVS010,HEADACHE; INCLUDING MIGRAINE,ADM021,"ADMINISTRATION OF THERAPEUTIC SUBSTANCES, NEC",054,MIGRAINE & OTHER HEADACHES,01,DISEASES AND DISORDERS OF THE NERVOUS SYSTEM,1,Minor,Minor,Medical,Blue Cross/Blue Shield,Self-Pay,,,,Y,23963.76,5209.11
New York City,Manhattan,7002054,001458,New York-Presbyterian Hospital - New York Weill Cornell Center,30 to 49,100,F,White,Not Span/Hispanic,4,Emergency,Home or Self Care,2020,NVS010,HEADACHE; INCLUDING MIGRAINE,ADM014,REGIONAL ANESTHESIA,054,MIGRAINE & OTHER HEADACHES,01,DISEASES AND DISORDERS OF THE NERVOUS SYSTEM,2,Moderate,Minor,Medical,Blue Cross/Blue Shield,Self-Pay,,,,Y,71679.9,35474.32
New York City,Manhattan,7002054,001458,New York-Presbyterian Hospital - New York Weill Cornell Center,50 to 69,100,F,Multi-racial,Not Span/Hispanic,1,Emergency,Home or Self Care,2020,NVS010,HEADACHE; INCLUDING MIGRAINE,IMG005,MAGNETIC RESONANCE IMAGING (MRI),054,MIGRAINE & OTHER HEADACHES,01,DISEASES AND DISORDERS OF THE NERVOUS SYSTEM,3,Major,Moderate,Medical,Blue Cross/Blue Shield,Self-Pay,,,,Y,26687.2,5412.55
New York City,Kings,7001021,001306,New York - Presbyterian Brooklyn Methodist Hospital,70 or Older,112,F,Other Race,Spanish/Hispanic,2,Emergency,Home or Self Care,2020,NVS010,HEADACHE; INCLUDING MIGRAINE,,,054,MIGRAINE & OTHER HEADACHES,01,DISEASES AND DISORDERS OF THE NERVOUS SYSTEM,2,Moderate,Moderate,Medical,Medicare,Medicare,Medicaid,,,N,19161.12,5593.56
New York City,Manhattan,7002024,001456,Mount Sinai Hospital,0 to 17,100,M,Other Race,Spanish/Hispanic,1,Emergency,Home or Self Care,2020,NVS010,HEADACHE; INCLUDING MIGRAINE,,,054,MIGRAINE & OTHER HEADACHES,01,DISEASES AND DISORDERS OF THE NERVOUS SYSTEM,2,Moderate,Minor,Medical,Medicaid,Medicaid,Self-Pay,,,Y,29681.5,6258.47
Long Island,Nassau,2950002,000528,Nassau University Medical Center,50 to 69,115,F,Black/African American,Unknown,4,Emergency,Home or Self Care,2020,NVS010,HEADACHE; INCLUDING MIGRAINE,IMG007,COMPUTERIZED TOMOGRAPHY (CT) WITHOUT CONTRAST,054,MIGRAINE & OTHER HEADACHES,01,DISEASES AND DISORDERS OF THE NERVOUS SYSTEM,3,Major,Moderate,Medical,Medicaid,Medicaid,Self-Pay,,,N,30398.96,9532.26
New York City,Bronx,7000006,001168,Montefiore Medical Center-Wakefield Hospital,30 to 49,104,F,Other Race,Spanish/Hispanic,3,Emergency,Home or Self Care,2020,NVS010,HEADACHE; INCLUDING MIGRAINE,ESA004,NON-INVASIVE VENTILATION,054,MIGRAINE & OTHER HEADACHES,01,DISEASES AND DISORDERS OF THE NERVOUS SYSTEM,2,Moderate,Moderate,Medical,Medicaid,,,,,Y,46026.13,7825.41
Western NY,Erie,1401005,000210,Erie County Medical Center,30 to 49,142,F,Other Race,Not Span/Hispanic,1,Urgent,Psychiatric Hospital or Unit of Hosp,2020,NVS010,HEADACHE; INCLUDING MIGRAINE,,,054,MIGRAINE & OTHER HEADACHES,01,DISEASES AND DISORDERS OF THE NERVOUS SYSTEM,1,Minor,Minor,Medical,Medicaid,Medicaid,,,,N,5416.3,2413.14
New York City,Manhattan,7002032,001469,Mount Sinai Morningside,70 or Older,100,F,Other Race,Spanish/Hispanic,4,Emergency,Home w/ Home Health Services,2020,NVS010,HEADACHE; INCLUDING MIGRAINE,ADM021,"ADMINISTRATION OF THERAPEUTIC SUBSTANCES, NEC",054,MIGRAINE & OTHER HEADACHES,01,DISEASES AND DISORDERS OF THE NERVOUS SYSTEM,3,Major,Moderate,Medical,Medicare,Medicaid,Self-Pay,,,Y,56162.98,11818.68
New York City,Bronx,7000006,001169,Montefiore Medical Center - Henry & Lucy Moses Div,30 to 49,107,F,Other Race,Spanish/Hispanic,1,Emergency,Left Against Medical Advice,2020,NVS010,HEADACHE; INCLUDING MIGRAINE,,,054,MIGRAINE & OTHER HEADACHES,01,DISEASES AND DISORDERS OF THE NERVOUS SYSTEM,1,Minor,Minor,Medical,Medicare,Medicaid,,,,Y,20226.15,2895.8
New York City,Manhattan,7002053,001463,NYU Langone Hospitals,50 to 69,112,F,Other Race,Spanish/Hispanic,1,Emergency,Home or Self Care,2020,NVS010,HEADACHE; INCLUDING MIGRAINE,ADM005,ADMINISTRATION OF THROMBOLYTICS AND PLATELET INHIBITORS,054,MIGRAINE & OTHER HEADACHES,01,DISEASES AND DISORDERS OF THE NERVOUS SYSTEM,2,Moderate,Moderate,Medical,Private Health Insurance,,,,,Y,121811.7,10016.15
New York City,Manhattan,7002053,001463,NYU Langone Hospitals,0 to 17,112,M,White,Not Span/Hispanic,3,Emergency,Home or Self Care,2020,NVS010,HEADACHE; INCLUDING MIGRAINE,CNS002,LUMBAR PUNCTURE,054,MIGRAINE & OTHER HEADACHES,01,DISEASES AND DISORDERS OF THE NERVOUS SYSTEM,1,Minor,Minor,Medical,Private Health Insurance,,,,,Y,66150.04,10217.01
New York City,Manhattan,7002053,001463,NYU Langone Hospitals,50 to 69,OOS,F,White,Not Span/Hispanic,1,Emergency,Home or Self Care,2020,NVS010,HEADACHE; INCLUDING MIGRAINE,,,054,MIGRAINE & OTHER HEADACHES,01,DISEASES AND DISORDERS OF THE NERVOUS SYSTEM,1,Minor,Minor,Medical,Private Health Insurance,,,,,Y,49989.19,8304.23
Capital/Adirond,Otsego,3824000,000746,Mary Imogene Bassett Hospital,50 to 69,120,M,White,Not Span/Hispanic,2,Urgent,Home or Self Care,2020,NVS011,NEUROCOGNITIVE DISORDERS,,,054,MIGRAINE & OTHER HEADACHES,01,DISEASES AND DISORDERS OF THE NERVOUS SYSTEM,1,Minor,Minor,Medical,Blue Cross/Blue Shield,Private Health Insurance,,,,N,6905.69,4111.96
Capital/Adirond,Otsego,3824000,000746,Mary Imogene Bassett Hospital,30 to 49,138,F,White,Not Span/Hispanic,1,Urgent,Home or Self Care,2020,NVS010,HEADACHE; INCLUDING MIGRAINE,,,054,MIGRAINE & OTHER HEADACHES,01,DISEASES AND DISORDERS OF THE NERVOUS SYSTEM,2,Moderate,Minor,Medical,Blue Cross/Blue Shield,,,,,N,4751.02,2613.49
Capital/Adirond,Otsego,3824000,000746,Mary Imogene Bassett Hospital,18 to 29,133,F,White,Not Span/Hispanic,3,Urgent,Home or Self Care,2020,NVS010,HEADACHE; INCLUDING MIGRAINE,,,054,MIGRAINE & OTHER HEADACHES,01,DISEASES AND DISORDERS OF THE NERVOUS SYSTEM,2,Moderate,Minor,Medical,Medicare,Medicaid,,,,N,5113.28,3915.35
New York City,Bronx,7000006,001169,Montefiore Medical Center - Henry & Lucy Moses Div,50 to 69,104,F,Black/African American,Not Span/Hispanic,1,Emergency,Home or Self Care,2020,NVS010,HEADACHE; INCLUDING MIGRAINE,,,054,MIGRAINE & OTHER HEADACHES,01,DISEASES AND DISORDERS OF THE NERVOUS SYSTEM,1,Minor,Minor,Medical,Medicare,,,,,Y,16788.46,1513.66
New York City,Bronx,7000006,001169,Montefiore Medical Center - Henry & Lucy Moses Div,50 to 69,104,F,Other Race,Spanish/Hispanic,1,Emergency,Home or Self Care,2020,NVS010,HEADACHE; INCLUDING MIGRAINE,,,054,MIGRAINE & OTHER HEADACHES,01,DISEASES AND DISORDERS OF THE NERVOUS SYSTEM,1,Minor,Minor,Medical,Medicare,,,,,Y,37228.8,3864.94
New York City,Bronx,7000006,001169,Montefiore Medical Center - Henry & Lucy Moses Div,70 or Older,104,F,Black/African American,Not Span/Hispanic,4,Emergency,Home or Self Care,2020,NVS010,HEADACHE; INCLUDING MIGRAINE,,,054,MIGRAINE & OTHER HEADACHES,01,DISEASES AND DISORDERS OF THE NERVOUS SYSTEM,2,Moderate,Minor,Medical,Medicare,Medicaid,,,,Y,55161.65,8261.72
New York City,Bronx,7000006,003058,Montefiore Med Center - Jack D Weiler Hosp of A Einstein College Div,18 to 29,104,M,Other Race,Spanish/Hispanic,2,Emergency,Home or Self Care,2020,NVS010,HEADACHE; INCLUDING MIGRAINE,MAM011,ELECTROENCEPHALOGRAM (EEG),054,MIGRAINE & OTHER HEADACHES,01,DISEASES AND DISORDERS OF THE NERVOUS SYSTEM,1,Minor,Minor,Medical,Medicaid,,,,,Y,41723.02,4419.81
New York City,Bronx,7000006,001169,Montefiore Medical Center - Henry & Lucy Moses Div,0 to 17,108,M,White,Not Span/Hispanic,1,Emergency,Home or Self Care,2020,NVS010,HEADACHE; INCLUDING MIGRAINE,ADM017,ADMINISTRATION OF NUTRITIONAL AND ELECTROLYTIC SUBSTANCES,054,MIGRAINE & OTHER HEADACHES,01,DISEASES AND DISORDERS OF THE NERVOUS SYSTEM,2,Moderate,Minor,Medical,Private Health Insurance,,,,,Y,31571.16,4928.1
New York City,Kings,7002053,001304,NYU Langone Hospital-Brooklyn,18 to 29,112,F,White,Not Span/Hispanic,1,Emergency,Home or Self Care,2020,NVS010,HEADACHE; INCLUDING MIGRAINE,ADM005,ADMINISTRATION OF THROMBOLYTICS AND PLATELET INHIBITORS,054,MIGRAINE & OTHER HEADACHES,01,DISEASES AND DISORDERS OF THE NERVOUS SYSTEM,1,Minor,Minor,Medical,Medicaid,,,,,Y,100530.56,12897.22
New York City,Kings,7002053,001304,NYU Langone Hospital-Brooklyn,30 to 49,112,M,Other Race,Spanish/Hispanic,1,Emergency,Home or Self Care,2020,NVS010,HEADACHE; INCLUDING MIGRAINE,,,054,MIGRAINE & OTHER HEADACHES,01,DISEASES AND DISORDERS OF THE NERVOUS SYSTEM,3,Major,Major,Medical,Medicare,Medicaid,,,,Y,39965.19,5906.01
New York City,Bronx,7000006,001169,Montefiore Medical Center - Henry & Lucy Moses Div,18 to 29,104,F,Other Race,Spanish/Hispanic,4,Emergency,Home or Self Care,2020,NVS010,HEADACHE; INCLUDING MIGRAINE,,,054,MIGRAINE & OTHER HEADACHES,01,DISEASES AND DISORDERS OF THE NERVOUS SYSTEM,1,Minor,Minor,Medical,Medicaid,,,,,Y,55583.25,13058.42
New York City,Bronx,7000006,001168,Montefiore Medical Center-Wakefield Hospital,70 or Older,104,M,Black/African American,Not Span/Hispanic,2,Emergency,Home w/ Home Health Services,2020,NVS010,HEADACHE; INCLUDING MIGRAINE,ADM016,ADMINISTRATION OF ANTI-INFLAMMATORY AGENTS,054,MIGRAINE & OTHER HEADACHES,01,DISEASES AND DISORDERS OF THE NERVOUS SYSTEM,1,Minor,Minor,Medical,Medicare,Medicaid,,,,Y,34707.1,5964.38