Hospital Service Area,Hospital County,Operating Certificate Number,Permanent Facility Id,Facility Name,Age Group,Zip Code - 3 digits,Gender,Race,Ethnicity,Length of Stay,Type of Admission,Patient Disposition,Discharge Year,CCS Diagnosis Code,CCS Diagnosis Description,CCS Procedure Code,CCS Procedure Description,APR DRG Code,APR DRG Description,APR MDC Code,APR MDC Description,APR Severity of Illness Code,APR Severity of Illness Description,APR Risk of Mortality,APR Medical Surgical Description,Payment Typology 1,Payment Typology 2,Payment Typology 3,Birth Weight,Abortion Edit Indicator,Emergency Department Indicator,Total Charges,Total Costs
Long Island,Nassau,2908000,000511,NYU Winthrop Hospital,30 to 49,115,F,White,Not Span/Hispanic,3,Elective,Home or Self Care,2017,189,Previous C-section,134,CESAREAN SECTION,540,Cesarean delivery,14,"Pregnancy, Childbirth and the Puerperium",1,Minor,Minor,Surgical,Blue Cross/Blue Shield,,,,N,N,24915.89,7290.49
Long Island,Nassau,2908000,000511,NYU Winthrop Hospital,30 to 49,115,F,Black/African American,Not Span/Hispanic,4,Elective,Home or Self Care,2017,189,Previous C-section,134,CESAREAN SECTION,540,Cesarean delivery,14,"Pregnancy, Childbirth and the Puerperium",1,Minor,Minor,Surgical,Private Health Insurance,Blue Cross/Blue Shield,,,N,N,29260.94,7782.00
Long Island,Nassau,2908000,000511,NYU Winthrop Hospital,30 to 49,115,F,Other Race,Not Span/Hispanic,4,Elective,Home or Self Care,2017,181,Other complications of pregnancy,134,CESAREAN SECTION,540,Cesarean delivery,14,"Pregnancy, Childbirth and the Puerperium",1,Minor,Minor,Surgical,Blue Cross/Blue Shield,,,,N,N,23841.79,6590.46
Long Island,Nassau,2908000,000511,NYU Winthrop Hospital,30 to 49,117,F,White,Not Span/Hispanic,4,Elective,Home or Self Care,2017,189,Previous C-section,134,CESAREAN SECTION,540,Cesarean delivery,14,"Pregnancy, Childbirth and the Puerperium",1,Minor,Minor,Surgical,Blue Cross/Blue Shield,,,,N,N,31995.93,8316.33
Long Island,Nassau,2908000,000511,NYU Winthrop Hospital,30 to 49,112,F,Black/African American,Not Span/Hispanic,3,Elective,Home or Self Care,2017,189,Previous C-section,134,CESAREAN SECTION,540,Cesarean delivery,14,"Pregnancy, Childbirth and the Puerperium",1,Minor,Minor,Surgical,Private Health Insurance,,,,N,N,18497.08,5365.40
Long Island,Nassau,2908000,000511,NYU Winthrop Hospital,30 to 49,114,F,Black/African American,Not Span/Hispanic,4,Emergency,Home or Self Care,2017,189,Previous C-section,134,CESAREAN SECTION,540,Cesarean delivery,14,"Pregnancy, Childbirth and the Puerperium",1,Minor,Minor,Surgical,Private Health Insurance,,,,N,N,25956.47,6768.18
Long Island,Nassau,2908000,000511,NYU Winthrop Hospital,30 to 49,113,F,White,Not Span/Hispanic,3,Elective,Home or Self Care,2017,181,Other complications of pregnancy,134,CESAREAN SECTION,540,Cesarean delivery,14,"Pregnancy, Childbirth and the Puerperium",1,Minor,Minor,Surgical,Private Health Insurance,,,,N,N,21623.10,6053.42
Long Island,Nassau,2908000,000511,NYU Winthrop Hospital,30 to 49,117,F,White,Not Span/Hispanic,3,Emergency,Home or Self Care,2017,189,Previous C-section,134,CESAREAN SECTION,540,Cesarean delivery,14,"Pregnancy, Childbirth and the Puerperium",1,Minor,Minor,Surgical,Private Health Insurance,,,,N,N,19237.56,5306.43
Long Island,Nassau,2908000,000511,NYU Winthrop Hospital,18 to 29,117,F,White,Not Span/Hispanic,3,Elective,Home or Self Care,2017,189,Previous C-section,134,CESAREAN SECTION,540,Cesarean delivery,14,"Pregnancy, Childbirth and the Puerperium",1,Minor,Minor,Surgical,Private Health Insurance,,,,N,N,22533.66,6380.66
Long Island,Nassau,2908000,000511,NYU Winthrop Hospital,30 to 49,117,F,White,Spanish/Hispanic,3,Elective,Home or Self Care,2017,189,Previous C-section,134,CESAREAN SECTION,540,Cesarean delivery,14,"Pregnancy, Childbirth and the Puerperium",1,Minor,Minor,Surgical,Blue Cross/Blue Shield,,,,N,N,21089.11,5611.25
Long Island,Nassau,2908000,000511,NYU Winthrop Hospital,30 to 49,110,F,White,Not Span/Hispanic,3,Elective,Home or Self Care,2017,189,Previous C-section,134,CESAREAN SECTION,540,Cesarean delivery,14,"Pregnancy, Childbirth and the Puerperium",1,Minor,Minor,Surgical,Blue Cross/Blue Shield,Blue Cross/Blue Shield,,,N,N,26789.45,6906.80
Long Island,Nassau,2908000,000511,NYU Winthrop Hospital,30 to 49,117,F,White,Not Span/Hispanic,3,Emergency,Home or Self Care,2017,187,Malposition; malpresentation,134,CESAREAN SECTION,540,Cesarean delivery,14,"Pregnancy, Childbirth and the Puerperium",2,Moderate,Minor,Surgical,Private Health Insurance,,,,N,N,25111.82,6868.28
Long Island,Nassau,2908000,000511,NYU Winthrop Hospital,30 to 49,115,F,White,Spanish/Hispanic,3,Emergency,Home or Self Care,2017,189,Previous C-section,134,CESAREAN SECTION,540,Cesarean delivery,14,"Pregnancy, Childbirth and the Puerperium",1,Minor,Minor,Surgical,Private Health Insurance,,,,N,N,20959.77,5888.41
Long Island,Nassau,2908000,000511,NYU Winthrop Hospital,30 to 49,117,F,White,Not Span/Hispanic,3,Elective,Home or Self Care,2017,189,Previous C-section,134,CESAREAN SECTION,540,Cesarean delivery,14,"Pregnancy, Childbirth and the Puerperium",1,Minor,Minor,Surgical,Blue Cross/Blue Shield,,,,N,N,64628.75,15964.73
Long Island,Nassau,2908000,000511,NYU Winthrop Hospital,30 to 49,117,F,White,Not Span/Hispanic,3,Elective,Home or Self Care,2017,189,Previous C-section,134,CESAREAN SECTION,540,Cesarean delivery,14,"Pregnancy, Childbirth and the Puerperium",1,Minor,Minor,Surgical,Medicaid,Medicaid,,,N,N,15872.76,4633.28
Long Island,Nassau,2908000,000511,NYU Winthrop Hospital,30 to 49,110,F,White,Not Span/Hispanic,3,Elective,Home or Self Care,2017,189,Previous C-section,134,CESAREAN SECTION,540,Cesarean delivery,14,"Pregnancy, Childbirth and the Puerperium",1,Minor,Minor,Surgical,Federal/State/Local/VA,,,,N,N,18659.91,5369.66
Long Island,Nassau,2908000,000511,NYU Winthrop Hospital,30 to 49,117,F,White,Spanish/Hispanic,3,Emergency,Home or Self Care,2017,189,Previous C-section,134,CESAREAN SECTION,540,Cesarean delivery,14,"Pregnancy, Childbirth and the Puerperium",1,Minor,Minor,Surgical,Private Health Insurance,,,,N,N,18799.41,5427.02
Long Island,Nassau,2908000,000511,NYU Winthrop Hospital,30 to 49,115,F,Other Race,Not Span/Hispanic,4,Emergency,Home or Self Care,2017,189,Previous C-section,134,CESAREAN SECTION,540,Cesarean delivery,14,"Pregnancy, Childbirth and the Puerperium",1,Minor,Minor,Surgical,Private Health Insurance,,,,N,N,24855.20,6967.84
Long Island,Nassau,2908000,000511,NYU Winthrop Hospital,30 to 49,115,F,White,Not Span/Hispanic,2,Elective,Home or Self Care,2017,189,Previous C-section,134,CESAREAN SECTION,540,Cesarean delivery,14,"Pregnancy, Childbirth and the Puerperium",1,Minor,Minor,Surgical,Blue Cross/Blue Shield,,,,N,N,15567.43,4433.76
Long Island,Nassau,2908000,000511,NYU Winthrop Hospital,30 to 49,117,F,White,Not Span/Hispanic,3,Elective,Home or Self Care,2017,189,Previous C-section,134,CESAREAN SECTION,540,Cesarean delivery,14,"Pregnancy, Childbirth and the Puerperium",1,Minor,Minor,Surgical,Blue Cross/Blue Shield,,,,N,N,21118.28,5817.39
Long Island,Nassau,2908000,000511,NYU Winthrop Hospital,30 to 49,113,F,White,Spanish/Hispanic,3,Elective,Home or Self Care,2017,189,Previous C-section,134,CESAREAN SECTION,540,Cesarean delivery,14,"Pregnancy, Childbirth and the Puerperium",1,Minor,Minor,Surgical,Private Health Insurance,,,,N,N,22975.56,6714.30
Long Island,Nassau,2908000,000511,NYU Winthrop Hospital,18 to 29,117,F,Other Race,Not Span/Hispanic,3,Elective,Home or Self Care,2017,189,Previous C-section,134,CESAREAN SECTION,540,Cesarean delivery,14,"Pregnancy, Childbirth and the Puerperium",1,Minor,Minor,Surgical,Federal/State/Local/VA,,,,N,N,21255.59,6316.74
Long Island,Nassau,2908000,000511,NYU Winthrop Hospital,18 to 29,117,F,White,Not Span/Hispanic,3,Elective,Home or Self Care,2017,187,Malposition; malpresentation,134,CESAREAN SECTION,540,Cesarean delivery,14,"Pregnancy, Childbirth and the Puerperium",1,Minor,Minor,Surgical,Medicaid,Medicaid,,,N,N,23709.20,6192.53
Long Island,Nassau,2908000,000511,NYU Winthrop Hospital,30 to 49,115,F,Black/African American,Not Span/Hispanic,4,Emergency,Home or Self Care,2017,189,Previous C-section,134,CESAREAN SECTION,540,Cesarean delivery,14,"Pregnancy, Childbirth and the Puerperium",1,Minor,Minor,Surgical,Blue Cross/Blue Shield,,,,N,N,24113.06,6980.40
Long Island,Nassau,2908000,000511,NYU Winthrop Hospital,30 to 49,115,F,Other Race,Spanish/Hispanic,4,Elective,Home or Self Care,2017,189,Previous C-section,134,CESAREAN SECTION,540,Cesarean delivery,14,"Pregnancy, Childbirth and the Puerperium",1,Minor,Minor,Surgical,Medicaid,,,,N,N,23985.08,6452.08
Long Island,Nassau,2908000,000511,NYU Winthrop Hospital,30 to 49,118,F,White,Not Span/Hispanic,3,Elective,Home or Self Care,2017,189,Previous C-section,134,CESAREAN SECTION,540,Cesarean delivery,14,"Pregnancy, Childbirth and the Puerperium",1,Minor,Minor,Surgical,Private Health Insurance,,,,N,N,22144.66,5990.85
Long Island,Nassau,2908000,000511,NYU Winthrop Hospital,30 to 49,117,F,White,Not Span/Hispanic,3,Emergency,Home or Self Care,2017,189,Previous C-section,134,CESAREAN SECTION,540,Cesarean delivery,14,"Pregnancy, Childbirth and the Puerperium",1,Minor,Minor,Surgical,Blue Cross/Blue Shield,,,,N,N,21229.97,6194.72
Long Island,Nassau,2908000,000511,NYU Winthrop Hospital,18 to 29,115,F,White,Not Span/Hispanic,3,Elective,Home or Self Care,2017,181,Other complications of pregnancy,134,CESAREAN SECTION,540,Cesarean delivery,14,"Pregnancy, Childbirth and the Puerperium",1,Minor,Minor,Surgical,Blue Cross/Blue Shield,,,,N,N,20416.11,5371.16
Long Island,Nassau,2908000,000511,NYU Winthrop Hospital,30 to 49,115,F,White,Spanish/Hispanic,39,Emergency,Home or Self Care,2017,181,Other complications of pregnancy,134,CESAREAN SECTION,540,Cesarean delivery,14,"Pregnancy, Childbirth and the Puerperium",3,Major,Minor,Surgical,Medicaid,Medicaid,,,N,N,252321.36,70612.20
Long Island,Nassau,2908000,000511,NYU Winthrop Hospital,30 to 49,110,F,White,Not Span/Hispanic,3,Elective,Home or Self Care,2017,189,Previous C-section,134,CESAREAN SECTION,540,Cesarean delivery,14,"Pregnancy, Childbirth and the Puerperium",1,Minor,Minor,Surgical,Medicaid,Medicaid,,,N,N,20053.79,5688.62
Long Island,Nassau,2908000,000511,NYU Winthrop Hospital,30 to 49,115,F,Other Race,Spanish/Hispanic,3,Elective,Home or Self Care,2017,189,Previous C-section,134,CESAREAN SECTION,540,Cesarean delivery,14,"Pregnancy, Childbirth and the Puerperium",1,Minor,Minor,Surgical,Medicaid,Medicaid,,,N,N,19938.46,5701.65
Long Island,Nassau,2908000,000511,NYU Winthrop Hospital,18 to 29,115,F,Other Race,Spanish/Hispanic,4,Emergency,Home or Self Care,2017,182,Hemorrhage during pregnancy; abruptio placenta; placenta previa,134,CESAREAN SECTION,540,Cesarean delivery,14,"Pregnancy, Childbirth and the Puerperium",2,Moderate,Minor,Surgical,Private Health Insurance,Medicaid,Medicaid,,N,N,39424.15,9831.40
Long Island,Nassau,2908000,000511,NYU Winthrop Hospital,18 to 29,115,F,Black/African American,Not Span/Hispanic,3,Emergency,Home or Self Care,2017,189,Previous C-section,134,CESAREAN SECTION,540,Cesarean delivery,14,"Pregnancy, Childbirth and the Puerperium",1,Minor,Minor,Surgical,Medicaid,Medicaid,,,N,N,20373.00,5645.90
Long Island,Nassau,2908000,000511,NYU Winthrop Hospital,30 to 49,118,F,Other Race,Not Span/Hispanic,3,Elective,Home or Self Care,2017,189,Previous C-section,134,CESAREAN SECTION,540,Cesarean delivery,14,"Pregnancy, Childbirth and the Puerperium",1,Minor,Minor,Surgical,Private Health Insurance,,,,N,N,20493.63,5919.77
Long Island,Nassau,2908000,000511,NYU Winthrop Hospital,18 to 29,114,F,White,Not Span/Hispanic,3,Elective,Home or Self Care,2017,189,Previous C-section,134,CESAREAN SECTION,540,Cesarean delivery,14,"Pregnancy, Childbirth and the Puerperium",1,Minor,Minor,Surgical,Private Health Insurance,,,,N,N,20106.16,5538.84
Long Island,Nassau,2908000,000511,NYU Winthrop Hospital,30 to 49,117,F,White,Not Span/Hispanic,5,Emergency,Home or Self Care,2017,196,Other pregnancy and delivery including normal,134,CESAREAN SECTION,540,Cesarean delivery,14,"Pregnancy, Childbirth and the Puerperium",2,Moderate,Minor,Surgical,Private Health Insurance,,,,N,N,34887.13,9715.87
Long Island,Nassau,2908000,000511,NYU Winthrop Hospital,30 to 49,110,F,White,Not Span/Hispanic,3,Elective,Home or Self Care,2017,189,Previous C-section,134,CESAREAN SECTION,540,Cesarean delivery,14,"Pregnancy, Childbirth and the Puerperium",1,Minor,Minor,Surgical,Private Health Insurance,,,,N,N,23224.04,6479.87
Long Island,Nassau,2908000,000511,NYU Winthrop Hospital,30 to 49,117,F,White,Not Span/Hispanic,3,Elective,Home or Self Care,2017,181,Other complications of pregnancy,134,CESAREAN SECTION,540,Cesarean delivery,14,"Pregnancy, Childbirth and the Puerperium",1,Minor,Minor,Surgical,Private Health Insurance,,,,N,N,18570.01,5135.47
Long Island,Nassau,2908000,000511,NYU Winthrop Hospital,30 to 49,115,F,White,Not Span/Hispanic,3,Elective,Home or Self Care,2017,181,Other complications of pregnancy,134,CESAREAN SECTION,540,Cesarean delivery,14,"Pregnancy, Childbirth and the Puerperium",1,Minor,Minor,Surgical,Blue Cross/Blue Shield,,,,N,N,18127.90,5011.14
Long Island,Nassau,2908000,000511,NYU Winthrop Hospital,30 to 49,117,F,White,Not Span/Hispanic,3,Emergency,Home or Self Care,2017,189,Previous C-section,134,CESAREAN SECTION,540,Cesarean delivery,14,"Pregnancy, Childbirth and the Puerperium",1,Minor,Minor,Surgical,Private Health Insurance,,,,N,N,22748.48,5646.61
Long Island,Nassau,2908000,000511,NYU Winthrop Hospital,30 to 49,118,F,Other Race,Not Span/Hispanic,3,Elective,Home or Self Care,2017,186,Diabetes or abnormal glucose tolerance complicating pregnancy; childbirth; or the puerperium,134,CESAREAN SECTION,540,Cesarean delivery,14,"Pregnancy, Childbirth and the Puerperium",1,Minor,Minor,Surgical,Private Health Insurance,Self-Pay,,,N,N,21491.69,5889.89
Long Island,Nassau,2908000,000511,NYU Winthrop Hospital,30 to 49,115,F,Other Race,Spanish/Hispanic,3,Emergency,Home or Self Care,2017,189,Previous C-section,134,CESAREAN SECTION,540,Cesarean delivery,14,"Pregnancy, Childbirth and the Puerperium",1,Minor,Minor,Surgical,Medicaid,Medicaid,,,N,N,20352.23,6035.97
Long Island,Nassau,2908000,000511,NYU Winthrop Hospital,18 to 29,117,F,White,Not Span/Hispanic,3,Emergency,Home or Self Care,2017,187,Malposition; malpresentation,134,CESAREAN SECTION,540,Cesarean delivery,14,"Pregnancy, Childbirth and the Puerperium",1,Minor,Minor,Surgical,Blue Cross/Blue Shield,,,,N,N,18275.09,5256.16
Long Island,Nassau,2908000,000511,NYU Winthrop Hospital,18 to 29,118,F,White,Not Span/Hispanic,3,Emergency,Home or Self Care,2017,184,Early or threatened labor,134,CESAREAN SECTION,540,Cesarean delivery,14,"Pregnancy, Childbirth and the Puerperium",2,Moderate,Minor,Surgical,Private Health Insurance,,,,N,N,30241.82,8150.16
Long Island,Nassau,2908000,000511,NYU Winthrop Hospital,30 to 49,115,F,Black/African American,Not Span/Hispanic,7,Emergency,Home or Self Care,2017,191,Polyhydramnios and other problems of amniotic cavity,134,CESAREAN SECTION,540,Cesarean delivery,14,"Pregnancy, Childbirth and the Puerperium",2,Moderate,Minor,Surgical,Blue Cross/Blue Shield,,,,N,N,42888.15,11192.69
Long Island,Nassau,2908000,000511,NYU Winthrop Hospital,18 to 29,115,F,White,Spanish/Hispanic,3,Emergency,Home or Self Care,2017,189,Previous C-section,134,CESAREAN SECTION,540,Cesarean delivery,14,"Pregnancy, Childbirth and the Puerperium",1,Minor,Minor,Surgical,Medicaid,Medicaid,,,N,N,30240.00,8217.10
Long Island,Nassau,2908000,000511,NYU Winthrop Hospital,30 to 49,117,F,White,Not Span/Hispanic,9,Urgent,Home or Self Care,2017,191,Polyhydramnios and other problems of amniotic cavity,134,CESAREAN SECTION,540,Cesarean delivery,14,"Pregnancy, Childbirth and the Puerperium",1,Minor,Minor,Surgical,Blue Cross/Blue Shield,,,,N,N,44500.64,11559.68
Long Island,Nassau,2908000,000511,NYU Winthrop Hospital,30 to 49,117,F,White,Not Span/Hispanic,4,Urgent,Home or Self Care,2017,195,Other complications of birth; puerperium affecting management of mother,134,CESAREAN SECTION,540,Cesarean delivery,14,"Pregnancy, Childbirth and the Puerperium",3,Major,Minor,Surgical,Blue Cross/Blue Shield,,,,N,N,31726.37,8655.34
Long Island,Nassau,2908000,000511,NYU Winthrop Hospital,18 to 29,117,F,White,Not Span/Hispanic,4,Emergency,Home or Self Care,2017,195,Other complications of birth; puerperium affecting management of mother,134,CESAREAN SECTION,540,Cesarean delivery,14,"Pregnancy, Childbirth and the Puerperium",2,Moderate,Minor,Surgical,Blue Cross/Blue Shield,,,,N,N,27120.79,7438.07
Long Island,Nassau,2908000,000511,NYU Winthrop Hospital,30 to 49,117,F,White,Not Span/Hispanic,4,Emergency,Home or Self Care,2017,195,Other complications of birth; puerperium affecting management of mother,134,CESAREAN SECTION,540,Cesarean delivery,14,"Pregnancy, Childbirth and the Puerperium",1,Minor,Minor,Surgical,Blue Cross/Blue Shield,,,,N,N,28701.57,7982.55
Long Island,Nassau,2908000,000511,NYU Winthrop Hospital,30 to 49,117,F,White,Not Span/Hispanic,3,Emergency,Home or Self Care,2017,181,Other complications of pregnancy,134,CESAREAN SECTION,540,Cesarean delivery,14,"Pregnancy, Childbirth and the Puerperium",1,Minor,Minor,Surgical,Blue Cross/Blue Shield,,,,N,N,33614.46,8857.43
Long Island,Nassau,2908000,000511,NYU Winthrop Hospital,18 to 29,110,F,White,Not Span/Hispanic,5,Emergency,Home or Self Care,2017,185,Prolonged pregnancy,134,CESAREAN SECTION,540,Cesarean delivery,14,"Pregnancy, Childbirth and the Puerperium",1,Minor,Minor,Surgical,Private Health Insurance,,,,N,N,29538.17,8103.86
Long Island,Nassau,2908000,000511,NYU Winthrop Hospital,18 to 29,115,F,Other Race,Not Span/Hispanic,2,Emergency,Home or Self Care,2017,195,Other complications of birth; puerperium affecting management of mother,134,CESAREAN SECTION,540,Cesarean delivery,14,"Pregnancy, Childbirth and the Puerperium",2,Moderate,Minor,Surgical,Federal/State/Local/VA,,,,N,N,20017.40,5299.38
Long Island,Nassau,2908000,000511,NYU Winthrop Hospital,30 to 49,117,F,Other Race,Not Span/Hispanic,3,Emergency,Home or Self Care,2017,187,Malposition; malpresentation,134,CESAREAN SECTION,540,Cesarean delivery,14,"Pregnancy, Childbirth and the Puerperium",1,Minor,Minor,Surgical,Private Health Insurance,,,,N,N,19307.96,5415.25
Long Island,Nassau,2908000,000511,NYU Winthrop Hospital,30 to 49,117,F,White,Not Span/Hispanic,4,Emergency,Home or Self Care,2017,186,Diabetes or abnormal glucose tolerance complicating pregnancy; childbirth; or the puerperium,134,CESAREAN SECTION,540,Cesarean delivery,14,"Pregnancy, Childbirth and the Puerperium",1,Minor,Minor,Surgical,Federal/State/Local/VA,,,,N,N,27640.81,7235.02
Long Island,Nassau,2908000,000511,NYU Winthrop Hospital,30 to 49,115,F,White,Not Span/Hispanic,3,Urgent,Home or Self Care,2017,189,Previous C-section,134,CESAREAN SECTION,540,Cesarean delivery,14,"Pregnancy, Childbirth and the Puerperium",1,Minor,Minor,Surgical,Blue Cross/Blue Shield,,,,N,N,23962.52,6501.80
Long Island,Nassau,2908000,000511,NYU Winthrop Hospital,18 to 29,115,F,Black/African American,Not Span/Hispanic,4,Emergency,Home or Self Care,2017,181,Other complications of pregnancy,134,CESAREAN SECTION,540,Cesarean delivery,14,"Pregnancy, Childbirth and the Puerperium",2,Moderate,Minor,Surgical,Private Health Insurance,Medicaid,,,N,N,24841.17,6502.41
Long Island,Nassau,2908000,000511,NYU Winthrop Hospital,18 to 29,115,F,Other Race,Spanish/Hispanic,5,Emergency,Home or Self Care,2017,190,Fetal distress and abnormal forces of labor,134,CESAREAN SECTION,540,Cesarean delivery,14,"Pregnancy, Childbirth and the Puerperium",2,Moderate,Minor,Surgical,Medicaid,Medicaid,,,N,N,38495.42,10955.06
Long Island,Nassau,2908000,000511,NYU Winthrop Hospital,30 to 49,115,F,Black/African American,Not Span/Hispanic,9,Emergency,Home or Self Care,2017,191,Polyhydramnios and other problems of amniotic cavity,134,CESAREAN SECTION,540,Cesarean delivery,14,"Pregnancy, Childbirth and the Puerperium",2,Moderate,Minor,Surgical,Medicaid,Medicaid,,,N,N,62909.81,16938.48
Long Island,Nassau,2908000,000511,NYU Winthrop Hospital,30 to 49,110,F,White,Not Span/Hispanic,3,Elective,Home or Self Care,2017,189,Previous C-section,134,CESAREAN SECTION,540,Cesarean delivery,14,"Pregnancy, Childbirth and the Puerperium",1,Minor,Minor,Surgical,Private Health Insurance,,,,N,N,18705.63,4948.17
Long Island,Nassau,2908000,000511,NYU Winthrop Hospital,30 to 49,115,F,White,Not Span/Hispanic,3,Emergency,Home or Self Care,2017,185,Prolonged pregnancy,134,CESAREAN SECTION,540,Cesarean delivery,14,"Pregnancy, Childbirth and the Puerperium",2,Moderate,Minor,Surgical,Blue Cross/Blue Shield,,,,N,N,23402.26,6227.52
Long Island,Nassau,2908000,000511,NYU Winthrop Hospital,30 to 49,110,F,White,Not Span/Hispanic,7,Emergency,Home w/ Home Health Services,2017,183,Hypertension complicating pregnancy; childbirth and the puerperium,134,CESAREAN SECTION,540,Cesarean delivery,14,"Pregnancy, Childbirth and the Puerperium",2,Moderate,Minor,Surgical,Medicaid,Medicaid,,,N,N,45100.18,11562.90
Long Island,Nassau,2908000,000511,NYU Winthrop Hospital,30 to 49,115,F,Black/African American,Not Span/Hispanic,5,Emergency,Home or Self Care,2017,183,Hypertension complicating pregnancy; childbirth and the puerperium,134,CESAREAN SECTION,540,Cesarean delivery,14,"Pregnancy, Childbirth and the Puerperium",2,Moderate,Minor,Surgical,Federal/State/Local/VA,,,,N,N,34639.31,8924.66
Long Island,Nassau,2908000,000511,NYU Winthrop Hospital,30 to 49,117,F,White,Spanish/Hispanic,4,Emergency,Home or Self Care,2017,191,Polyhydramnios and other problems of amniotic cavity,134,CESAREAN SECTION,540,Cesarean delivery,14,"Pregnancy, Childbirth and the Puerperium",2,Moderate,Minor,Surgical,Blue Cross/Blue Shield,,,,N,N,30178.84,8222.16
Long Island,Nassau,2908000,000511,NYU Winthrop Hospital,18 to 29,115,F,White,Spanish/Hispanic,4,Emergency,Home or Self Care,2017,183,Hypertension complicating pregnancy; childbirth and the puerperium,134,CESAREAN SECTION,540,Cesarean delivery,14,"Pregnancy, Childbirth and the Puerperium",1,Minor,Minor,Surgical,Medicaid,Medicaid,,,N,N,24818.71,6532.09
Long Island,Nassau,2908000,000511,NYU Winthrop Hospital,30 to 49,117,F,White,Not Span/Hispanic,4,Urgent,Home or Self Care,2017,189,Previous C-section,134,CESAREAN SECTION,540,Cesarean delivery,14,"Pregnancy, Childbirth and the Puerperium",1,Minor,Minor,Surgical,Private Health Insurance,,,,N,N,31245.29,7970.72
Long Island,Nassau,2908000,000511,NYU Winthrop Hospital,30 to 49,115,F,Black/African American,Not Span/Hispanic,5,Emergency,Home or Self Care,2017,195,Other complications of birth; puerperium affecting management of mother,134,CESAREAN SECTION,540,Cesarean delivery,14,"Pregnancy, Childbirth and the Puerperium",2,Moderate,Minor,Surgical,Private Health Insurance,Medicaid,,,N,N,58959.95,16667.23
Long Island,Nassau,2908000,000511,NYU Winthrop Hospital,30 to 49,118,F,Other Race,Not Span/Hispanic,4,Emergency,Home or Self Care,2017,189,Previous C-section,134,CESAREAN SECTION,540,Cesarean delivery,14,"Pregnancy, Childbirth and the Puerperium",1,Minor,Minor,Surgical,Private Health Insurance,,,,N,N,29993.23,8316.20
Long Island,Nassau,2908000,000511,NYU Winthrop Hospital,30 to 49,115,F,Other Race,Spanish/Hispanic,4,Emergency,Home or Self Care,2017,196,Other pregnancy and delivery including normal,134,CESAREAN SECTION,540,Cesarean delivery,14,"Pregnancy, Childbirth and the Puerperium",3,Major,Minor,Surgical,Medicaid,Medicaid,,,N,N,29264.07,8009.38
Long Island,Nassau,2908000,000511,NYU Winthrop Hospital,30 to 49,110,F,White,Not Span/Hispanic,3,Urgent,Home or Self Care,2017,183,Hypertension complicating pregnancy; childbirth and the puerperium,134,CESAREAN SECTION,540,Cesarean delivery,14,"Pregnancy, Childbirth and the Puerperium",1,Minor,Minor,Surgical,Private Health Insurance,,,,N,N,39371.03,9931.38