Hospital Service Area,Hospital County,Operating Certificate Number,Permanent Facility Id,Facility Name,Age Group,Zip Code - 3 digits,Gender,Race,Ethnicity,Length of Stay,Type of Admission,Patient Disposition,Discharge Year,CCS Diagnosis Code,CCS Diagnosis Description,CCS Procedure Code,CCS Procedure Description,APR DRG Code,APR DRG Description,APR MDC Code,APR MDC Description,APR Severity of Illness Code,APR Severity of Illness Description,APR Risk of Mortality,APR Medical Surgical Description,Payment Typology 1,Payment Typology 2,Payment Typology 3,Birth Weight,Abortion Edit Indicator,Emergency Department Indicator,Total Charges,Total Costs
New York City,Manhattan,7002001,001438,Bellevue Hospital Center,30 to 49,112,F,Other Race,Spanish/Hispanic,10,Urgent,Home or Self Care,2020,PRG020,HYPERTENSION AND HYPERTENSIVE-RELATED CONDITIONS COMPLICATING PREGNANCY; CHILDBIRTH; AND THE PUERPERIUM,PGN003,CESAREAN SECTION,540,CESAREAN SECTION W/O STERILIZATION,14,"PREGNANCY, CHILDBIRTH AND THE PUERPERIUM",2,Moderate,Minor,Surgical,Medicaid,,,,,N,69031.87,39699.12
New York City,Manhattan,7002001,001438,Bellevue Hospital Center,30 to 49,112,F,Black/African American,Not Span/Hispanic,4,Elective,Home or Self Care,2020,PRG023,COMPLICATIONS SPECIFIED DURING CHILDBIRTH,PGN003,CESAREAN SECTION,540,CESAREAN SECTION W/O STERILIZATION,14,"PREGNANCY, CHILDBIRTH AND THE PUERPERIUM",2,Moderate,Minor,Surgical,Medicaid,,,,,N,66707.15,38362.21
New York City,Manhattan,7002001,001438,Bellevue Hospital Center,18 to 29,104,F,Other Race,Spanish/Hispanic,3,Elective,Home or Self Care,2020,PRG019,DIABETES OR ABNORMAL GLUCOSE TOLERANCE COMPLICATING PREGNANCY; CHILDBIRTH; OR THE PUERPERIUM,PGN003,CESAREAN SECTION,540,CESAREAN SECTION W/O STERILIZATION,14,"PREGNANCY, CHILDBIRTH AND THE PUERPERIUM",2,Moderate,Minor,Surgical,Medicaid,,,,,N,30792.85,17708.48
New York City,Manhattan,7002001,001438,Bellevue Hospital Center,18 to 29,100,F,Other Race,Spanish/Hispanic,3,Urgent,Home or Self Care,2020,PRG013,MATERNAL CARE RELATED TO FETAL CONDITIONS,PGN003,CESAREAN SECTION,540,CESAREAN SECTION W/O STERILIZATION,14,"PREGNANCY, CHILDBIRTH AND THE PUERPERIUM",2,Moderate,Minor,Surgical,Medicaid,,,,,N,33412.91,19215.23
New York City,Manhattan,7002001,001438,Bellevue Hospital Center,18 to 29,113,F,White,Not Span/Hispanic,3,Urgent,Home or Self Care,2020,PRG014,POLYHYDRAMNIOS AND OTHER PROBLEMS OF AMNIOTIC CAVITY,PGN003,CESAREAN SECTION,540,CESAREAN SECTION W/O STERILIZATION,14,"PREGNANCY, CHILDBIRTH AND THE PUERPERIUM",1,Minor,Minor,Surgical,Medicaid,,,,,N,35966.18,20683.57
New York City,Manhattan,7002001,001438,Bellevue Hospital Center,30 to 49,112,F,Other Race,Spanish/Hispanic,4,Urgent,Home or Self Care,2020,PRG020,HYPERTENSION AND HYPERTENSIVE-RELATED CONDITIONS COMPLICATING PREGNANCY; CHILDBIRTH; AND THE PUERPERIUM,PGN003,CESAREAN SECTION,540,CESAREAN SECTION W/O STERILIZATION,14,"PREGNANCY, CHILDBIRTH AND THE PUERPERIUM",3,Major,Minor,Surgical,Medicaid,,,,,N,139163.46,80030.68
New York City,Manhattan,7002001,001438,Bellevue Hospital Center,30 to 49,113,F,Other Race,Spanish/Hispanic,5,Urgent,Home or Self Care,2020,PRG018,MATERNAL CARE RELATED TO DISORDERS OF THE PLACENTA AND PLACENTAL IMPLANTATION,PGN003,CESAREAN SECTION,540,CESAREAN SECTION W/O STERILIZATION,14,"PREGNANCY, CHILDBIRTH AND THE PUERPERIUM",2,Moderate,Minor,Surgical,Medicaid,,,,,N,36945.44,21246.73
New York City,Manhattan,7002001,001438,Bellevue Hospital Center,30 to 49,100,F,Other Race,Spanish/Hispanic,5,Emergency,Home or Self Care,2020,PRG016,PREVIOUS C-SECTION,PGN003,CESAREAN SECTION,540,CESAREAN SECTION W/O STERILIZATION,14,"PREGNANCY, CHILDBIRTH AND THE PUERPERIUM",1,Minor,Minor,Surgical,Medicaid,,,,,Y,50358,28960.08
New York City,Manhattan,7002001,001438,Bellevue Hospital Center,18 to 29,113,F,Black/African American,Not Span/Hispanic,5,Urgent,Home or Self Care,2020,PRG016,PREVIOUS C-SECTION,PGN003,CESAREAN SECTION,540,CESAREAN SECTION W/O STERILIZATION,14,"PREGNANCY, CHILDBIRTH AND THE PUERPERIUM",1,Minor,Minor,Surgical,Medicaid,,,,,Y,44292.22,25471.75
New York City,Manhattan,7002001,001438,Bellevue Hospital Center,18 to 29,112,F,Other Race,Spanish/Hispanic,3,Elective,Home or Self Care,2020,PRG016,PREVIOUS C-SECTION,PGN003,CESAREAN SECTION,540,CESAREAN SECTION W/O STERILIZATION,14,"PREGNANCY, CHILDBIRTH AND THE PUERPERIUM",1,Minor,Minor,Surgical,Medicaid,,,,,N,29892.7,17190.81
New York City,Manhattan,7002001,001438,Bellevue Hospital Center,30 to 49,112,F,Other Race,Spanish/Hispanic,11,Urgent,Home or Self Care,2020,PRG020,HYPERTENSION AND HYPERTENSIVE-RELATED CONDITIONS COMPLICATING PREGNANCY; CHILDBIRTH; AND THE PUERPERIUM,PGN003,CESAREAN SECTION,540,CESAREAN SECTION W/O STERILIZATION,14,"PREGNANCY, CHILDBIRTH AND THE PUERPERIUM",3,Major,Minor,Surgical,Medicaid,,,,,N,68794.07,39562.37
New York City,Manhattan,7002001,001438,Bellevue Hospital Center,30 to 49,112,F,Other Race,Spanish/Hispanic,5,Emergency,Home or Self Care,2020,PRG023,COMPLICATIONS SPECIFIED DURING CHILDBIRTH,PGN003,CESAREAN SECTION,540,CESAREAN SECTION W/O STERILIZATION,14,"PREGNANCY, CHILDBIRTH AND THE PUERPERIUM",3,Major,Minor,Surgical,Private Health Insurance,Medicaid,Medicaid,,,N,39897.68,22944.52
New York City,Manhattan,7002001,001438,Bellevue Hospital Center,30 to 49,100,F,White,Not Span/Hispanic,3,Elective,Home or Self Care,2020,PRG016,PREVIOUS C-SECTION,PGN003,CESAREAN SECTION,540,CESAREAN SECTION W/O STERILIZATION,14,"PREGNANCY, CHILDBIRTH AND THE PUERPERIUM",1,Minor,Minor,Surgical,Medicaid,,,,,N,29416.28,16916.83
New York City,Manhattan,7002001,001438,Bellevue Hospital Center,30 to 49,112,F,Other Race,Spanish/Hispanic,3,Urgent,Home or Self Care,2020,PRG024,"MALPOSITION, DISPROPORTION OR OTHER LABOR COMPLICATIONS",PGN003,CESAREAN SECTION,540,CESAREAN SECTION W/O STERILIZATION,14,"PREGNANCY, CHILDBIRTH AND THE PUERPERIUM",1,Minor,Minor,Surgical,Medicaid,,,,,N,29815.6,17146.47
New York City,Manhattan,7002001,001438,Bellevue Hospital Center,18 to 29,113,F,Other Race,Spanish/Hispanic,3,Elective,Home or Self Care,2020,PRG016,PREVIOUS C-SECTION,PGN003,CESAREAN SECTION,540,CESAREAN SECTION W/O STERILIZATION,14,"PREGNANCY, CHILDBIRTH AND THE PUERPERIUM",1,Minor,Minor,Surgical,Medicaid,,,,,N,37894.02,21792.24
New York City,Manhattan,7002001,001438,Bellevue Hospital Center,30 to 49,100,F,Other Race,Spanish/Hispanic,3,Elective,Home or Self Care,2020,PRG018,MATERNAL CARE RELATED TO DISORDERS OF THE PLACENTA AND PLACENTAL IMPLANTATION,PGN001,FETAL HEART RATE MONITORING,540,CESAREAN SECTION W/O STERILIZATION,14,"PREGNANCY, CHILDBIRTH AND THE PUERPERIUM",2,Moderate,Minor,Surgical,Medicaid,,,,,N,30191.61,17362.71
New York City,Manhattan,7002001,001438,Bellevue Hospital Center,30 to 49,112,F,Other Race,Not Span/Hispanic,16,Urgent,Home or Self Care,2020,PRG011,EARLY OR THREATENED LABOR,PGN003,CESAREAN SECTION,540,CESAREAN SECTION W/O STERILIZATION,14,"PREGNANCY, CHILDBIRTH AND THE PUERPERIUM",3,Major,Minor,Surgical,Private Health Insurance,Medicaid,,,,N,93543.59,53795.42
New York City,Manhattan,7002001,001438,Bellevue Hospital Center,30 to 49,112,F,Other Race,Spanish/Hispanic,3,Elective,Home or Self Care,2020,PRG016,PREVIOUS C-SECTION,PGN003,CESAREAN SECTION,540,CESAREAN SECTION W/O STERILIZATION,14,"PREGNANCY, CHILDBIRTH AND THE PUERPERIUM",1,Minor,Minor,Surgical,Private Health Insurance,,,,,N,31573.78,18157.58
New York City,Manhattan,7002001,001438,Bellevue Hospital Center,18 to 29,112,F,Other Race,Spanish/Hispanic,5,Emergency,Home or Self Care,2020,PRG023,COMPLICATIONS SPECIFIED DURING CHILDBIRTH,PGN003,CESAREAN SECTION,540,CESAREAN SECTION W/O STERILIZATION,14,"PREGNANCY, CHILDBIRTH AND THE PUERPERIUM",2,Moderate,Minor,Surgical,Private Health Insurance,,,,,Y,42594.18,24495.23
New York City,Manhattan,7002001,001438,Bellevue Hospital Center,30 to 49,114,F,Other Race,Not Span/Hispanic,4,Elective,Home or Self Care,2020,PRG022,PROLONGED PREGNANCY,PGN003,CESAREAN SECTION,540,CESAREAN SECTION W/O STERILIZATION,14,"PREGNANCY, CHILDBIRTH AND THE PUERPERIUM",1,Minor,Minor,Surgical,Private Health Insurance,Medicaid,,,,N,20771.29,11945.24
New York City,Manhattan,7002001,001438,Bellevue Hospital Center,30 to 49,,F,Black/African American,Spanish/Hispanic,3,Elective,Home or Self Care,2020,PRG016,PREVIOUS C-SECTION,PGN003,CESAREAN SECTION,540,CESAREAN SECTION W/O STERILIZATION,14,"PREGNANCY, CHILDBIRTH AND THE PUERPERIUM",2,Moderate,Minor,Surgical,Medicaid,,,,,N,30937.16,17791.47
New York City,Manhattan,7002001,001438,Bellevue Hospital Center,18 to 29,100,F,Black/African American,Spanish/Hispanic,14,Elective,Home or Self Care,2020,PRG019,DIABETES OR ABNORMAL GLUCOSE TOLERANCE COMPLICATING PREGNANCY; CHILDBIRTH; OR THE PUERPERIUM,PGN003,CESAREAN SECTION,540,CESAREAN SECTION W/O STERILIZATION,14,"PREGNANCY, CHILDBIRTH AND THE PUERPERIUM",2,Moderate,Minor,Surgical,Private Health Insurance,,,,,N,89770.33,51625.48
New York City,Manhattan,7002001,001438,Bellevue Hospital Center,30 to 49,112,F,Other Race,Spanish/Hispanic,19,Elective,Home or Self Care,2020,PRG013,MATERNAL CARE RELATED TO FETAL CONDITIONS,PGN003,CESAREAN SECTION,540,CESAREAN SECTION W/O STERILIZATION,14,"PREGNANCY, CHILDBIRTH AND THE PUERPERIUM",3,Major,Minor,Surgical,Medicaid,,,,,N,105159.05,60475.29
New York City,Manhattan,7002001,001438,Bellevue Hospital Center,30 to 49,112,F,Other Race,Unknown,4,Emergency,Home or Self Care,2020,PRG016,PREVIOUS C-SECTION,PGN003,CESAREAN SECTION,540,CESAREAN SECTION W/O STERILIZATION,14,"PREGNANCY, CHILDBIRTH AND THE PUERPERIUM",1,Minor,Minor,Surgical,Medicare,Medicaid,,,,N,39215.52,22552.22
New York City,Manhattan,7002001,001438,Bellevue Hospital Center,30 to 49,104,F,Other Race,Spanish/Hispanic,4,Urgent,Home or Self Care,2020,PRG023,COMPLICATIONS SPECIFIED DURING CHILDBIRTH,PGN003,CESAREAN SECTION,540,CESAREAN SECTION W/O STERILIZATION,14,"PREGNANCY, CHILDBIRTH AND THE PUERPERIUM",2,Moderate,Minor,Surgical,Medicaid,,,,,N,34738.18,19977.37
New York City,Manhattan,7002001,001438,Bellevue Hospital Center,30 to 49,100,F,Other Race,Spanish/Hispanic,3,Urgent,Home or Self Care,2020,PRG013,MATERNAL CARE RELATED TO FETAL CONDITIONS,PGN003,CESAREAN SECTION,540,CESAREAN SECTION W/O STERILIZATION,14,"PREGNANCY, CHILDBIRTH AND THE PUERPERIUM",2,Moderate,Minor,Surgical,Medicaid,,,,,Y,34216.79,19677.53
New York City,Manhattan,7002001,001438,Bellevue Hospital Center,30 to 49,112,F,Black/African American,Not Span/Hispanic,6,Urgent,Home or Self Care,2020,PRG023,COMPLICATIONS SPECIFIED DURING CHILDBIRTH,PGN003,CESAREAN SECTION,540,CESAREAN SECTION W/O STERILIZATION,14,"PREGNANCY, CHILDBIRTH AND THE PUERPERIUM",2,Moderate,Minor,Surgical,Medicaid,,,,,N,51201.48,29445.15
New York City,Manhattan,7002001,001438,Bellevue Hospital Center,18 to 29,100,F,Multi-racial,Spanish/Hispanic,4,Emergency,Home or Self Care,2020,PRG023,COMPLICATIONS SPECIFIED DURING CHILDBIRTH,PGN003,CESAREAN SECTION,540,CESAREAN SECTION W/O STERILIZATION,14,"PREGNANCY, CHILDBIRTH AND THE PUERPERIUM",1,Minor,Minor,Surgical,Medicaid,,,,,N,34832.52,20031.62
New York City,Manhattan,7002001,001438,Bellevue Hospital Center,30 to 49,112,F,Other Race,Spanish/Hispanic,4,Elective,Home or Self Care,2020,PRG012,MULTIPLE GESTATION,PGN003,CESAREAN SECTION,540,CESAREAN SECTION W/O STERILIZATION,14,"PREGNANCY, CHILDBIRTH AND THE PUERPERIUM",2,Moderate,Minor,Surgical,Medicaid,,,,,N,39972.98,22987.82
New York City,Manhattan,7002001,001438,Bellevue Hospital Center,30 to 49,113,F,White,Spanish/Hispanic,4,Urgent,Home or Self Care,2020,PRG023,COMPLICATIONS SPECIFIED DURING CHILDBIRTH,PGN003,CESAREAN SECTION,540,CESAREAN SECTION W/O STERILIZATION,14,"PREGNANCY, CHILDBIRTH AND THE PUERPERIUM",1,Minor,Minor,Surgical,Medicaid,,,,,Y,43596.58,25071.7
New York City,Manhattan,7002001,001438,Bellevue Hospital Center,30 to 49,112,F,Black/African American,Not Span/Hispanic,3,Elective,Home or Self Care,2020,PRG012,MULTIPLE GESTATION,PGN003,CESAREAN SECTION,540,CESAREAN SECTION W/O STERILIZATION,14,"PREGNANCY, CHILDBIRTH AND THE PUERPERIUM",2,Moderate,Minor,Surgical,Medicaid,,,,,N,34398.57,19782.07
New York City,Manhattan,7002001,001438,Bellevue Hospital Center,18 to 29,112,F,Other Race,Spanish/Hispanic,4,Urgent,Home or Self Care,2020,PRG020,HYPERTENSION AND HYPERTENSIVE-RELATED CONDITIONS COMPLICATING PREGNANCY; CHILDBIRTH; AND THE PUERPERIUM,PGN003,CESAREAN SECTION,540,CESAREAN SECTION W/O STERILIZATION,14,"PREGNANCY, CHILDBIRTH AND THE PUERPERIUM",2,Moderate,Minor,Surgical,Medicaid,,,,,N,38367.09,22064.3
New York City,Manhattan,7002001,001438,Bellevue Hospital Center,18 to 29,113,F,Other Race,Spanish/Hispanic,4,Emergency,Home or Self Care,2020,PRG029,"UNCOMPLICATED PREGNANCY, DELIVERY OR PUERPERIUM",PGN003,CESAREAN SECTION,540,CESAREAN SECTION W/O STERILIZATION,14,"PREGNANCY, CHILDBIRTH AND THE PUERPERIUM",3,Major,Minor,Surgical,Medicaid,,,,,N,38284.59,22016.86
New York City,Manhattan,7002001,001438,Bellevue Hospital Center,30 to 49,113,F,Other Race,Spanish/Hispanic,4,Elective,Home or Self Care,2020,PRG013,MATERNAL CARE RELATED TO FETAL CONDITIONS,PGN003,CESAREAN SECTION,540,CESAREAN SECTION W/O STERILIZATION,14,"PREGNANCY, CHILDBIRTH AND THE PUERPERIUM",2,Moderate,Minor,Surgical,Medicaid,,,,,N,43902,25247.34
New York City,Manhattan,7002001,001438,Bellevue Hospital Center,30 to 49,113,F,Other Race,Spanish/Hispanic,2,Elective,Home or Self Care,2020,PRG016,PREVIOUS C-SECTION,PGN003,CESAREAN SECTION,540,CESAREAN SECTION W/O STERILIZATION,14,"PREGNANCY, CHILDBIRTH AND THE PUERPERIUM",1,Minor,Minor,Surgical,Medicaid,,,,,N,27100.23,15584.91
New York City,Manhattan,7002001,001438,Bellevue Hospital Center,18 to 29,104,F,Other Race,Spanish/Hispanic,4,Elective,Home or Self Care,2020,PRG020,HYPERTENSION AND HYPERTENSIVE-RELATED CONDITIONS COMPLICATING PREGNANCY; CHILDBIRTH; AND THE PUERPERIUM,PGN003,CESAREAN SECTION,540,CESAREAN SECTION W/O STERILIZATION,14,"PREGNANCY, CHILDBIRTH AND THE PUERPERIUM",2,Moderate,Minor,Surgical,Private Health Insurance,,,,,Y,35499.01,20414.91
New York City,Manhattan,7002001,001438,Bellevue Hospital Center,18 to 29,112,F,Other Race,Spanish/Hispanic,3,Elective,Home or Self Care,2020,PRG019,DIABETES OR ABNORMAL GLUCOSE TOLERANCE COMPLICATING PREGNANCY; CHILDBIRTH; OR THE PUERPERIUM,PGN003,CESAREAN SECTION,540,CESAREAN SECTION W/O STERILIZATION,14,"PREGNANCY, CHILDBIRTH AND THE PUERPERIUM",1,Minor,Minor,Surgical,Medicaid,,,,,N,28687.4,16497.66
New York City,Manhattan,7002001,001438,Bellevue Hospital Center,18 to 29,112,F,Other Race,Spanish/Hispanic,4,Emergency,Home or Self Care,2020,PRG020,HYPERTENSION AND HYPERTENSIVE-RELATED CONDITIONS COMPLICATING PREGNANCY; CHILDBIRTH; AND THE PUERPERIUM,PGN003,CESAREAN SECTION,540,CESAREAN SECTION W/O STERILIZATION,14,"PREGNANCY, CHILDBIRTH AND THE PUERPERIUM",2,Moderate,Minor,Surgical,Medicaid,,,,,N,63223.02,36358.55
New York City,Manhattan,7002001,001438,Bellevue Hospital Center,30 to 49,114,F,Other Race,Spanish/Hispanic,2,Elective,Home or Self Care,2020,PRG016,PREVIOUS C-SECTION,PGN003,CESAREAN SECTION,540,CESAREAN SECTION W/O STERILIZATION,14,"PREGNANCY, CHILDBIRTH AND THE PUERPERIUM",1,Minor,Minor,Surgical,Medicaid,,,,,N,26836.23,15433.09
New York City,Manhattan,7002001,001438,Bellevue Hospital Center,18 to 29,100,F,Black/African American,Not Span/Hispanic,6,Urgent,Home w/ Home Health Services,2020,PRG023,COMPLICATIONS SPECIFIED DURING CHILDBIRTH,PGN003,CESAREAN SECTION,540,CESAREAN SECTION W/O STERILIZATION,14,"PREGNANCY, CHILDBIRTH AND THE PUERPERIUM",2,Moderate,Minor,Surgical,Medicaid,,,,,N,42643.91,24523.83
New York City,Manhattan,7002001,001438,Bellevue Hospital Center,30 to 49,113,F,Other Race,Spanish/Hispanic,2,Elective,Home or Self Care,2020,PRG016,PREVIOUS C-SECTION,PGN003,CESAREAN SECTION,540,CESAREAN SECTION W/O STERILIZATION,14,"PREGNANCY, CHILDBIRTH AND THE PUERPERIUM",1,Minor,Minor,Surgical,Medicaid,,,,,N,28377.3,16319.33
New York City,Manhattan,7002001,001438,Bellevue Hospital Center,30 to 49,114,F,Other Race,Spanish/Hispanic,3,Elective,Home or Self Care,2020,PRG023,COMPLICATIONS SPECIFIED DURING CHILDBIRTH,PGN003,CESAREAN SECTION,540,CESAREAN SECTION W/O STERILIZATION,14,"PREGNANCY, CHILDBIRTH AND THE PUERPERIUM",1,Minor,Minor,Surgical,Medicaid,,,,,N,33643.46,19347.82
New York City,Manhattan,7002001,001438,Bellevue Hospital Center,30 to 49,112,F,Other Race,Spanish/Hispanic,3,Elective,Home or Self Care,2020,PRG024,"MALPOSITION, DISPROPORTION OR OTHER LABOR COMPLICATIONS",PGN003,CESAREAN SECTION,540,CESAREAN SECTION W/O STERILIZATION,14,"PREGNANCY, CHILDBIRTH AND THE PUERPERIUM",2,Moderate,Minor,Surgical,Private Health Insurance,Medicaid,,,,N,34359.53,19759.62
New York City,Manhattan,7002001,001438,Bellevue Hospital Center,30 to 49,113,F,Other Race,Not Span/Hispanic,6,Emergency,Home or Self Care,2020,PRG023,COMPLICATIONS SPECIFIED DURING CHILDBIRTH,PGN003,CESAREAN SECTION,540,CESAREAN SECTION W/O STERILIZATION,14,"PREGNANCY, CHILDBIRTH AND THE PUERPERIUM",2,Moderate,Minor,Surgical,Private Health Insurance,,,,,Y,48133.35,27680.72
New York City,Manhattan,7002001,001438,Bellevue Hospital Center,18 to 29,112,F,Multi-racial,Not Span/Hispanic,4,Urgent,Home or Self Care,2020,PRG023,COMPLICATIONS SPECIFIED DURING CHILDBIRTH,PGN003,CESAREAN SECTION,540,CESAREAN SECTION W/O STERILIZATION,14,"PREGNANCY, CHILDBIRTH AND THE PUERPERIUM",1,Minor,Minor,Surgical,Private Health Insurance,,,,,N,35563.21,20451.83
New York City,Manhattan,7002001,001438,Bellevue Hospital Center,18 to 29,104,F,Other Race,Spanish/Hispanic,5,Urgent,Home or Self Care,2020,PRG020,HYPERTENSION AND HYPERTENSIVE-RELATED CONDITIONS COMPLICATING PREGNANCY; CHILDBIRTH; AND THE PUERPERIUM,PGN003,CESAREAN SECTION,540,CESAREAN SECTION W/O STERILIZATION,14,"PREGNANCY, CHILDBIRTH AND THE PUERPERIUM",2,Moderate,Minor,Surgical,Medicaid,,,,,Y,39182.86,22533.44
New York City,Manhattan,7002001,001438,Bellevue Hospital Center,18 to 29,100,F,Other Race,Spanish/Hispanic,3,Elective,Home or Self Care,2020,PRG016,PREVIOUS C-SECTION,PGN003,CESAREAN SECTION,540,CESAREAN SECTION W/O STERILIZATION,14,"PREGNANCY, CHILDBIRTH AND THE PUERPERIUM",1,Minor,Minor,Surgical,Private Health Insurance,Medicaid,,,,N,29095.67,16732.45
New York City,Manhattan,7002001,001438,Bellevue Hospital Center,30 to 49,112,F,Other Race,Spanish/Hispanic,4,Emergency,Home or Self Care,2020,PRG019,DIABETES OR ABNORMAL GLUCOSE TOLERANCE COMPLICATING PREGNANCY; CHILDBIRTH; OR THE PUERPERIUM,PGN003,CESAREAN SECTION,540,CESAREAN SECTION W/O STERILIZATION,14,"PREGNANCY, CHILDBIRTH AND THE PUERPERIUM",2,Moderate,Minor,Surgical,Private Health Insurance,,,,,N,35716.84,20540.18
New York City,Manhattan,7002001,001438,Bellevue Hospital Center,18 to 29,100,F,Black/African American,Not Span/Hispanic,3,Elective,Psychiatric Hospital or Unit of Hosp,2020,PRG020,HYPERTENSION AND HYPERTENSIVE-RELATED CONDITIONS COMPLICATING PREGNANCY; CHILDBIRTH; AND THE PUERPERIUM,PGN003,CESAREAN SECTION,540,CESAREAN SECTION W/O STERILIZATION,14,"PREGNANCY, CHILDBIRTH AND THE PUERPERIUM",2,Moderate,Minor,Surgical,Medicaid,,,,,N,49734.97,28601.79
New York City,Manhattan,7002001,001438,Bellevue Hospital Center,30 to 49,104,F,Black/African American,Not Span/Hispanic,2,Elective,Home or Self Care,2020,PRG016,PREVIOUS C-SECTION,PGN003,CESAREAN SECTION,540,CESAREAN SECTION W/O STERILIZATION,14,"PREGNANCY, CHILDBIRTH AND THE PUERPERIUM",1,Minor,Minor,Surgical,Medicaid,,,,,N,23926.84,13759.94
New York City,Manhattan,7002001,001438,Bellevue Hospital Center,30 to 49,111,F,Other Race,Unknown,3,Elective,Home or Self Care,2020,PRG029,"UNCOMPLICATED PREGNANCY, DELIVERY OR PUERPERIUM",PGN003,CESAREAN SECTION,540,CESAREAN SECTION W/O STERILIZATION,14,"PREGNANCY, CHILDBIRTH AND THE PUERPERIUM",1,Minor,Minor,Surgical,Medicaid,,,,,Y,31796.02,18285.38
New York City,Manhattan,7002001,001438,Bellevue Hospital Center,18 to 29,112,F,Other Race,Not Span/Hispanic,2,Elective,Home or Self Care,2020,PRG016,PREVIOUS C-SECTION,PGN003,CESAREAN SECTION,540,CESAREAN SECTION W/O STERILIZATION,14,"PREGNANCY, CHILDBIRTH AND THE PUERPERIUM",1,Minor,Minor,Surgical,Medicaid,,,,,N,30660.21,17632.2
New York City,Manhattan,7002001,001438,Bellevue Hospital Center,18 to 29,111,F,Other Race,Spanish/Hispanic,3,Urgent,Home or Self Care,2020,PRG023,COMPLICATIONS SPECIFIED DURING CHILDBIRTH,PGN003,CESAREAN SECTION,540,CESAREAN SECTION W/O STERILIZATION,14,"PREGNANCY, CHILDBIRTH AND THE PUERPERIUM",3,Major,Moderate,Surgical,Medicaid,,,,,N,30760.87,17690.08
New York City,Manhattan,7002001,001438,Bellevue Hospital Center,30 to 49,OOS,F,Black/African American,Not Span/Hispanic,5,Elective,Home or Self Care,2020,PRG016,PREVIOUS C-SECTION,PGN003,CESAREAN SECTION,540,CESAREAN SECTION W/O STERILIZATION,14,"PREGNANCY, CHILDBIRTH AND THE PUERPERIUM",1,Minor,Minor,Surgical,Medicaid,,,,,N,42800.61,24613.95
New York City,Manhattan,7002001,001438,Bellevue Hospital Center,30 to 49,113,F,Black/African American,Not Span/Hispanic,4,Urgent,Home or Self Care,2020,PRG020,HYPERTENSION AND HYPERTENSIVE-RELATED CONDITIONS COMPLICATING PREGNANCY; CHILDBIRTH; AND THE PUERPERIUM,PGN003,CESAREAN SECTION,540,CESAREAN SECTION W/O STERILIZATION,14,"PREGNANCY, CHILDBIRTH AND THE PUERPERIUM",2,Moderate,Minor,Surgical,Medicaid,,,,,N,35359.83,20334.87
New York City,Manhattan,7002001,001438,Bellevue Hospital Center,30 to 49,112,F,White,Not Span/Hispanic,3,Emergency,Home or Self Care,2020,PRG011,EARLY OR THREATENED LABOR,PGN003,CESAREAN SECTION,540,CESAREAN SECTION W/O STERILIZATION,14,"PREGNANCY, CHILDBIRTH AND THE PUERPERIUM",3,Major,Minor,Surgical,Medicaid,,,,,N,29363.4,16886.42
New York City,Manhattan,7002001,001438,Bellevue Hospital Center,30 to 49,112,F,Other Race,Spanish/Hispanic,2,Emergency,Home or Self Care,2020,PRG016,PREVIOUS C-SECTION,PGN003,CESAREAN SECTION,540,CESAREAN SECTION W/O STERILIZATION,14,"PREGNANCY, CHILDBIRTH AND THE PUERPERIUM",1,Minor,Minor,Surgical,Private Health Insurance,,,,,N,29995.02,17249.66
New York City,Manhattan,7002001,001438,Bellevue Hospital Center,30 to 49,112,F,Other Race,Spanish/Hispanic,2,Emergency,Home or Self Care,2020,PRG011,EARLY OR THREATENED LABOR,PGN003,CESAREAN SECTION,540,CESAREAN SECTION W/O STERILIZATION,14,"PREGNANCY, CHILDBIRTH AND THE PUERPERIUM",2,Moderate,Minor,Surgical,Medicare,Medicaid,,,,Y,28168.87,16199.47
New York City,Manhattan,7002001,001438,Bellevue Hospital Center,30 to 49,100,F,Black/African American,Unknown,4,Urgent,Home or Self Care,2020,PRG020,HYPERTENSION AND HYPERTENSIVE-RELATED CONDITIONS COMPLICATING PREGNANCY; CHILDBIRTH; AND THE PUERPERIUM,PGN003,CESAREAN SECTION,540,CESAREAN SECTION W/O STERILIZATION,14,"PREGNANCY, CHILDBIRTH AND THE PUERPERIUM",2,Moderate,Minor,Surgical,Medicaid,,,,,N,38002.26,21854.49
New York City,Manhattan,7002001,001438,Bellevue Hospital Center,18 to 29,112,F,Other Race,Not Span/Hispanic,4,Emergency,Home or Self Care,2020,PRG020,HYPERTENSION AND HYPERTENSIVE-RELATED CONDITIONS COMPLICATING PREGNANCY; CHILDBIRTH; AND THE PUERPERIUM,PGN003,CESAREAN SECTION,540,CESAREAN SECTION W/O STERILIZATION,14,"PREGNANCY, CHILDBIRTH AND THE PUERPERIUM",4,Extreme,Moderate,Surgical,Medicaid,,,,,N,49837.17,28660.56
New York City,Manhattan,7002001,001438,Bellevue Hospital Center,18 to 29,112,F,Other Race,Spanish/Hispanic,2,Elective,Home or Self Care,2020,PRG013,MATERNAL CARE RELATED TO FETAL CONDITIONS,PGN003,CESAREAN SECTION,540,CESAREAN SECTION W/O STERILIZATION,14,"PREGNANCY, CHILDBIRTH AND THE PUERPERIUM",1,Minor,Minor,Surgical,Medicaid,,,,,N,25115.55,14443.55
New York City,Manhattan,7002001,001438,Bellevue Hospital Center,18 to 29,113,F,Other Race,Not Span/Hispanic,3,Elective,Home or Self Care,2020,PRG016,PREVIOUS C-SECTION,PGN003,CESAREAN SECTION,540,CESAREAN SECTION W/O STERILIZATION,14,"PREGNANCY, CHILDBIRTH AND THE PUERPERIUM",2,Moderate,Minor,Surgical,Medicaid,,,,,N,36423.16,20946.38