Hospital Service Area,Hospital County,Operating Certificate Number,Permanent Facility Id,Facility Name,Age Group,Zip Code - 3 digits,Gender,Race,Ethnicity,Length of Stay,Type of Admission,Patient Disposition,Discharge Year,CCS Diagnosis Code,CCS Diagnosis Description,CCS Procedure Code,CCS Procedure Description,APR DRG Code,APR DRG Description,APR MDC Code,APR MDC Description,APR Severity of Illness Code,APR Severity of Illness Description,APR Risk of Mortality,APR Medical Surgical Description,Payment Typology 1,Payment Typology 2,Payment Typology 3,Birth Weight,Abortion Edit Indicator,Emergency Department Indicator,Total Charges,Total Costs
New York City,Manhattan,7002001,001438,Bellevue Hospital Center,30 to 49,100,F,Other Race,Not Span/Hispanic,3,Emergency,Home or Self Care,2019,PRG023,COMPLICATIONS SPECIFIED DURING CHILDBIRTH,PGN002,SPONTANEOUS VAGINAL DELIVERY,541,VAGINAL DELIVERY W STERILIZATION &/OR D&C,14,"PREGNANCY, CHILDBIRTH AND THE PUERPERIUM",1,Minor,Minor,Surgical,Medicaid,Medicaid,,,,true,13377.79,8890.88
New York City,Manhattan,7002001,001438,Bellevue Hospital Center,18 to 29,113,F,Other Race,Not Span/Hispanic,13,Emergency,Home or Self Care,2019,PRG011,EARLY OR THREATENED LABOR,PGN002,SPONTANEOUS VAGINAL DELIVERY,541,VAGINAL DELIVERY W STERILIZATION &/OR D&C,14,"PREGNANCY, CHILDBIRTH AND THE PUERPERIUM",3,Major,Minor,Surgical,Medicaid,,,,,true,52847.52,35122.46
New York City,Manhattan,7002001,001438,Bellevue Hospital Center,30 to 49,114,F,Other Race,Spanish/Hispanic,3,Emergency,Home or Self Care,2019,PRG023,COMPLICATIONS SPECIFIED DURING CHILDBIRTH,PGN002,SPONTANEOUS VAGINAL DELIVERY,541,VAGINAL DELIVERY W STERILIZATION &/OR D&C,14,"PREGNANCY, CHILDBIRTH AND THE PUERPERIUM",2,Moderate,Minor,Surgical,Medicaid,Medicaid,,,,true,13681.77,9092.9
New York City,Manhattan,7002001,001438,Bellevue Hospital Center,30 to 49,114,F,Black/African American,Not Span/Hispanic,3,Emergency,Home or Self Care,2019,PRG019,DIABETES OR ABNORMAL GLUCOSE TOLERANCE COMPLICATING PREGNANCY; CHILDBIRTH; OR THE PUERPERIUM,PGN002,SPONTANEOUS VAGINAL DELIVERY,541,VAGINAL DELIVERY W STERILIZATION &/OR D&C,14,"PREGNANCY, CHILDBIRTH AND THE PUERPERIUM",1,Minor,Minor,Surgical,Medicaid,Medicaid,,,,true,13870.03,9218.02
New York City,Manhattan,7002001,001438,Bellevue Hospital Center,30 to 49,113,F,Other Race,Spanish/Hispanic,2,Emergency,Home or Self Care,2019,PRG020,HYPERTENSION AND HYPERTENSIVE-RELATED CONDITIONS COMPLICATING PREGNANCY; CHILDBIRTH; AND THE PUERPERIUM,PGN002,SPONTANEOUS VAGINAL DELIVERY,541,VAGINAL DELIVERY W STERILIZATION &/OR D&C,14,"PREGNANCY, CHILDBIRTH AND THE PUERPERIUM",1,Minor,Minor,Surgical,Medicaid,Medicaid,,,,true,9728.7,6465.69
New York City,Manhattan,7002001,001438,Bellevue Hospital Center,18 to 29,113,F,Other Race,Spanish/Hispanic,2,Emergency,Home or Self Care,2019,PRG023,COMPLICATIONS SPECIFIED DURING CHILDBIRTH,PGN002,SPONTANEOUS VAGINAL DELIVERY,541,VAGINAL DELIVERY W STERILIZATION &/OR D&C,14,"PREGNANCY, CHILDBIRTH AND THE PUERPERIUM",1,Minor,Minor,Surgical,Private Health Insurance,,,,,true,9492.29,6308.58
New York City,Manhattan,7002001,001438,Bellevue Hospital Center,30 to 49,113,F,Other Race,Spanish/Hispanic,2,Emergency,Home or Self Care,2019,PRG029,"UNCOMPLICATED PREGNANCY, DELIVERY OR PUERPERIUM",PGN002,SPONTANEOUS VAGINAL DELIVERY,541,VAGINAL DELIVERY W STERILIZATION &/OR D&C,14,"PREGNANCY, CHILDBIRTH AND THE PUERPERIUM",2,Moderate,Minor,Surgical,Medicaid,Medicaid,,,,true,9392.69,6242.38
New York City,Manhattan,7002001,001438,Bellevue Hospital Center,30 to 49,100,F,Other Race,Not Span/Hispanic,3,Emergency,Home or Self Care,2019,PRG013,MATERNAL CARE RELATED TO FETAL CONDITIONS,PGN002,SPONTANEOUS VAGINAL DELIVERY,541,VAGINAL DELIVERY W STERILIZATION &/OR D&C,14,"PREGNANCY, CHILDBIRTH AND THE PUERPERIUM",1,Minor,Minor,Surgical,Medicaid,Medicaid,,,,true,13708.47,9110.65
New York City,Manhattan,7002001,001438,Bellevue Hospital Center,30 to 49,113,F,Other Race,Spanish/Hispanic,2,Emergency,Home or Self Care,2019,PRG020,HYPERTENSION AND HYPERTENSIVE-RELATED CONDITIONS COMPLICATING PREGNANCY; CHILDBIRTH; AND THE PUERPERIUM,PGN002,SPONTANEOUS VAGINAL DELIVERY,541,VAGINAL DELIVERY W STERILIZATION &/OR D&C,14,"PREGNANCY, CHILDBIRTH AND THE PUERPERIUM",2,Moderate,Minor,Surgical,Medicaid,Medicaid,,,,true,9558.7,6352.71
New York City,Manhattan,7002001,001438,Bellevue Hospital Center,30 to 49,112,F,White,Not Span/Hispanic,2,Emergency,Home or Self Care,2019,PRG011,EARLY OR THREATENED LABOR,PGN002,SPONTANEOUS VAGINAL DELIVERY,541,VAGINAL DELIVERY W STERILIZATION &/OR D&C,14,"PREGNANCY, CHILDBIRTH AND THE PUERPERIUM",3,Major,Minor,Surgical,Medicaid,,,,,true,9924.52,6595.84
New York City,Manhattan,7002001,001438,Bellevue Hospital Center,30 to 49,114,F,Other Race,Spanish/Hispanic,3,Emergency,Home or Self Care,2019,PRG022,PROLONGED PREGNANCY,PGN002,SPONTANEOUS VAGINAL DELIVERY,541,VAGINAL DELIVERY W STERILIZATION &/OR D&C,14,"PREGNANCY, CHILDBIRTH AND THE PUERPERIUM",2,Moderate,Minor,Surgical,Medicaid,Medicaid,,,,true,13495.31,8968.98
New York City,Manhattan,7002001,001438,Bellevue Hospital Center,30 to 49,113,F,Other Race,Spanish/Hispanic,4,Emergency,Home or Self Care,2019,PRG023,COMPLICATIONS SPECIFIED DURING CHILDBIRTH,PGN002,SPONTANEOUS VAGINAL DELIVERY,541,VAGINAL DELIVERY W STERILIZATION &/OR D&C,14,"PREGNANCY, CHILDBIRTH AND THE PUERPERIUM",2,Moderate,Minor,Surgical,Medicaid,Medicaid,,,,true,17790.16,11823.34
New York City,Manhattan,7002001,001438,Bellevue Hospital Center,18 to 29,112,F,Other Race,Spanish/Hispanic,1,Emergency,Home or Self Care,2019,PRG011,EARLY OR THREATENED LABOR,PGN006,REMOVAL OF PLACENTA AND OTHER RETAINED PRODUCTS OF CONCEPTION,541,VAGINAL DELIVERY W STERILIZATION &/OR D&C,14,"PREGNANCY, CHILDBIRTH AND THE PUERPERIUM",3,Major,Minor,Surgical,Private Health Insurance,,,,,true,6981.49,4639.9
New York City,Manhattan,7002001,001438,Bellevue Hospital Center,30 to 49,100,F,Other Race,Not Span/Hispanic,2,Emergency,Home or Self Care,2019,PRG011,EARLY OR THREATENED LABOR,PGN002,SPONTANEOUS VAGINAL DELIVERY,541,VAGINAL DELIVERY W STERILIZATION &/OR D&C,14,"PREGNANCY, CHILDBIRTH AND THE PUERPERIUM",2,Moderate,Minor,Surgical,Medicaid,Medicaid,,,,true,8942.76,5943.36
New York City,Manhattan,7002001,001438,Bellevue Hospital Center,30 to 49,104,F,Other Race,Spanish/Hispanic,2,Elective,Home or Self Care,2019,PRG020,HYPERTENSION AND HYPERTENSIVE-RELATED CONDITIONS COMPLICATING PREGNANCY; CHILDBIRTH; AND THE PUERPERIUM,PGN002,SPONTANEOUS VAGINAL DELIVERY,541,VAGINAL DELIVERY W STERILIZATION &/OR D&C,14,"PREGNANCY, CHILDBIRTH AND THE PUERPERIUM",3,Major,Minor,Surgical,Medicaid,,,,,false,46605.25,30973.85
New York City,Manhattan,7002001,001438,Bellevue Hospital Center,30 to 49,112,F,Other Race,Not Span/Hispanic,4,Emergency,Home or Self Care,2019,PRG014,POLYHYDRAMNIOS AND OTHER PROBLEMS OF AMNIOTIC CAVITY,PGN002,SPONTANEOUS VAGINAL DELIVERY,541,VAGINAL DELIVERY W STERILIZATION &/OR D&C,14,"PREGNANCY, CHILDBIRTH AND THE PUERPERIUM",3,Major,Minor,Surgical,Medicaid,,,,,true,27935.3,18565.8
New York City,Manhattan,7002001,001438,Bellevue Hospital Center,18 to 29,113,F,Other Race,Spanish/Hispanic,3,Emergency,Home or Self Care,2019,PRG021,MATERNAL INTRAUTERINE INFECTION,PGN002,SPONTANEOUS VAGINAL DELIVERY,541,VAGINAL DELIVERY W STERILIZATION &/OR D&C,14,"PREGNANCY, CHILDBIRTH AND THE PUERPERIUM",2,Moderate,Minor,Surgical,Medicaid,,,,,true,15982.73,10622.12
New York City,Manhattan,7002001,001438,Bellevue Hospital Center,30 to 49,104,F,Other Race,Not Span/Hispanic,3,Urgent,Home or Self Care,2019,PRG029,"UNCOMPLICATED PREGNANCY, DELIVERY OR PUERPERIUM",PGN002,SPONTANEOUS VAGINAL DELIVERY,541,VAGINAL DELIVERY W STERILIZATION &/OR D&C,14,"PREGNANCY, CHILDBIRTH AND THE PUERPERIUM",3,Major,Minor,Surgical,Private Health Insurance,,,,,false,22957.82,15257.77
New York City,Manhattan,7002001,001438,Bellevue Hospital Center,30 to 49,100,F,Other Race,Not Span/Hispanic,2,Elective,Home or Self Care,2019,PRG029,"UNCOMPLICATED PREGNANCY, DELIVERY OR PUERPERIUM",PGN002,SPONTANEOUS VAGINAL DELIVERY,541,VAGINAL DELIVERY W STERILIZATION &/OR D&C,14,"PREGNANCY, CHILDBIRTH AND THE PUERPERIUM",2,Moderate,Minor,Surgical,Medicaid,,,,,false,19969.25,13271.56
New York City,Manhattan,7002001,001438,Bellevue Hospital Center,30 to 49,112,F,Other Race,Spanish/Hispanic,1,Elective,Home or Self Care,2019,PRG006,MOLAR PREGNANCY AND OTHER ABNORMAL PRODUCTS OF CONCEPTION,PGN006,REMOVAL OF PLACENTA AND OTHER RETAINED PRODUCTS OF CONCEPTION,541,VAGINAL DELIVERY W STERILIZATION &/OR D&C,14,"PREGNANCY, CHILDBIRTH AND THE PUERPERIUM",2,Moderate,Minor,Surgical,Medicaid,,,,,false,5792.17,3849.48
New York City,Manhattan,7002001,001438,Bellevue Hospital Center,30 to 49,112,F,Black/African American,Not Span/Hispanic,5,Emergency,Home or Self Care,2019,PRG020,HYPERTENSION AND HYPERTENSIVE-RELATED CONDITIONS COMPLICATING PREGNANCY; CHILDBIRTH; AND THE PUERPERIUM,PGN006,REMOVAL OF PLACENTA AND OTHER RETAINED PRODUCTS OF CONCEPTION,541,VAGINAL DELIVERY W STERILIZATION &/OR D&C,14,"PREGNANCY, CHILDBIRTH AND THE PUERPERIUM",2,Moderate,Minor,Surgical,Medicaid,,,,,false,39749.14,26417.28
New York City,Manhattan,7002001,001438,Bellevue Hospital Center,30 to 49,104,F,Black/African American,Spanish/Hispanic,1,Emergency,Home or Self Care,2019,PRG006,MOLAR PREGNANCY AND OTHER ABNORMAL PRODUCTS OF CONCEPTION,PGN002,SPONTANEOUS VAGINAL DELIVERY,541,VAGINAL DELIVERY W STERILIZATION &/OR D&C,14,"PREGNANCY, CHILDBIRTH AND THE PUERPERIUM",3,Major,Minor,Surgical,Medicaid,,,,,false,12870.65,8553.83
New York City,Manhattan,7002001,001438,Bellevue Hospital Center,30 to 49,112,F,Other Race,Spanish/Hispanic,2,Urgent,Home or Self Care,2019,PRG020,HYPERTENSION AND HYPERTENSIVE-RELATED CONDITIONS COMPLICATING PREGNANCY; CHILDBIRTH; AND THE PUERPERIUM,PGN006,REMOVAL OF PLACENTA AND OTHER RETAINED PRODUCTS OF CONCEPTION,541,VAGINAL DELIVERY W STERILIZATION &/OR D&C,14,"PREGNANCY, CHILDBIRTH AND THE PUERPERIUM",3,Major,Minor,Surgical,Medicaid,,,,,false,25273.1,16796.5
New York City,Manhattan,7002001,001438,Bellevue Hospital Center,30 to 49,100,F,Other Race,Not Span/Hispanic,3,Urgent,Home or Self Care,2019,PRG023,COMPLICATIONS SPECIFIED DURING CHILDBIRTH,PGN002,SPONTANEOUS VAGINAL DELIVERY,541,VAGINAL DELIVERY W STERILIZATION &/OR D&C,14,"PREGNANCY, CHILDBIRTH AND THE PUERPERIUM",1,Minor,Minor,Surgical,Medicaid,,,,,false,57386.44,38139.03
New York City,Manhattan,7002001,001438,Bellevue Hospital Center,18 to 29,100,F,Other Race,Spanish/Hispanic,3,Elective,Home or Self Care,2019,PRG022,PROLONGED PREGNANCY,PGN002,SPONTANEOUS VAGINAL DELIVERY,541,VAGINAL DELIVERY W STERILIZATION &/OR D&C,14,"PREGNANCY, CHILDBIRTH AND THE PUERPERIUM",2,Moderate,Minor,Surgical,Medicaid,,,,,false,35496.54,23591
New York City,Manhattan,7002001,001438,Bellevue Hospital Center,30 to 49,112,F,Other Race,Spanish/Hispanic,3,Urgent,Home or Self Care,2019,PRG019,DIABETES OR ABNORMAL GLUCOSE TOLERANCE COMPLICATING PREGNANCY; CHILDBIRTH; OR THE PUERPERIUM,PGN002,SPONTANEOUS VAGINAL DELIVERY,541,VAGINAL DELIVERY W STERILIZATION &/OR D&C,14,"PREGNANCY, CHILDBIRTH AND THE PUERPERIUM",2,Moderate,Minor,Surgical,Medicaid,,,,,false,32630.98,21686.55
New York City,Manhattan,7002001,001438,Bellevue Hospital Center,30 to 49,113,F,Other Race,Spanish/Hispanic,3,Emergency,Home or Self Care,2019,PRG011,EARLY OR THREATENED LABOR,PGN002,SPONTANEOUS VAGINAL DELIVERY,541,VAGINAL DELIVERY W STERILIZATION &/OR D&C,14,"PREGNANCY, CHILDBIRTH AND THE PUERPERIUM",2,Moderate,Minor,Surgical,Medicaid,,,,,false,23427.33,15569.8
New York City,Manhattan,7002001,001438,Bellevue Hospital Center,30 to 49,104,F,Other Race,Not Span/Hispanic,4,Elective,Home or Self Care,2019,PRG019,DIABETES OR ABNORMAL GLUCOSE TOLERANCE COMPLICATING PREGNANCY; CHILDBIRTH; OR THE PUERPERIUM,PGN002,SPONTANEOUS VAGINAL DELIVERY,541,VAGINAL DELIVERY W STERILIZATION &/OR D&C,14,"PREGNANCY, CHILDBIRTH AND THE PUERPERIUM",3,Major,Minor,Surgical,Medicaid,,,,,false,54411.58,36161.94
New York City,Manhattan,7002001,001438,Bellevue Hospital Center,18 to 29,112,F,Other Race,Unknown,9,Emergency,Home or Self Care,2019,PRG011,EARLY OR THREATENED LABOR,PGN004,ASSISTED VAGINAL DELIVERY,541,VAGINAL DELIVERY W STERILIZATION &/OR D&C,14,"PREGNANCY, CHILDBIRTH AND THE PUERPERIUM",3,Major,Minor,Surgical,Medicaid,,,,,false,54852.58,36455.02
New York City,Manhattan,7002001,001438,Bellevue Hospital Center,30 to 49,100,F,Other Race,Spanish/Hispanic,2,Elective,Home or Self Care,2019,PRG022,PROLONGED PREGNANCY,PGN002,SPONTANEOUS VAGINAL DELIVERY,541,VAGINAL DELIVERY W STERILIZATION &/OR D&C,14,"PREGNANCY, CHILDBIRTH AND THE PUERPERIUM",1,Minor,Minor,Surgical,Medicaid,,,,,false,28638.49,19033.14
New York City,Manhattan,7002001,001438,Bellevue Hospital Center,30 to 49,112,F,Other Race,Spanish/Hispanic,3,Elective,Home or Self Care,2019,PRG023,COMPLICATIONS SPECIFIED DURING CHILDBIRTH,PGN002,SPONTANEOUS VAGINAL DELIVERY,541,VAGINAL DELIVERY W STERILIZATION &/OR D&C,14,"PREGNANCY, CHILDBIRTH AND THE PUERPERIUM",1,Minor,Minor,Surgical,Medicaid,,,,,false,24444.16,16245.59
New York City,Manhattan,7002001,001438,Bellevue Hospital Center,30 to 49,104,F,Other Race,Spanish/Hispanic,2,Emergency,Home or Self Care,2019,PRG022,PROLONGED PREGNANCY,PGN002,SPONTANEOUS VAGINAL DELIVERY,541,VAGINAL DELIVERY W STERILIZATION &/OR D&C,14,"PREGNANCY, CHILDBIRTH AND THE PUERPERIUM",1,Minor,Minor,Surgical,Private Health Insurance,Medicaid,,,,false,8959.48,5954.47
New York City,Manhattan,7002001,001438,Bellevue Hospital Center,18 to 29,104,F,Black/African American,Not Span/Hispanic,2,Emergency,Home or Self Care,2019,PRG023,COMPLICATIONS SPECIFIED DURING CHILDBIRTH,PGN002,SPONTANEOUS VAGINAL DELIVERY,541,VAGINAL DELIVERY W STERILIZATION &/OR D&C,14,"PREGNANCY, CHILDBIRTH AND THE PUERPERIUM",2,Moderate,Minor,Surgical,Medicaid,,,,,true,12476.67,8291.99
New York City,Manhattan,7002001,001438,Bellevue Hospital Center,18 to 29,112,F,Other Race,Spanish/Hispanic,2,Emergency,Home or Self Care,2019,PRG026,OB-RELATED TRAUMA TO PERINEUM AND VULVA,PGN002,SPONTANEOUS VAGINAL DELIVERY,541,VAGINAL DELIVERY W STERILIZATION &/OR D&C,14,"PREGNANCY, CHILDBIRTH AND THE PUERPERIUM",1,Minor,Minor,Surgical,Medicaid,,,,,false,58038.84,38572.61
New York City,Manhattan,7002001,001438,Bellevue Hospital Center,30 to 49,112,F,White,Spanish/Hispanic,2,Emergency,Home or Self Care,2019,PRG023,COMPLICATIONS SPECIFIED DURING CHILDBIRTH,PGN002,SPONTANEOUS VAGINAL DELIVERY,541,VAGINAL DELIVERY W STERILIZATION &/OR D&C,14,"PREGNANCY, CHILDBIRTH AND THE PUERPERIUM",2,Moderate,Minor,Surgical,Medicaid,,,,,true,33818.13,22475.53
New York City,Manhattan,7002001,001438,Bellevue Hospital Center,30 to 49,113,F,Other Race,Spanish/Hispanic,3,Emergency,Home or Self Care,2019,PRG024,"MALPOSITION, DISPROPORTION OR OTHER LABOR COMPLICATIONS",PGN002,SPONTANEOUS VAGINAL DELIVERY,541,VAGINAL DELIVERY W STERILIZATION &/OR D&C,14,"PREGNANCY, CHILDBIRTH AND THE PUERPERIUM",2,Moderate,Minor,Surgical,Medicaid,,,,,false,25379.97,16867.53
New York City,Manhattan,7002001,001438,Bellevue Hospital Center,30 to 49,100,F,Other Race,Spanish/Hispanic,3,Urgent,Home or Self Care,2019,PRG020,HYPERTENSION AND HYPERTENSIVE-RELATED CONDITIONS COMPLICATING PREGNANCY; CHILDBIRTH; AND THE PUERPERIUM,PGN002,SPONTANEOUS VAGINAL DELIVERY,541,VAGINAL DELIVERY W STERILIZATION &/OR D&C,14,"PREGNANCY, CHILDBIRTH AND THE PUERPERIUM",1,Minor,Minor,Surgical,Medicaid,,,,,false,30315.16,20147.46
New York City,Manhattan,7002001,001438,Bellevue Hospital Center,30 to 49,113,F,Other Race,Spanish/Hispanic,3,Elective,Home or Self Care,2019,PRG020,HYPERTENSION AND HYPERTENSIVE-RELATED CONDITIONS COMPLICATING PREGNANCY; CHILDBIRTH; AND THE PUERPERIUM,PGN002,SPONTANEOUS VAGINAL DELIVERY,541,VAGINAL DELIVERY W STERILIZATION &/OR D&C,14,"PREGNANCY, CHILDBIRTH AND THE PUERPERIUM",3,Major,Minor,Surgical,Medicaid,Medicaid,,,,false,55990.7,37211.42
New York City,Manhattan,7002001,001438,Bellevue Hospital Center,30 to 49,113,F,Other Race,Not Span/Hispanic,3,Elective,Home or Self Care,2019,PRG022,PROLONGED PREGNANCY,PGN002,SPONTANEOUS VAGINAL DELIVERY,541,VAGINAL DELIVERY W STERILIZATION &/OR D&C,14,"PREGNANCY, CHILDBIRTH AND THE PUERPERIUM",2,Moderate,Minor,Surgical,Medicaid,,,,,false,29509.3,19611.88
