Hospital Service Area,Hospital County,Operating Certificate Number,Permanent Facility Id,Facility Name,Age Group,Zip Code - 3 digits,Gender,Race,Ethnicity,Length of Stay,Type of Admission,Patient Disposition,Discharge Year,CCS Diagnosis Code,CCS Diagnosis Description,CCS Procedure Code,CCS Procedure Description,APR DRG Code,APR DRG Description,APR MDC Code,APR MDC Description,APR Severity of Illness Code,APR Severity of Illness Description,APR Risk of Mortality,APR Medical Surgical Description,Payment Typology 1,Payment Typology 2,Payment Typology 3,Birth Weight,Abortion Edit Indicator,Emergency Department Indicator,Total Charges,Total Costs
New York City,Manhattan,7002053,001463,NYU Langone Hospitals,30 to 49,112,F,White,Not Span/Hispanic,3,Elective,Home or Self Care,2019,PRG023,COMPLICATIONS SPECIFIED DURING CHILDBIRTH,PGN002,SPONTANEOUS VAGINAL DELIVERY,541,VAGINAL DELIVERY W STERILIZATION &/OR D&C,14,"PREGNANCY, CHILDBIRTH AND THE PUERPERIUM",3,Major,Minor,Surgical,Private Health Insurance,,,,,false,38679.22,12981.77
New York City,Manhattan,7002053,001463,NYU Langone Hospitals,30 to 49,100,F,White,Not Span/Hispanic,1,Elective,Home or Self Care,2019,PRG026,OB-RELATED TRAUMA TO PERINEUM AND VULVA,PGN002,SPONTANEOUS VAGINAL DELIVERY,541,VAGINAL DELIVERY W STERILIZATION &/OR D&C,14,"PREGNANCY, CHILDBIRTH AND THE PUERPERIUM",1,Minor,Minor,Surgical,Blue Cross/Blue Shield,,,,,false,16967.03,6491.9
New York City,Manhattan,7002053,001463,NYU Langone Hospitals,30 to 49,112,F,White,Not Span/Hispanic,2,Elective,Home or Self Care,2019,PRG023,COMPLICATIONS SPECIFIED DURING CHILDBIRTH,PGN002,SPONTANEOUS VAGINAL DELIVERY,541,VAGINAL DELIVERY W STERILIZATION &/OR D&C,14,"PREGNANCY, CHILDBIRTH AND THE PUERPERIUM",2,Moderate,Minor,Surgical,Medicaid,,,,,false,33164.31,9952.92
New York City,Manhattan,7002053,001463,NYU Langone Hospitals,30 to 49,106,F,White,Not Span/Hispanic,2,Elective,Home or Self Care,2019,PRG029,"UNCOMPLICATED PREGNANCY, DELIVERY OR PUERPERIUM",PGN002,SPONTANEOUS VAGINAL DELIVERY,541,VAGINAL DELIVERY W STERILIZATION &/OR D&C,14,"PREGNANCY, CHILDBIRTH AND THE PUERPERIUM",1,Minor,Minor,Surgical,Private Health Insurance,Private Health Insurance,,,,false,19629.67,6813.26
New York City,Manhattan,7002053,001463,NYU Langone Hospitals,30 to 49,112,F,Black/African American,Not Span/Hispanic,2,Elective,Home or Self Care,2019,PRG022,PROLONGED PREGNANCY,PGN002,SPONTANEOUS VAGINAL DELIVERY,541,VAGINAL DELIVERY W STERILIZATION &/OR D&C,14,"PREGNANCY, CHILDBIRTH AND THE PUERPERIUM",2,Moderate,Minor,Surgical,Private Health Insurance,,,,,false,24222.28,9459.76
New York City,Manhattan,7002053,001463,NYU Langone Hospitals,30 to 49,104,F,Other Race,Spanish/Hispanic,3,Elective,Home or Self Care,2019,PRG026,OB-RELATED TRAUMA TO PERINEUM AND VULVA,PGN002,SPONTANEOUS VAGINAL DELIVERY,541,VAGINAL DELIVERY W STERILIZATION &/OR D&C,14,"PREGNANCY, CHILDBIRTH AND THE PUERPERIUM",1,Minor,Minor,Surgical,Private Health Insurance,,,,,false,42885.46,13532.79
New York City,Manhattan,7002053,001463,NYU Langone Hospitals,30 to 49,111,F,Black/African American,Not Span/Hispanic,3,Elective,Home or Self Care,2019,PRG026,OB-RELATED TRAUMA TO PERINEUM AND VULVA,PGN002,SPONTANEOUS VAGINAL DELIVERY,541,VAGINAL DELIVERY W STERILIZATION &/OR D&C,14,"PREGNANCY, CHILDBIRTH AND THE PUERPERIUM",1,Minor,Minor,Surgical,Private Health Insurance,,,,,false,43660.95,13128.99
New York City,Manhattan,7002053,001463,NYU Langone Hospitals,30 to 49,112,F,White,Not Span/Hispanic,3,Elective,Home or Self Care,2019,PRG029,"UNCOMPLICATED PREGNANCY, DELIVERY OR PUERPERIUM",PGN002,SPONTANEOUS VAGINAL DELIVERY,541,VAGINAL DELIVERY W STERILIZATION &/OR D&C,14,"PREGNANCY, CHILDBIRTH AND THE PUERPERIUM",1,Minor,Minor,Surgical,Private Health Insurance,,,,,false,31045.95,12442.22
New York City,Manhattan,7002053,001463,NYU Langone Hospitals,30 to 49,OOS,F,Other Race,Not Span/Hispanic,3,Elective,Home or Self Care,2019,PRG023,COMPLICATIONS SPECIFIED DURING CHILDBIRTH,PGN002,SPONTANEOUS VAGINAL DELIVERY,541,VAGINAL DELIVERY W STERILIZATION &/OR D&C,14,"PREGNANCY, CHILDBIRTH AND THE PUERPERIUM",2,Moderate,Minor,Surgical,Private Health Insurance,,,,,false,32883.77,12669.27
New York City,Manhattan,7002053,001463,NYU Langone Hospitals,30 to 49,112,F,Other Race,Not Span/Hispanic,3,Elective,Home or Self Care,2019,PRG022,PROLONGED PREGNANCY,PGN002,SPONTANEOUS VAGINAL DELIVERY,541,VAGINAL DELIVERY W STERILIZATION &/OR D&C,14,"PREGNANCY, CHILDBIRTH AND THE PUERPERIUM",2,Moderate,Minor,Surgical,Private Health Insurance,,,,,false,113835.59,27050.39
New York City,Manhattan,7002053,001463,NYU Langone Hospitals,30 to 49,OOS,F,White,Not Span/Hispanic,2,Elective,Home or Self Care,2019,PRG017,MATERNAL CARE FOR ABNORMALITY OF PELVIC ORGANS,PGN002,SPONTANEOUS VAGINAL DELIVERY,541,VAGINAL DELIVERY W STERILIZATION &/OR D&C,14,"PREGNANCY, CHILDBIRTH AND THE PUERPERIUM",2,Moderate,Minor,Surgical,Private Health Insurance,,,,,false,24754.45,9555.45
New York City,Manhattan,7002053,001463,NYU Langone Hospitals,30 to 49,100,F,White,Not Span/Hispanic,2,Elective,Home or Self Care,2019,PRG020,HYPERTENSION AND HYPERTENSIVE-RELATED CONDITIONS COMPLICATING PREGNANCY; CHILDBIRTH; AND THE PUERPERIUM,PGN002,SPONTANEOUS VAGINAL DELIVERY,541,VAGINAL DELIVERY W STERILIZATION &/OR D&C,14,"PREGNANCY, CHILDBIRTH AND THE PUERPERIUM",1,Minor,Minor,Surgical,Blue Cross/Blue Shield,,,,,false,23675.66,9498.17
New York City,Manhattan,7002053,001463,NYU Langone Hospitals,18 to 29,112,F,White,Not Span/Hispanic,2,Elective,Home or Self Care,2019,PRG022,PROLONGED PREGNANCY,PGN002,SPONTANEOUS VAGINAL DELIVERY,541,VAGINAL DELIVERY W STERILIZATION &/OR D&C,14,"PREGNANCY, CHILDBIRTH AND THE PUERPERIUM",2,Moderate,Minor,Surgical,Blue Cross/Blue Shield,Medicaid,,,,false,24296.49,9474.05
New York City,Manhattan,7002053,001463,NYU Langone Hospitals,30 to 49,112,F,White,Not Span/Hispanic,2,Elective,Home or Self Care,2019,PRG011,EARLY OR THREATENED LABOR,PGN002,SPONTANEOUS VAGINAL DELIVERY,541,VAGINAL DELIVERY W STERILIZATION &/OR D&C,14,"PREGNANCY, CHILDBIRTH AND THE PUERPERIUM",2,Moderate,Minor,Surgical,Private Health Insurance,,,,,false,24949.61,9564.51
New York City,Manhattan,7002053,001463,NYU Langone Hospitals,30 to 49,100,F,White,Not Span/Hispanic,3,Elective,Home or Self Care,2019,PRG011,EARLY OR THREATENED LABOR,PGN002,SPONTANEOUS VAGINAL DELIVERY,541,VAGINAL DELIVERY W STERILIZATION &/OR D&C,14,"PREGNANCY, CHILDBIRTH AND THE PUERPERIUM",2,Moderate,Minor,Surgical,Private Health Insurance,,,,,false,34835.69,13063.38
New York City,Manhattan,7002053,001463,NYU Langone Hospitals,30 to 49,112,F,White,Not Span/Hispanic,2,Elective,Home or Self Care,2019,PRG022,PROLONGED PREGNANCY,PGN002,SPONTANEOUS VAGINAL DELIVERY,541,VAGINAL DELIVERY W STERILIZATION &/OR D&C,14,"PREGNANCY, CHILDBIRTH AND THE PUERPERIUM",1,Minor,Minor,Surgical,Private Health Insurance,,,,,false,26121.89,9685.44
New York City,Manhattan,7002053,001463,NYU Langone Hospitals,30 to 49,112,F,White,Not Span/Hispanic,3,Elective,Home or Self Care,2019,PRG024,"MALPOSITION, DISPROPORTION OR OTHER LABOR COMPLICATIONS",PGN002,SPONTANEOUS VAGINAL DELIVERY,541,VAGINAL DELIVERY W STERILIZATION &/OR D&C,14,"PREGNANCY, CHILDBIRTH AND THE PUERPERIUM",1,Minor,Minor,Surgical,Private Health Insurance,,,,,false,29445.3,12335.95
New York City,Manhattan,7002053,001463,NYU Langone Hospitals,30 to 49,100,F,White,Not Span/Hispanic,2,Elective,Home or Self Care,2019,PRG011,EARLY OR THREATENED LABOR,PGN002,SPONTANEOUS VAGINAL DELIVERY,541,VAGINAL DELIVERY W STERILIZATION &/OR D&C,14,"PREGNANCY, CHILDBIRTH AND THE PUERPERIUM",1,Minor,Minor,Surgical,Private Health Insurance,,,,,false,28809.63,9784.62
New York City,Manhattan,7002053,001463,NYU Langone Hospitals,30 to 49,100,F,Black/African American,Not Span/Hispanic,2,Elective,Home or Self Care,2019,PRG029,"UNCOMPLICATED PREGNANCY, DELIVERY OR PUERPERIUM",PGN002,SPONTANEOUS VAGINAL DELIVERY,541,VAGINAL DELIVERY W STERILIZATION &/OR D&C,14,"PREGNANCY, CHILDBIRTH AND THE PUERPERIUM",2,Moderate,Minor,Surgical,Private Health Insurance,,,,,false,45357.93,16187.83
New York City,Manhattan,7002053,001463,NYU Langone Hospitals,30 to 49,100,F,White,Not Span/Hispanic,2,Elective,Home or Self Care,2019,PRG011,EARLY OR THREATENED LABOR,MST021,PERINEAL MUSCLE LACERATION REPAIR (2ND DEGREE OBSTETRICAL AND OTHER),541,VAGINAL DELIVERY W STERILIZATION &/OR D&C,14,"PREGNANCY, CHILDBIRTH AND THE PUERPERIUM",2,Moderate,Minor,Surgical,Private Health Insurance,,,,,false,50582.83,13178.03
New York City,Manhattan,7002053,001463,NYU Langone Hospitals,30 to 49,100,F,White,Not Span/Hispanic,3,Elective,Home or Self Care,2019,PRG029,"UNCOMPLICATED PREGNANCY, DELIVERY OR PUERPERIUM",PGN004,ASSISTED VAGINAL DELIVERY,541,VAGINAL DELIVERY W STERILIZATION &/OR D&C,14,"PREGNANCY, CHILDBIRTH AND THE PUERPERIUM",1,Minor,Minor,Surgical,Private Health Insurance,,,,,false,34413.44,13169.83
New York City,Manhattan,7002053,001463,NYU Langone Hospitals,30 to 49,100,F,White,Not Span/Hispanic,3,Elective,Home or Self Care,2019,PRG022,PROLONGED PREGNANCY,PGN002,SPONTANEOUS VAGINAL DELIVERY,541,VAGINAL DELIVERY W STERILIZATION &/OR D&C,14,"PREGNANCY, CHILDBIRTH AND THE PUERPERIUM",1,Minor,Minor,Surgical,Private Health Insurance,,,,,false,52265.46,16470.17
New York City,Manhattan,7002053,001463,NYU Langone Hospitals,30 to 49,112,F,White,Not Span/Hispanic,3,Elective,Home or Self Care,2019,PRG029,"UNCOMPLICATED PREGNANCY, DELIVERY OR PUERPERIUM",PGN002,SPONTANEOUS VAGINAL DELIVERY,541,VAGINAL DELIVERY W STERILIZATION &/OR D&C,14,"PREGNANCY, CHILDBIRTH AND THE PUERPERIUM",3,Major,Minor,Surgical,Private Health Insurance,,,,,false,34007.37,12746.06
New York City,Manhattan,7002053,001463,NYU Langone Hospitals,30 to 49,112,F,White,Not Span/Hispanic,2,Elective,Home or Self Care,2019,PRG026,OB-RELATED TRAUMA TO PERINEUM AND VULVA,PGN002,SPONTANEOUS VAGINAL DELIVERY,541,VAGINAL DELIVERY W STERILIZATION &/OR D&C,14,"PREGNANCY, CHILDBIRTH AND THE PUERPERIUM",1,Minor,Minor,Surgical,Blue Cross/Blue Shield,,,,,false,24657.38,9576.72
New York City,Manhattan,7002053,001463,NYU Langone Hospitals,30 to 49,100,F,Other Race,Not Span/Hispanic,11,Elective,Home or Self Care,2019,PRG011,EARLY OR THREATENED LABOR,PGN002,SPONTANEOUS VAGINAL DELIVERY,541,VAGINAL DELIVERY W STERILIZATION &/OR D&C,14,"PREGNANCY, CHILDBIRTH AND THE PUERPERIUM",3,Major,Minor,Surgical,Private Health Insurance,,,,,false,129010.52,41632.55
New York City,Manhattan,7002053,001463,NYU Langone Hospitals,30 to 49,112,F,White,Not Span/Hispanic,1,Elective,Home or Self Care,2019,PRG022,PROLONGED PREGNANCY,PGN001,FETAL HEART RATE MONITORING,541,VAGINAL DELIVERY W STERILIZATION &/OR D&C,14,"PREGNANCY, CHILDBIRTH AND THE PUERPERIUM",2,Moderate,Minor,Surgical,Blue Cross/Blue Shield,,,,,false,22102.17,7289.06
New York City,Manhattan,7002053,001463,NYU Langone Hospitals,30 to 49,100,F,Other Race,Not Span/Hispanic,2,Elective,Home or Self Care,2019,PRG023,COMPLICATIONS SPECIFIED DURING CHILDBIRTH,PGN002,SPONTANEOUS VAGINAL DELIVERY,541,VAGINAL DELIVERY W STERILIZATION &/OR D&C,14,"PREGNANCY, CHILDBIRTH AND THE PUERPERIUM",1,Minor,Minor,Surgical,Private Health Insurance,,,,,false,25011.62,9743.23
New York City,Manhattan,7002053,001463,NYU Langone Hospitals,30 to 49,112,F,White,Not Span/Hispanic,3,Elective,Home or Self Care,2019,PRG022,PROLONGED PREGNANCY,PGN002,SPONTANEOUS VAGINAL DELIVERY,541,VAGINAL DELIVERY W STERILIZATION &/OR D&C,14,"PREGNANCY, CHILDBIRTH AND THE PUERPERIUM",2,Moderate,Minor,Surgical,Private Health Insurance,,,,,false,32709.39,12889.3
New York City,Manhattan,7002053,001463,NYU Langone Hospitals,30 to 49,100,F,White,Not Span/Hispanic,3,Elective,Home or Self Care,2019,PRG024,"MALPOSITION, DISPROPORTION OR OTHER LABOR COMPLICATIONS",PGN002,SPONTANEOUS VAGINAL DELIVERY,541,VAGINAL DELIVERY W STERILIZATION &/OR D&C,14,"PREGNANCY, CHILDBIRTH AND THE PUERPERIUM",2,Moderate,Minor,Surgical,Private Health Insurance,,,,,false,43667.2,13464.59
New York City,Manhattan,7002053,001463,NYU Langone Hospitals,30 to 49,100,F,White,Not Span/Hispanic,2,Emergency,Home or Self Care,2019,PRG011,EARLY OR THREATENED LABOR,PGN002,SPONTANEOUS VAGINAL DELIVERY,541,VAGINAL DELIVERY W STERILIZATION &/OR D&C,14,"PREGNANCY, CHILDBIRTH AND THE PUERPERIUM",2,Moderate,Minor,Surgical,Private Health Insurance,,,,,false,57618.1,18669.4
New York City,Manhattan,7002053,001463,NYU Langone Hospitals,30 to 49,112,F,White,Not Span/Hispanic,2,Elective,Home or Self Care,2019,PRG022,PROLONGED PREGNANCY,PGN002,SPONTANEOUS VAGINAL DELIVERY,541,VAGINAL DELIVERY W STERILIZATION &/OR D&C,14,"PREGNANCY, CHILDBIRTH AND THE PUERPERIUM",2,Moderate,Minor,Surgical,Private Health Insurance,,,,,false,26735.2,10042.67
New York City,Manhattan,7002053,001463,NYU Langone Hospitals,18 to 29,112,F,White,Not Span/Hispanic,2,Elective,Home or Self Care,2019,PRG023,COMPLICATIONS SPECIFIED DURING CHILDBIRTH,PGN002,SPONTANEOUS VAGINAL DELIVERY,541,VAGINAL DELIVERY W STERILIZATION &/OR D&C,14,"PREGNANCY, CHILDBIRTH AND THE PUERPERIUM",2,Moderate,Minor,Surgical,Medicaid,,,,,false,32908.2,10655.71
New York City,Manhattan,7002053,001463,NYU Langone Hospitals,18 to 29,112,F,White,Not Span/Hispanic,3,Elective,Home or Self Care,2019,PRG024,"MALPOSITION, DISPROPORTION OR OTHER LABOR COMPLICATIONS",PGN002,SPONTANEOUS VAGINAL DELIVERY,541,VAGINAL DELIVERY W STERILIZATION &/OR D&C,14,"PREGNANCY, CHILDBIRTH AND THE PUERPERIUM",2,Moderate,Minor,Surgical,Private Health Insurance,,,,,false,29822.37,12409.17
New York City,Manhattan,7002053,001463,NYU Langone Hospitals,30 to 49,112,F,White,Not Span/Hispanic,3,Elective,Home or Self Care,2019,PRG022,PROLONGED PREGNANCY,PGN004,ASSISTED VAGINAL DELIVERY,541,VAGINAL DELIVERY W STERILIZATION &/OR D&C,14,"PREGNANCY, CHILDBIRTH AND THE PUERPERIUM",1,Minor,Minor,Surgical,Private Health Insurance,,,,,false,32745.29,12763.67
New York City,Manhattan,7002053,001463,NYU Langone Hospitals,30 to 49,112,F,White,Not Span/Hispanic,2,Elective,Home or Self Care,2019,PRG017,MATERNAL CARE FOR ABNORMALITY OF PELVIC ORGANS,PGN002,SPONTANEOUS VAGINAL DELIVERY,541,VAGINAL DELIVERY W STERILIZATION &/OR D&C,14,"PREGNANCY, CHILDBIRTH AND THE PUERPERIUM",2,Moderate,Minor,Surgical,Blue Cross/Blue Shield,,,,,false,33310.97,10917.05
New York City,Manhattan,7002053,001463,NYU Langone Hospitals,30 to 49,104,F,Other Race,Spanish/Hispanic,4,Elective,Home or Self Care,2019,PRG022,PROLONGED PREGNANCY,PGN002,SPONTANEOUS VAGINAL DELIVERY,541,VAGINAL DELIVERY W STERILIZATION &/OR D&C,14,"PREGNANCY, CHILDBIRTH AND THE PUERPERIUM",2,Moderate,Minor,Surgical,Blue Cross/Blue Shield,Blue Cross/Blue Shield,,,,false,78236.74,25064.02
New York City,Manhattan,7002053,001463,NYU Langone Hospitals,18 to 29,100,F,Other Race,Not Span/Hispanic,3,Elective,Home or Self Care,2019,PRG023,COMPLICATIONS SPECIFIED DURING CHILDBIRTH,PGN002,SPONTANEOUS VAGINAL DELIVERY,541,VAGINAL DELIVERY W STERILIZATION &/OR D&C,14,"PREGNANCY, CHILDBIRTH AND THE PUERPERIUM",1,Minor,Minor,Surgical,Private Health Insurance,,,,,false,47373.21,15194.47
New York City,Manhattan,7002053,001463,NYU Langone Hospitals,30 to 49,OOS,F,White,Not Span/Hispanic,2,Elective,Home or Self Care,2019,PRG026,OB-RELATED TRAUMA TO PERINEUM AND VULVA,PGN002,SPONTANEOUS VAGINAL DELIVERY,541,VAGINAL DELIVERY W STERILIZATION &/OR D&C,14,"PREGNANCY, CHILDBIRTH AND THE PUERPERIUM",1,Minor,Minor,Surgical,Private Health Insurance,,,,,false,23850.21,9537.79
New York City,Manhattan,7002053,001463,NYU Langone Hospitals,30 to 49,112,F,White,Not Span/Hispanic,2,Elective,Home or Self Care,2019,PRG029,"UNCOMPLICATED PREGNANCY, DELIVERY OR PUERPERIUM",ADM008,CERVICAL RIPENING,541,VAGINAL DELIVERY W STERILIZATION &/OR D&C,14,"PREGNANCY, CHILDBIRTH AND THE PUERPERIUM",3,Major,Minor,Surgical,Private Health Insurance,,,,,false,26019.69,9604.64
New York City,Manhattan,7002053,001463,NYU Langone Hospitals,30 to 49,112,F,White,Not Span/Hispanic,2,Elective,Home or Self Care,2019,PRG029,"UNCOMPLICATED PREGNANCY, DELIVERY OR PUERPERIUM",PGN002,SPONTANEOUS VAGINAL DELIVERY,541,VAGINAL DELIVERY W STERILIZATION &/OR D&C,14,"PREGNANCY, CHILDBIRTH AND THE PUERPERIUM",2,Moderate,Minor,Surgical,Private Health Insurance,,,,,false,27668.06,10147.24
New York City,Manhattan,7002053,001463,NYU Langone Hospitals,18 to 29,112,F,White,Spanish/Hispanic,3,Elective,Home or Self Care,2019,PRG020,HYPERTENSION AND HYPERTENSIVE-RELATED CONDITIONS COMPLICATING PREGNANCY; CHILDBIRTH; AND THE PUERPERIUM,PGN002,SPONTANEOUS VAGINAL DELIVERY,541,VAGINAL DELIVERY W STERILIZATION &/OR D&C,14,"PREGNANCY, CHILDBIRTH AND THE PUERPERIUM",2,Moderate,Minor,Surgical,Private Health Insurance,,,,,false,80850.21,20054.67
New York City,Manhattan,7002053,001463,NYU Langone Hospitals,30 to 49,112,F,White,Not Span/Hispanic,3,Elective,Home or Self Care,2019,PRG029,"UNCOMPLICATED PREGNANCY, DELIVERY OR PUERPERIUM",PGN002,SPONTANEOUS VAGINAL DELIVERY,541,VAGINAL DELIVERY W STERILIZATION &/OR D&C,14,"PREGNANCY, CHILDBIRTH AND THE PUERPERIUM",2,Moderate,Minor,Surgical,Medicaid,,,,,false,38498.57,13750.61
New York City,Manhattan,7002053,001463,NYU Langone Hospitals,30 to 49,100,F,White,Not Span/Hispanic,2,Elective,Home or Self Care,2019,PRG026,OB-RELATED TRAUMA TO PERINEUM AND VULVA,PGN002,SPONTANEOUS VAGINAL DELIVERY,541,VAGINAL DELIVERY W STERILIZATION &/OR D&C,14,"PREGNANCY, CHILDBIRTH AND THE PUERPERIUM",1,Minor,Minor,Surgical,Private Health Insurance,,,,,false,28137.64,10061.56
New York City,Manhattan,7002053,001463,NYU Langone Hospitals,30 to 49,100,F,White,Not Span/Hispanic,2,Elective,Home or Self Care,2019,PRG029,"UNCOMPLICATED PREGNANCY, DELIVERY OR PUERPERIUM",PGN002,SPONTANEOUS VAGINAL DELIVERY,541,VAGINAL DELIVERY W STERILIZATION &/OR D&C,14,"PREGNANCY, CHILDBIRTH AND THE PUERPERIUM",1,Minor,Minor,Surgical,Private Health Insurance,,,,,false,25000.96,9742.94
New York City,Manhattan,7002053,001463,NYU Langone Hospitals,18 to 29,104,F,Other Race,Spanish/Hispanic,2,Elective,Home or Self Care,2019,PRG012,MULTIPLE GESTATION,PGN001,FETAL HEART RATE MONITORING,541,VAGINAL DELIVERY W STERILIZATION &/OR D&C,14,"PREGNANCY, CHILDBIRTH AND THE PUERPERIUM",3,Major,Minor,Surgical,Private Health Insurance,,,,,false,31982.95,10293.16
New York City,Manhattan,7002053,001463,NYU Langone Hospitals,30 to 49,OOS,F,White,Not Span/Hispanic,2,Elective,Home or Self Care,2019,PRG020,HYPERTENSION AND HYPERTENSIVE-RELATED CONDITIONS COMPLICATING PREGNANCY; CHILDBIRTH; AND THE PUERPERIUM,PGN002,SPONTANEOUS VAGINAL DELIVERY,541,VAGINAL DELIVERY W STERILIZATION &/OR D&C,14,"PREGNANCY, CHILDBIRTH AND THE PUERPERIUM",3,Major,Moderate,Surgical,Blue Cross/Blue Shield,,,,,false,45428.21,11699.27
New York City,Manhattan,7002053,001463,NYU Langone Hospitals,30 to 49,117,F,Other Race,Not Span/Hispanic,3,Elective,Home or Self Care,2019,PRG029,"UNCOMPLICATED PREGNANCY, DELIVERY OR PUERPERIUM",PGN002,SPONTANEOUS VAGINAL DELIVERY,541,VAGINAL DELIVERY W STERILIZATION &/OR D&C,14,"PREGNANCY, CHILDBIRTH AND THE PUERPERIUM",1,Minor,Minor,Surgical,Blue Cross/Blue Shield,,,,,false,34504.74,13294.04
New York City,Manhattan,7002053,001463,NYU Langone Hospitals,30 to 49,113,F,White,Not Span/Hispanic,2,Elective,Home or Self Care,2019,PRG019,DIABETES OR ABNORMAL GLUCOSE TOLERANCE COMPLICATING PREGNANCY; CHILDBIRTH; OR THE PUERPERIUM,PGN002,SPONTANEOUS VAGINAL DELIVERY,541,VAGINAL DELIVERY W STERILIZATION &/OR D&C,14,"PREGNANCY, CHILDBIRTH AND THE PUERPERIUM",2,Moderate,Minor,Surgical,Private Health Insurance,,,,,false,28613.85,10092.03
New York City,Manhattan,7002053,001463,NYU Langone Hospitals,30 to 49,100,F,Other Race,Not Span/Hispanic,3,Elective,Home or Self Care,2019,PRG023,COMPLICATIONS SPECIFIED DURING CHILDBIRTH,FRS007,FEMALE GENITAL TRACT REPAIR (EXCLUDING VULVA),541,VAGINAL DELIVERY W STERILIZATION &/OR D&C,14,"PREGNANCY, CHILDBIRTH AND THE PUERPERIUM",2,Moderate,Minor,Surgical,Private Health Insurance,,,,,false,87549.54,18901
New York City,Manhattan,7002053,001463,NYU Langone Hospitals,30 to 49,111,F,Other Race,Not Span/Hispanic,2,Elective,Home or Self Care,2019,PRG018,MATERNAL CARE RELATED TO DISORDERS OF THE PLACENTA AND PLACENTAL IMPLANTATION,PGN002,SPONTANEOUS VAGINAL DELIVERY,541,VAGINAL DELIVERY W STERILIZATION &/OR D&C,14,"PREGNANCY, CHILDBIRTH AND THE PUERPERIUM",2,Moderate,Minor,Surgical,Private Health Insurance,,,,,false,38832.84,11166.93
New York City,Manhattan,7002053,001463,NYU Langone Hospitals,30 to 49,112,F,White,Not Span/Hispanic,2,Elective,Home or Self Care,2019,PRG023,COMPLICATIONS SPECIFIED DURING CHILDBIRTH,PGN002,SPONTANEOUS VAGINAL DELIVERY,541,VAGINAL DELIVERY W STERILIZATION &/OR D&C,14,"PREGNANCY, CHILDBIRTH AND THE PUERPERIUM",2,Moderate,Minor,Surgical,Private Health Insurance,,,,,false,42559.1,16640.93
New York City,Manhattan,7002053,001463,NYU Langone Hospitals,30 to 49,112,F,White,Not Span/Hispanic,3,Elective,Home or Self Care,2019,PRG029,"UNCOMPLICATED PREGNANCY, DELIVERY OR PUERPERIUM",PGN002,SPONTANEOUS VAGINAL DELIVERY,541,VAGINAL DELIVERY W STERILIZATION &/OR D&C,14,"PREGNANCY, CHILDBIRTH AND THE PUERPERIUM",2,Moderate,Minor,Surgical,Blue Cross/Blue Shield,,,,,false,33907.52,12921.66
New York City,Manhattan,7002053,001463,NYU Langone Hospitals,18 to 29,112,F,White,Not Span/Hispanic,1,Elective,Home or Self Care,2019,PRG022,PROLONGED PREGNANCY,PGN002,SPONTANEOUS VAGINAL DELIVERY,541,VAGINAL DELIVERY W STERILIZATION &/OR D&C,14,"PREGNANCY, CHILDBIRTH AND THE PUERPERIUM",1,Minor,Minor,Surgical,Private Health Insurance,,,,,false,17471.21,6577.93
New York City,Manhattan,7002053,001463,NYU Langone Hospitals,30 to 49,100,F,White,Not Span/Hispanic,3,Elective,Home or Self Care,2019,PRG026,OB-RELATED TRAUMA TO PERINEUM AND VULVA,PGN002,SPONTANEOUS VAGINAL DELIVERY,541,VAGINAL DELIVERY W STERILIZATION &/OR D&C,14,"PREGNANCY, CHILDBIRTH AND THE PUERPERIUM",1,Minor,Minor,Surgical,Private Health Insurance,,,,,false,36768.37,12912.37
New York City,Manhattan,7002053,001463,NYU Langone Hospitals,30 to 49,100,F,White,Not Span/Hispanic,2,Elective,Home or Self Care,2019,PRG011,EARLY OR THREATENED LABOR,PGN002,SPONTANEOUS VAGINAL DELIVERY,541,VAGINAL DELIVERY W STERILIZATION &/OR D&C,14,"PREGNANCY, CHILDBIRTH AND THE PUERPERIUM",3,Major,Minor,Surgical,Private Health Insurance,,,,,false,47853.44,16058.76
New York City,Manhattan,7002053,001463,NYU Langone Hospitals,30 to 49,100,F,White,Not Span/Hispanic,1,Elective,Home or Self Care,2019,PRG020,HYPERTENSION AND HYPERTENSIVE-RELATED CONDITIONS COMPLICATING PREGNANCY; CHILDBIRTH; AND THE PUERPERIUM,PGN002,SPONTANEOUS VAGINAL DELIVERY,541,VAGINAL DELIVERY W STERILIZATION &/OR D&C,14,"PREGNANCY, CHILDBIRTH AND THE PUERPERIUM",2,Moderate,Minor,Surgical,Blue Cross/Blue Shield,,,,,false,47626.9,10689.71
New York City,Manhattan,7002053,001463,NYU Langone Hospitals,18 to 29,112,F,White,Not Span/Hispanic,2,Emergency,Home or Self Care,2019,PRG027,COMPLICATIONS SPECIFIED DURING THE PUERPERIUM,PGN006,REMOVAL OF PLACENTA AND OTHER RETAINED PRODUCTS OF CONCEPTION,541,VAGINAL DELIVERY W STERILIZATION &/OR D&C,14,"PREGNANCY, CHILDBIRTH AND THE PUERPERIUM",1,Minor,Minor,Surgical,Medicaid,,,,,true,30971.31,10861.84
New York City,Manhattan,7002053,001463,NYU Langone Hospitals,30 to 49,112,F,White,Not Span/Hispanic,1,Elective,Home or Self Care,2019,PRG023,COMPLICATIONS SPECIFIED DURING CHILDBIRTH,PGN002,SPONTANEOUS VAGINAL DELIVERY,541,VAGINAL DELIVERY W STERILIZATION &/OR D&C,14,"PREGNANCY, CHILDBIRTH AND THE PUERPERIUM",1,Minor,Minor,Surgical,Blue Cross/Blue Shield,,,,,false,16680.87,6517.81
New York City,Manhattan,7002053,001463,NYU Langone Hospitals,30 to 49,100,F,White,Not Span/Hispanic,2,Elective,Home or Self Care,2019,PRG011,EARLY OR THREATENED LABOR,PGN002,SPONTANEOUS VAGINAL DELIVERY,541,VAGINAL DELIVERY W STERILIZATION &/OR D&C,14,"PREGNANCY, CHILDBIRTH AND THE PUERPERIUM",2,Moderate,Minor,Surgical,Private Health Insurance,,,,,false,27306.98,9939.57