Hospital Service Area,Hospital County,Operating Certificate Number,Permanent Facility Id,Facility Name,Age Group,Zip Code - 3 digits,Gender,Race,Ethnicity,Length of Stay,Type of Admission,Patient Disposition,Discharge Year,CCS Diagnosis Code,CCS Diagnosis Description,CCS Procedure Code,CCS Procedure Description,APR DRG Code,APR DRG Description,APR MDC Code,APR MDC Description,APR Severity of Illness Code,APR Severity of Illness Description,APR Risk of Mortality,APR Medical Surgical Description,Payment Typology 1,Payment Typology 2,Payment Typology 3,Birth Weight,Abortion Edit Indicator,Emergency Department Indicator,Total Charges,Total Costs
New York City,Manhattan,7002032,001466,Mount Sinai West,18 to 29,100,F,Black/African American,Not Span/Hispanic,1,Emergency,Home or Self Care,2020,PRG028,OTHER SPECIFIED COMPLICATIONS IN PREGNANCY,PGN006,REMOVAL OF PLACENTA AND OTHER RETAINED PRODUCTS OF CONCEPTION,541,VAGINAL DELIVERY W STERILIZATION &/OR D&C,14,"PREGNANCY, CHILDBIRTH AND THE PUERPERIUM",2,Moderate,Minor,Surgical,Medicaid,Self-Pay,,,,N,20357.68,4107.37
New York City,Bronx,7000006,001168,Montefiore Medical Center-Wakefield Hospital,30 to 49,104,F,Black/African American,Not Span/Hispanic,3,Emergency,Home or Self Care,2020,PRG022,PROLONGED PREGNANCY,PGN002,SPONTANEOUS VAGINAL DELIVERY,541,VAGINAL DELIVERY W STERILIZATION &/OR D&C,14,"PREGNANCY, CHILDBIRTH AND THE PUERPERIUM",2,Moderate,Minor,Surgical,Medicaid,,,,,N,54242,14889.96
New York City,Bronx,7000006,001168,Montefiore Medical Center-Wakefield Hospital,30 to 49,104,F,Other Race,Spanish/Hispanic,3,Emergency,Home or Self Care,2020,PRG029,"UNCOMPLICATED PREGNANCY, DELIVERY OR PUERPERIUM",PGN002,SPONTANEOUS VAGINAL DELIVERY,541,VAGINAL DELIVERY W STERILIZATION &/OR D&C,14,"PREGNANCY, CHILDBIRTH AND THE PUERPERIUM",1,Minor,Minor,Surgical,Medicaid,,,,,N,64315.82,19348.61
Hudson Valley,Westchester,5904001,001072,Montefiore New Rochelle Hospital,18 to 29,108,F,White,Unknown,3,Elective,Home or Self Care,2020,PRG020,HYPERTENSION AND HYPERTENSIVE-RELATED CONDITIONS COMPLICATING PREGNANCY; CHILDBIRTH; AND THE PUERPERIUM,PGN002,SPONTANEOUS VAGINAL DELIVERY,541,VAGINAL DELIVERY W STERILIZATION &/OR D&C,14,"PREGNANCY, CHILDBIRTH AND THE PUERPERIUM",2,Moderate,Minor,Surgical,Medicaid,Medicaid,Self-Pay,,,N,24685.08,10397.29
Hudson Valley,Westchester,5904001,001072,Montefiore New Rochelle Hospital,18 to 29,108,F,White,Spanish/Hispanic,3,Elective,Home or Self Care,2020,PRG020,HYPERTENSION AND HYPERTENSIVE-RELATED CONDITIONS COMPLICATING PREGNANCY; CHILDBIRTH; AND THE PUERPERIUM,PGN002,SPONTANEOUS VAGINAL DELIVERY,541,VAGINAL DELIVERY W STERILIZATION &/OR D&C,14,"PREGNANCY, CHILDBIRTH AND THE PUERPERIUM",2,Moderate,Minor,Surgical,Medicaid,Medicaid,Self-Pay,,,N,29516.11,12270.71
New York City,Manhattan,7002054,001464,New York-Presbyterian Hospital - Columbia Presbyterian Center,30 to 49,104,F,White,Spanish/Hispanic,2,Emergency,Home or Self Care,2020,PRG029,"UNCOMPLICATED PREGNANCY, DELIVERY OR PUERPERIUM",PGN002,SPONTANEOUS VAGINAL DELIVERY,541,VAGINAL DELIVERY W STERILIZATION &/OR D&C,14,"PREGNANCY, CHILDBIRTH AND THE PUERPERIUM",1,Minor,Minor,Surgical,Medicaid,Medicaid,Self-Pay,,,Y,38976.9,9819.16
New York City,Manhattan,7002024,001456,Mount Sinai Hospital,30 to 49,100,F,Other Race,Spanish/Hispanic,3,Elective,Home or Self Care,2020,PRG023,COMPLICATIONS SPECIFIED DURING CHILDBIRTH,PGN002,SPONTANEOUS VAGINAL DELIVERY,541,VAGINAL DELIVERY W STERILIZATION &/OR D&C,14,"PREGNANCY, CHILDBIRTH AND THE PUERPERIUM",2,Moderate,Minor,Surgical,Medicaid,Medicaid,Self-Pay,,,N,44741.79,14872.39
New York City,Bronx,7000006,001168,Montefiore Medical Center-Wakefield Hospital,18 to 29,104,F,Other Race,Spanish/Hispanic,3,Elective,Home or Self Care,2020,PRG013,MATERNAL CARE RELATED TO FETAL CONDITIONS,PGN002,SPONTANEOUS VAGINAL DELIVERY,541,VAGINAL DELIVERY W STERILIZATION &/OR D&C,14,"PREGNANCY, CHILDBIRTH AND THE PUERPERIUM",2,Moderate,Minor,Surgical,Medicaid,,,,,N,43909.6,11209.25
New York City,Kings,7002053,001304,NYU Langone Hospital-Brooklyn,18 to 29,112,F,White,Not Span/Hispanic,2,Elective,Home or Self Care,2020,PRG026,OB-RELATED TRAUMA TO PERINEUM AND VULVA,PGN002,SPONTANEOUS VAGINAL DELIVERY,541,VAGINAL DELIVERY W STERILIZATION &/OR D&C,14,"PREGNANCY, CHILDBIRTH AND THE PUERPERIUM",1,Minor,Minor,Surgical,Medicaid,,,,,N,53153.23,15903.95
New York City,Bronx,7000006,001168,Montefiore Medical Center-Wakefield Hospital,30 to 49,104,F,Other Race,Spanish/Hispanic,2,Elective,Home or Self Care,2020,PRG023,COMPLICATIONS SPECIFIED DURING CHILDBIRTH,PGN002,SPONTANEOUS VAGINAL DELIVERY,541,VAGINAL DELIVERY W STERILIZATION &/OR D&C,14,"PREGNANCY, CHILDBIRTH AND THE PUERPERIUM",3,Major,Minor,Surgical,Medicaid,,,,,N,43652.35,13557.96
New York City,Kings,7002053,001304,NYU Langone Hospital-Brooklyn,30 to 49,112,F,White,Spanish/Hispanic,2,Elective,Home or Self Care,2020,PRG016,PREVIOUS C-SECTION,PGN002,SPONTANEOUS VAGINAL DELIVERY,541,VAGINAL DELIVERY W STERILIZATION &/OR D&C,14,"PREGNANCY, CHILDBIRTH AND THE PUERPERIUM",2,Moderate,Minor,Surgical,Medicaid,,,,,N,55667,14752.52
,,,,Redacted for Confidentiality,30 to 49,,F,Black/African American,Not Span/Hispanic,1,Emergency,Home or Self Care,2020,PRG003,SPONTANEOUS ABORTION AND COMPLICATIONS OF SPONTANEOUS ABORTION,PGN006,REMOVAL OF PLACENTA AND OTHER RETAINED PRODUCTS OF CONCEPTION,541,VAGINAL DELIVERY W STERILIZATION &/OR D&C,14,"PREGNANCY, CHILDBIRTH AND THE PUERPERIUM",2,Moderate,Minor,Surgical,Medicaid,,,,,Y,45521.04,8114.65
New York City,Kings,7002053,001304,NYU Langone Hospital-Brooklyn,30 to 49,112,F,Black/African American,Not Span/Hispanic,3,Elective,Home or Self Care,2020,PRG022,PROLONGED PREGNANCY,PGN002,SPONTANEOUS VAGINAL DELIVERY,541,VAGINAL DELIVERY W STERILIZATION &/OR D&C,14,"PREGNANCY, CHILDBIRTH AND THE PUERPERIUM",2,Moderate,Minor,Surgical,Medicaid,,,,,N,36401.96,10726.54
New York City,Manhattan,7002053,001463,NYU Langone Hospitals,30 to 49,100,F,White,Not Span/Hispanic,2,Elective,Home or Self Care,2020,PRG016,PREVIOUS C-SECTION,FRS005,FALLOPIAN TUBE LIGATION AND EXCISION,541,VAGINAL DELIVERY W STERILIZATION &/OR D&C,14,"PREGNANCY, CHILDBIRTH AND THE PUERPERIUM",1,Minor,Minor,Surgical,Private Health Insurance,,,,,N,59892.29,15545.54
Finger Lakes,Monroe,2701005,000413,Strong Memorial Hospital,30 to 49,145,F,White,Not Span/Hispanic,2,Urgent,Home or Self Care,2020,PRG024,"MALPOSITION, DISPROPORTION OR OTHER LABOR COMPLICATIONS",PGN002,SPONTANEOUS VAGINAL DELIVERY,541,VAGINAL DELIVERY W STERILIZATION &/OR D&C,14,"PREGNANCY, CHILDBIRTH AND THE PUERPERIUM",1,Minor,Minor,Surgical,Medicaid,,,,,N,13624.82,6708.4
Finger Lakes,Monroe,2701005,000413,Strong Memorial Hospital,18 to 29,146,F,Black/African American,Not Span/Hispanic,2,Urgent,Home or Self Care,2020,PRG020,HYPERTENSION AND HYPERTENSIVE-RELATED CONDITIONS COMPLICATING PREGNANCY; CHILDBIRTH; AND THE PUERPERIUM,PGN002,SPONTANEOUS VAGINAL DELIVERY,541,VAGINAL DELIVERY W STERILIZATION &/OR D&C,14,"PREGNANCY, CHILDBIRTH AND THE PUERPERIUM",2,Moderate,Minor,Surgical,Medicaid,,,,,N,12882.77,6248.15
Finger Lakes,Monroe,2701005,000413,Strong Memorial Hospital,30 to 49,146,F,White,Not Span/Hispanic,3,Elective,Home or Self Care,2020,PRG020,HYPERTENSION AND HYPERTENSIVE-RELATED CONDITIONS COMPLICATING PREGNANCY; CHILDBIRTH; AND THE PUERPERIUM,PGN002,SPONTANEOUS VAGINAL DELIVERY,541,VAGINAL DELIVERY W STERILIZATION &/OR D&C,14,"PREGNANCY, CHILDBIRTH AND THE PUERPERIUM",1,Minor,Minor,Surgical,Blue Cross/Blue Shield,,,,,N,17068.66,8854.83
Finger Lakes,Monroe,2701005,000413,Strong Memorial Hospital,18 to 29,145,F,White,Not Span/Hispanic,2,Urgent,Home or Self Care,2020,PRG020,HYPERTENSION AND HYPERTENSIVE-RELATED CONDITIONS COMPLICATING PREGNANCY; CHILDBIRTH; AND THE PUERPERIUM,PGN002,SPONTANEOUS VAGINAL DELIVERY,541,VAGINAL DELIVERY W STERILIZATION &/OR D&C,14,"PREGNANCY, CHILDBIRTH AND THE PUERPERIUM",2,Moderate,Minor,Surgical,Medicaid,,,,,N,15915.35,7845.46
New York City,Bronx,7000001,001178,BronxCare Hospital Center,30 to 49,104,F,Black/African American,Not Span/Hispanic,4,Urgent,Home or Self Care,2020,PRG022,PROLONGED PREGNANCY,PGN002,SPONTANEOUS VAGINAL DELIVERY,541,VAGINAL DELIVERY W STERILIZATION &/OR D&C,14,"PREGNANCY, CHILDBIRTH AND THE PUERPERIUM",2,Moderate,Minor,Surgical,Medicaid,Medicaid,,,,N,15835.55,21927.76
New York City,Bronx,7000001,001178,BronxCare Hospital Center,30 to 49,104,F,Black/African American,Not Span/Hispanic,3,Urgent,Home or Self Care,2020,PRG023,COMPLICATIONS SPECIFIED DURING CHILDBIRTH,PGN002,SPONTANEOUS VAGINAL DELIVERY,541,VAGINAL DELIVERY W STERILIZATION &/OR D&C,14,"PREGNANCY, CHILDBIRTH AND THE PUERPERIUM",2,Moderate,Minor,Surgical,Private Health Insurance,,,,,N,8261.57,11902
New York City,Bronx,7000001,001178,BronxCare Hospital Center,30 to 49,104,F,Other Race,Spanish/Hispanic,3,Urgent,Home or Self Care,2020,PRG013,MATERNAL CARE RELATED TO FETAL CONDITIONS,PGN002,SPONTANEOUS VAGINAL DELIVERY,541,VAGINAL DELIVERY W STERILIZATION &/OR D&C,14,"PREGNANCY, CHILDBIRTH AND THE PUERPERIUM",2,Moderate,Minor,Surgical,Medicaid,Medicaid,,,,N,9731.61,14635.35
New York City,Bronx,7000001,001178,BronxCare Hospital Center,18 to 29,104,F,Black/African American,Not Span/Hispanic,2,Urgent,Home or Self Care,2020,PRG023,COMPLICATIONS SPECIFIED DURING CHILDBIRTH,PGN002,SPONTANEOUS VAGINAL DELIVERY,541,VAGINAL DELIVERY W STERILIZATION &/OR D&C,14,"PREGNANCY, CHILDBIRTH AND THE PUERPERIUM",2,Moderate,Minor,Surgical,Medicaid,Medicaid,,,,N,8814.61,13076.98
Finger Lakes,Monroe,2701001,000409,Highland Hospital,18 to 29,146,F,Other Race,Spanish/Hispanic,2,Elective,Home or Self Care,2020,PRG029,"UNCOMPLICATED PREGNANCY, DELIVERY OR PUERPERIUM",PGN002,SPONTANEOUS VAGINAL DELIVERY,541,VAGINAL DELIVERY W STERILIZATION &/OR D&C,14,"PREGNANCY, CHILDBIRTH AND THE PUERPERIUM",1,Minor,Minor,Surgical,Medicaid,,,,,N,14757.59,7164.35
Finger Lakes,Monroe,2701001,000409,Highland Hospital,18 to 29,146,F,Other Race,Spanish/Hispanic,3,Urgent,Home or Self Care,2020,PRG020,HYPERTENSION AND HYPERTENSIVE-RELATED CONDITIONS COMPLICATING PREGNANCY; CHILDBIRTH; AND THE PUERPERIUM,PGN002,SPONTANEOUS VAGINAL DELIVERY,541,VAGINAL DELIVERY W STERILIZATION &/OR D&C,14,"PREGNANCY, CHILDBIRTH AND THE PUERPERIUM",2,Moderate,Minor,Surgical,Medicaid,,,,,N,17149.53,7889.68
Finger Lakes,Monroe,2701005,000413,Strong Memorial Hospital,18 to 29,146,F,White,Unknown,3,Urgent,Home or Self Care,2020,PRG023,COMPLICATIONS SPECIFIED DURING CHILDBIRTH,PGN002,SPONTANEOUS VAGINAL DELIVERY,541,VAGINAL DELIVERY W STERILIZATION &/OR D&C,14,"PREGNANCY, CHILDBIRTH AND THE PUERPERIUM",2,Moderate,Minor,Surgical,Medicaid,,,,,N,15219.33,7765.95
Capital/Adirond,Albany,0101000,000001,Albany Medical Center Hospital,18 to 29,120,F,White,Not Span/Hispanic,2,Emergency,Home or Self Care,2020,PRG023,COMPLICATIONS SPECIFIED DURING CHILDBIRTH,PGN002,SPONTANEOUS VAGINAL DELIVERY,541,VAGINAL DELIVERY W STERILIZATION &/OR D&C,14,"PREGNANCY, CHILDBIRTH AND THE PUERPERIUM",2,Moderate,Minor,Surgical,"Managed Care, Unspecified",,,,,N,12953.87,5472.19
Finger Lakes,Monroe,2701003,000411,Rochester General Hospital,18 to 29,146,F,Black/African American,Not Span/Hispanic,2,Urgent,Home or Self Care,2020,PRG026,OB-RELATED TRAUMA TO PERINEUM AND VULVA,MST021,PERINEAL MUSCLE LACERATION REPAIR (2ND DEGREE OBSTETRICAL AND OTHER),541,VAGINAL DELIVERY W STERILIZATION &/OR D&C,14,"PREGNANCY, CHILDBIRTH AND THE PUERPERIUM",1,Minor,Minor,Surgical,Private Health Insurance,,,,,N,22889.98,9873.52
New York City,Manhattan,7002032,001466,Mount Sinai West,30 to 49,100,F,White,Unknown,3,Elective,Home or Self Care,2020,PRG023,COMPLICATIONS SPECIFIED DURING CHILDBIRTH,PGN002,SPONTANEOUS VAGINAL DELIVERY,541,VAGINAL DELIVERY W STERILIZATION &/OR D&C,14,"PREGNANCY, CHILDBIRTH AND THE PUERPERIUM",1,Minor,Minor,Surgical,Private Health Insurance,Self-Pay,,,,N,45115.43,10434.65
New York City,Kings,7002053,001304,NYU Langone Hospital-Brooklyn,30 to 49,112,F,Other Race,Spanish/Hispanic,2,Elective,Home or Self Care,2020,PRG023,COMPLICATIONS SPECIFIED DURING CHILDBIRTH,PGN002,SPONTANEOUS VAGINAL DELIVERY,541,VAGINAL DELIVERY W STERILIZATION &/OR D&C,14,"PREGNANCY, CHILDBIRTH AND THE PUERPERIUM",2,Moderate,Minor,Surgical,Medicaid,,,,,N,42706.57,11815.48
New York City,Kings,7002053,001304,NYU Langone Hospital-Brooklyn,30 to 49,112,F,Other Race,Spanish/Hispanic,2,Elective,Home or Self Care,2020,PRG024,"MALPOSITION, DISPROPORTION OR OTHER LABOR COMPLICATIONS",PGN002,SPONTANEOUS VAGINAL DELIVERY,541,VAGINAL DELIVERY W STERILIZATION &/OR D&C,14,"PREGNANCY, CHILDBIRTH AND THE PUERPERIUM",2,Moderate,Minor,Surgical,Medicaid,,,,,N,43491.72,12141.85
Long Island,Nassau,2908000,000511,NYU Langone Hospital-Long Island,30 to 49,115,F,Other Race,Spanish/Hispanic,3,Elective,Home or Self Care,2020,PRG028,OTHER SPECIFIED COMPLICATIONS IN PREGNANCY,PGN002,SPONTANEOUS VAGINAL DELIVERY,541,VAGINAL DELIVERY W STERILIZATION &/OR D&C,14,"PREGNANCY, CHILDBIRTH AND THE PUERPERIUM",2,Moderate,Minor,Surgical,Medicaid,,,,,N,56556.63,17104.16
Central NY,Onondaga,3301008,000636,Crouse Hospital,30 to 49,131,F,White,Not Span/Hispanic,3,Urgent,Home or Self Care,2020,PRG011,EARLY OR THREATENED LABOR,PGN002,SPONTANEOUS VAGINAL DELIVERY,541,VAGINAL DELIVERY W STERILIZATION &/OR D&C,14,"PREGNANCY, CHILDBIRTH AND THE PUERPERIUM",2,Moderate,Minor,Surgical,Medicaid,,,,,N,18454.95,8904.84
Western NY,Erie,1401014,000208,John R. Oishei Children's Hospital,18 to 29,142,F,Other Race,Spanish/Hispanic,1,Emergency,Home or Self Care,2020,PRG011,EARLY OR THREATENED LABOR,PGN002,SPONTANEOUS VAGINAL DELIVERY,541,VAGINAL DELIVERY W STERILIZATION &/OR D&C,14,"PREGNANCY, CHILDBIRTH AND THE PUERPERIUM",3,Major,Minor,Surgical,Medicaid,Self-Pay,,,,Y,20631.61,8448.97
Western NY,Erie,1401014,000208,John R. Oishei Children's Hospital,30 to 49,140,F,White,Not Span/Hispanic,3,Emergency,Home or Self Care,2020,PRG011,EARLY OR THREATENED LABOR,PGN002,SPONTANEOUS VAGINAL DELIVERY,541,VAGINAL DELIVERY W STERILIZATION &/OR D&C,14,"PREGNANCY, CHILDBIRTH AND THE PUERPERIUM",3,Major,Minor,Surgical,Blue Cross/Blue Shield,Self-Pay,,,,Y,25451.17,11528.49
New York City,Kings,7002053,001304,NYU Langone Hospital-Brooklyn,30 to 49,112,F,Other Race,Spanish/Hispanic,3,Elective,Home or Self Care,2020,PRG023,COMPLICATIONS SPECIFIED DURING CHILDBIRTH,PGN002,SPONTANEOUS VAGINAL DELIVERY,541,VAGINAL DELIVERY W STERILIZATION &/OR D&C,14,"PREGNANCY, CHILDBIRTH AND THE PUERPERIUM",2,Moderate,Minor,Surgical,Medicaid,,,,,N,52454.04,15767.85
New York City,Queens,7003010,001637,New York - Presbyterian/Queens,30 to 49,115,F,Other Race,Not Span/Hispanic,2,Emergency,Home or Self Care,2020,PRG026,OB-RELATED TRAUMA TO PERINEUM AND VULVA,PGN002,SPONTANEOUS VAGINAL DELIVERY,541,VAGINAL DELIVERY W STERILIZATION &/OR D&C,14,"PREGNANCY, CHILDBIRTH AND THE PUERPERIUM",1,Minor,Minor,Surgical,Private Health Insurance,,,,,Y,22076.52,8030.6
New York City,Manhattan,7002024,001456,Mount Sinai Hospital,30 to 49,100,F,Other Race,Unknown,2,Elective,Home or Self Care,2020,PRG011,EARLY OR THREATENED LABOR,PGN002,SPONTANEOUS VAGINAL DELIVERY,541,VAGINAL DELIVERY W STERILIZATION &/OR D&C,14,"PREGNANCY, CHILDBIRTH AND THE PUERPERIUM",3,Major,Minor,Surgical,Private Health Insurance,Self-Pay,,,,N,27080.1,8596.88
New York City,Kings,7001021,001306,New York - Presbyterian Brooklyn Methodist Hospital,30 to 49,116,F,Black/African American,Not Span/Hispanic,2,Emergency,Home or Self Care,2020,PRG023,COMPLICATIONS SPECIFIED DURING CHILDBIRTH,PGN006,REMOVAL OF PLACENTA AND OTHER RETAINED PRODUCTS OF CONCEPTION,541,VAGINAL DELIVERY W STERILIZATION &/OR D&C,14,"PREGNANCY, CHILDBIRTH AND THE PUERPERIUM",2,Moderate,Minor,Surgical,Blue Cross/Blue Shield,Self-Pay,,,,Y,13692.49,3614.02
New York City,Manhattan,7002054,001458,New York-Presbyterian Hospital - New York Weill Cornell Center,30 to 49,OOS,F,White,Spanish/Hispanic,3,Elective,Home or Self Care,2020,PRG022,PROLONGED PREGNANCY,PGN002,SPONTANEOUS VAGINAL DELIVERY,541,VAGINAL DELIVERY W STERILIZATION &/OR D&C,14,"PREGNANCY, CHILDBIRTH AND THE PUERPERIUM",2,Moderate,Minor,Surgical,Private Health Insurance,Self-Pay,,,,N,32148.89,8446.84
Long Island,Nassau,2950002,000528,Nassau University Medical Center,30 to 49,117,F,Other Race,Not Span/Hispanic,2,Emergency,Home or Self Care,2020,PRG026,OB-RELATED TRAUMA TO PERINEUM AND VULVA,PGN004,ASSISTED VAGINAL DELIVERY,541,VAGINAL DELIVERY W STERILIZATION &/OR D&C,14,"PREGNANCY, CHILDBIRTH AND THE PUERPERIUM",1,Minor,Minor,Surgical,Medicaid,Medicaid,Self-Pay,,,N,21601.53,10612.73
Long Island,Nassau,2950002,000528,Nassau University Medical Center,30 to 49,117,F,Other Race,Spanish/Hispanic,3,Urgent,Home or Self Care,2020,PRG023,COMPLICATIONS SPECIFIED DURING CHILDBIRTH,PGN002,SPONTANEOUS VAGINAL DELIVERY,541,VAGINAL DELIVERY W STERILIZATION &/OR D&C,14,"PREGNANCY, CHILDBIRTH AND THE PUERPERIUM",1,Minor,Minor,Surgical,Medicaid,Medicaid,Self-Pay,,,N,26495.57,12531.7
Long Island,Nassau,2950002,000528,Nassau University Medical Center,30 to 49,117,F,White,Spanish/Hispanic,2,Urgent,Home or Self Care,2020,PRG026,OB-RELATED TRAUMA TO PERINEUM AND VULVA,PGN001,FETAL HEART RATE MONITORING,541,VAGINAL DELIVERY W STERILIZATION &/OR D&C,14,"PREGNANCY, CHILDBIRTH AND THE PUERPERIUM",1,Minor,Minor,Surgical,Medicaid,Medicaid,Self-Pay,,,N,20118.83,9912.8
Finger Lakes,Monroe,2701003,000411,Rochester General Hospital,18 to 29,146,F,Other Race,Spanish/Hispanic,2,Urgent,Home or Self Care,2020,PRG023,COMPLICATIONS SPECIFIED DURING CHILDBIRTH,PGN002,SPONTANEOUS VAGINAL DELIVERY,541,VAGINAL DELIVERY W STERILIZATION &/OR D&C,14,"PREGNANCY, CHILDBIRTH AND THE PUERPERIUM",2,Moderate,Minor,Surgical,Medicaid,,,,,N,18610.07,8413.18
Finger Lakes,Monroe,2701003,000411,Rochester General Hospital,30 to 49,146,F,Other Race,Spanish/Hispanic,2,Urgent,Home or Self Care,2020,PRG023,COMPLICATIONS SPECIFIED DURING CHILDBIRTH,PGN002,SPONTANEOUS VAGINAL DELIVERY,541,VAGINAL DELIVERY W STERILIZATION &/OR D&C,14,"PREGNANCY, CHILDBIRTH AND THE PUERPERIUM",1,Minor,Minor,Surgical,Medicaid,,,,,N,18850.24,8495.74
Finger Lakes,Monroe,2701003,000411,Rochester General Hospital,18 to 29,146,F,White,Spanish/Hispanic,2,Urgent,Home or Self Care,2020,PRG013,MATERNAL CARE RELATED TO FETAL CONDITIONS,PGN002,SPONTANEOUS VAGINAL DELIVERY,541,VAGINAL DELIVERY W STERILIZATION &/OR D&C,14,"PREGNANCY, CHILDBIRTH AND THE PUERPERIUM",2,Moderate,Minor,Surgical,Medicaid,,,,,N,21690.72,9528.46
Hudson Valley,Orange,3529000,000704,St Anthony Community Hospital,30 to 49,109,F,White,Not Span/Hispanic,4,Elective,Home or Self Care,2020,PRG019,DIABETES OR ABNORMAL GLUCOSE TOLERANCE COMPLICATING PREGNANCY; CHILDBIRTH; OR THE PUERPERIUM,PGN002,SPONTANEOUS VAGINAL DELIVERY,541,VAGINAL DELIVERY W STERILIZATION &/OR D&C,14,"PREGNANCY, CHILDBIRTH AND THE PUERPERIUM",2,Moderate,Minor,Surgical,Private Health Insurance,,,,,N,92767.95,12772.96
Finger Lakes,Monroe,2754001,000471,The Unity Hospital of Rochester,30 to 49,144,F,White,Not Span/Hispanic,2,Urgent,Home or Self Care,2020,PRG019,DIABETES OR ABNORMAL GLUCOSE TOLERANCE COMPLICATING PREGNANCY; CHILDBIRTH; OR THE PUERPERIUM,FRS003,SALPINGECTOMY,541,VAGINAL DELIVERY W STERILIZATION &/OR D&C,14,"PREGNANCY, CHILDBIRTH AND THE PUERPERIUM",2,Moderate,Minor,Surgical,Private Health Insurance,,,,,N,14006.96,7539.53
Finger Lakes,Monroe,2754001,000471,The Unity Hospital of Rochester,18 to 29,146,F,White,Not Span/Hispanic,3,Elective,Home or Self Care,2020,PRG024,"MALPOSITION, DISPROPORTION OR OTHER LABOR COMPLICATIONS",PGN002,SPONTANEOUS VAGINAL DELIVERY,541,VAGINAL DELIVERY W STERILIZATION &/OR D&C,14,"PREGNANCY, CHILDBIRTH AND THE PUERPERIUM",2,Moderate,Minor,Surgical,Medicaid,,,,,N,17944.84,9482.3
Finger Lakes,Monroe,2754001,000471,The Unity Hospital of Rochester,18 to 29,144,F,White,Not Span/Hispanic,3,Elective,Home or Self Care,2020,PRG019,DIABETES OR ABNORMAL GLUCOSE TOLERANCE COMPLICATING PREGNANCY; CHILDBIRTH; OR THE PUERPERIUM,PGN002,SPONTANEOUS VAGINAL DELIVERY,541,VAGINAL DELIVERY W STERILIZATION &/OR D&C,14,"PREGNANCY, CHILDBIRTH AND THE PUERPERIUM",2,Moderate,Minor,Surgical,Medicaid,,,,,N,5907.2,4611.64
New York City,Manhattan,7002024,001456,Mount Sinai Hospital,30 to 49,100,F,Other Race,Spanish/Hispanic,4,Elective,Home or Self Care,2020,PRG020,HYPERTENSION AND HYPERTENSIVE-RELATED CONDITIONS COMPLICATING PREGNANCY; CHILDBIRTH; AND THE PUERPERIUM,PGN002,SPONTANEOUS VAGINAL DELIVERY,541,VAGINAL DELIVERY W STERILIZATION &/OR D&C,14,"PREGNANCY, CHILDBIRTH AND THE PUERPERIUM",2,Moderate,Minor,Surgical,Private Health Insurance,Self-Pay,,,,N,58259.78,19384.22
New York City,Bronx,7000006,001168,Montefiore Medical Center-Wakefield Hospital,30 to 49,104,F,Other Race,Unknown,2,Emergency,Home w/ Home Health Services,2020,PRG024,"MALPOSITION, DISPROPORTION OR OTHER LABOR COMPLICATIONS",PGN002,SPONTANEOUS VAGINAL DELIVERY,541,VAGINAL DELIVERY W STERILIZATION &/OR D&C,14,"PREGNANCY, CHILDBIRTH AND THE PUERPERIUM",2,Moderate,Minor,Surgical,Medicaid,,,,,N,58411.18,17815.8
New York City,Manhattan,7002032,001466,Mount Sinai West,30 to 49,104,F,Other Race,Spanish/Hispanic,2,Urgent,Home or Self Care,2020,PRG019,DIABETES OR ABNORMAL GLUCOSE TOLERANCE COMPLICATING PREGNANCY; CHILDBIRTH; OR THE PUERPERIUM,PGN002,SPONTANEOUS VAGINAL DELIVERY,541,VAGINAL DELIVERY W STERILIZATION &/OR D&C,14,"PREGNANCY, CHILDBIRTH AND THE PUERPERIUM",1,Minor,Minor,Surgical,Medicaid,Medicaid,Self-Pay,,,N,43073.74,10522.94
Hudson Valley,Westchester,5904001,001072,Montefiore New Rochelle Hospital,30 to 49,104,F,White,Spanish/Hispanic,3,Elective,Home or Self Care,2020,PRG024,"MALPOSITION, DISPROPORTION OR OTHER LABOR COMPLICATIONS",PGN002,SPONTANEOUS VAGINAL DELIVERY,541,VAGINAL DELIVERY W STERILIZATION &/OR D&C,14,"PREGNANCY, CHILDBIRTH AND THE PUERPERIUM",1,Minor,Minor,Surgical,Medicaid,Medicaid,Self-Pay,,,N,18635.89,7244.06
Central NY,Onondaga,3301003,000630,St. Joseph's Hospital Health Center,30 to 49,132,F,White,Not Span/Hispanic,2,Urgent,Home or Self Care,2020,PRG026,OB-RELATED TRAUMA TO PERINEUM AND VULVA,PGN002,SPONTANEOUS VAGINAL DELIVERY,541,VAGINAL DELIVERY W STERILIZATION &/OR D&C,14,"PREGNANCY, CHILDBIRTH AND THE PUERPERIUM",1,Minor,Minor,Surgical,Blue Cross/Blue Shield,,,,,N,14235.98,8607.54
Capital/Adirond,Albany,0101000,000001,Albany Medical Center Hospital,30 to 49,123,F,White,Not Span/Hispanic,2,Elective,Home or Self Care,2020,PRG028,OTHER SPECIFIED COMPLICATIONS IN PREGNANCY,PGN002,SPONTANEOUS VAGINAL DELIVERY,541,VAGINAL DELIVERY W STERILIZATION &/OR D&C,14,"PREGNANCY, CHILDBIRTH AND THE PUERPERIUM",2,Moderate,Minor,Surgical,Blue Cross/Blue Shield,,,,,N,21689.9,9238.72
Hudson Valley,Rockland,4329000,000779,Good Samaritan Hospital of Suffern,30 to 49,109,F,White,Not Span/Hispanic,2,Elective,Home or Self Care,2020,PRG024,"MALPOSITION, DISPROPORTION OR OTHER LABOR COMPLICATIONS",PGN002,SPONTANEOUS VAGINAL DELIVERY,541,VAGINAL DELIVERY W STERILIZATION &/OR D&C,14,"PREGNANCY, CHILDBIRTH AND THE PUERPERIUM",1,Minor,Minor,Surgical,Medicaid,,,,,N,26311.97,3568.07
Capital/Adirond,Albany,0101000,000001,Albany Medical Center Hospital,30 to 49,121,F,Black/African American,Not Span/Hispanic,2,Emergency,Home or Self Care,2020,PRG024,"MALPOSITION, DISPROPORTION OR OTHER LABOR COMPLICATIONS",PGN002,SPONTANEOUS VAGINAL DELIVERY,541,VAGINAL DELIVERY W STERILIZATION &/OR D&C,14,"PREGNANCY, CHILDBIRTH AND THE PUERPERIUM",1,Minor,Minor,Surgical,"Managed Care, Unspecified",,,,,N,11798.85,5896.81
Capital/Adirond,Albany,0101000,000001,Albany Medical Center Hospital,30 to 49,120,F,White,Not Span/Hispanic,8,Urgent,Home or Self Care,2020,PRG020,HYPERTENSION AND HYPERTENSIVE-RELATED CONDITIONS COMPLICATING PREGNANCY; CHILDBIRTH; AND THE PUERPERIUM,PGN002,SPONTANEOUS VAGINAL DELIVERY,541,VAGINAL DELIVERY W STERILIZATION &/OR D&C,14,"PREGNANCY, CHILDBIRTH AND THE PUERPERIUM",3,Major,Moderate,Surgical,"Managed Care, Unspecified",,,,,N,59960.97,20920.23