Hospital Service Area,Hospital County,Operating Certificate Number,Permanent Facility Id,Facility Name,Age Group,Zip Code - 3 digits,Gender,Race,Ethnicity,Length of Stay,Type of Admission,Patient Disposition,Discharge Year,CCS Diagnosis Code,CCS Diagnosis Description,CCS Procedure Code,CCS Procedure Description,APR DRG Code,APR DRG Description,APR MDC Code,APR MDC Description,APR Severity of Illness Code,APR Severity of Illness Description,APR Risk of Mortality,APR Medical Surgical Description,Payment Typology 1,Payment Typology 2,Payment Typology 3,Birth Weight,Abortion Edit Indicator,Emergency Department Indicator,Total Charges,Total Costs
Long Island,Nassau,2908000,000511,NYU Winthrop Hospital,30 to 49,115,F,Other Race,Spanish/Hispanic,3,Emergency,Home or Self Care,2017,185,Prolonged pregnancy,135,FORCEP;VAC;BREACH DELIV,542,Vaginal delivery w complicating procedures exc sterilization &/or D&C,14,"Pregnancy, Childbirth and the Puerperium",2,Moderate,Minor,Surgical,Medicaid,Medicaid,,,N,N,17886.83,4641.07
Long Island,Nassau,2908000,000511,NYU Winthrop Hospital,30 to 49,113,F,White,Not Span/Hispanic,2,Emergency,Home or Self Care,2017,183,Hypertension complicating pregnancy; childbirth and the puerperium,137,OT PRCS TO ASSIST DELIV,542,Vaginal delivery w complicating procedures exc sterilization &/or D&C,14,"Pregnancy, Childbirth and the Puerperium",2,Moderate,Minor,Surgical,Blue Cross/Blue Shield,,,,N,N,18812.20,4323.25
Long Island,Nassau,2908000,000511,NYU Winthrop Hospital,30 to 49,115,F,Other Race,Not Span/Hispanic,2,Urgent,Home or Self Care,2017,186,Diabetes or abnormal glucose tolerance complicating pregnancy; childbirth; or the puerperium,137,OT PRCS TO ASSIST DELIV,542,Vaginal delivery w complicating procedures exc sterilization &/or D&C,14,"Pregnancy, Childbirth and the Puerperium",2,Moderate,Minor,Surgical,Medicaid,Medicaid,,,N,N,38615.55,10935.86
Long Island,Nassau,2908000,000511,NYU Winthrop Hospital,30 to 49,117,F,Other Race,Not Span/Hispanic,3,Emergency,Home or Self Care,2017,185,Prolonged pregnancy,137,OT PRCS TO ASSIST DELIV,542,Vaginal delivery w complicating procedures exc sterilization &/or D&C,14,"Pregnancy, Childbirth and the Puerperium",2,Moderate,Minor,Surgical,Private Health Insurance,,,,N,N,18591.85,5155.79
Long Island,Nassau,2908000,000511,NYU Winthrop Hospital,18 to 29,115,F,White,Spanish/Hispanic,2,Emergency,Home or Self Care,2017,195,Other complications of birth; puerperium affecting management of mother,137,OT PRCS TO ASSIST DELIV,542,Vaginal delivery w complicating procedures exc sterilization &/or D&C,14,"Pregnancy, Childbirth and the Puerperium",2,Moderate,Minor,Surgical,Medicaid,Medicaid,,,N,N,26396.58,7207.74
Long Island,Nassau,2908000,000511,NYU Winthrop Hospital,30 to 49,115,F,White,Not Span/Hispanic,3,Emergency,Home or Self Care,2017,195,Other complications of birth; puerperium affecting management of mother,135,FORCEP;VAC;BREACH DELIV,542,Vaginal delivery w complicating procedures exc sterilization &/or D&C,14,"Pregnancy, Childbirth and the Puerperium",2,Moderate,Minor,Surgical,Blue Cross/Blue Shield,,,,N,N,19735.14,5348.51
Long Island,Nassau,2908000,000511,NYU Winthrop Hospital,30 to 49,115,F,Other Race,Not Span/Hispanic,3,Emergency,Home or Self Care,2017,185,Prolonged pregnancy,131,OT NON-OR THER PRC; FEM,542,Vaginal delivery w complicating procedures exc sterilization &/or D&C,14,"Pregnancy, Childbirth and the Puerperium",2,Moderate,Minor,Surgical,Private Health Insurance,,,,N,N,25282.19,6776.55
Long Island,Nassau,2908000,000511,NYU Winthrop Hospital,30 to 49,117,F,White,Not Span/Hispanic,3,Emergency,Home or Self Care,2017,193,OB-related trauma to perineum and vulva,137,OT PRCS TO ASSIST DELIV,542,Vaginal delivery w complicating procedures exc sterilization &/or D&C,14,"Pregnancy, Childbirth and the Puerperium",1,Minor,Minor,Surgical,Blue Cross/Blue Shield,Blue Cross/Blue Shield,,,N,N,22614.55,6070.10
Long Island,Nassau,2908000,000511,NYU Winthrop Hospital,30 to 49,110,F,Other Race,Not Span/Hispanic,3,Urgent,Home or Self Care,2017,185,Prolonged pregnancy,096,OT OR LOW GI THER PRCS,542,Vaginal delivery w complicating procedures exc sterilization &/or D&C,14,"Pregnancy, Childbirth and the Puerperium",2,Moderate,Minor,Surgical,Medicaid,Medicaid,,,N,N,27208.73,7158.10
Long Island,Nassau,2908000,000511,NYU Winthrop Hospital,18 to 29,115,F,Other Race,Not Span/Hispanic,2,Emergency,Home or Self Care,2017,195,Other complications of birth; puerperium affecting management of mother,137,OT PRCS TO ASSIST DELIV,542,Vaginal delivery w complicating procedures exc sterilization &/or D&C,14,"Pregnancy, Childbirth and the Puerperium",1,Minor,Minor,Surgical,Blue Cross/Blue Shield,,,,N,N,14798.83,4008.24
Long Island,Nassau,2908000,000511,NYU Winthrop Hospital,18 to 29,118,F,White,Not Span/Hispanic,3,Emergency,Home or Self Care,2017,193,OB-related trauma to perineum and vulva,096,OT OR LOW GI THER PRCS,542,Vaginal delivery w complicating procedures exc sterilization &/or D&C,14,"Pregnancy, Childbirth and the Puerperium",1,Minor,Minor,Surgical,Blue Cross/Blue Shield,,,,N,N,23178.29,6473.70
Long Island,Nassau,2908000,000511,NYU Winthrop Hospital,18 to 29,115,F,Other Race,Spanish/Hispanic,3,Emergency,Home or Self Care,2017,195,Other complications of birth; puerperium affecting management of mother,160,OT THER PRCS ON MUSCLES,542,Vaginal delivery w complicating procedures exc sterilization &/or D&C,14,"Pregnancy, Childbirth and the Puerperium",1,Minor,Minor,Surgical,Medicaid,Medicaid,,,N,N,22981.02,6334.18
Long Island,Nassau,2908000,000511,NYU Winthrop Hospital,18 to 29,117,F,Black/African American,Spanish/Hispanic,3,Emergency,Home or Self Care,2017,193,OB-related trauma to perineum and vulva,137,OT PRCS TO ASSIST DELIV,542,Vaginal delivery w complicating procedures exc sterilization &/or D&C,14,"Pregnancy, Childbirth and the Puerperium",1,Minor,Minor,Surgical,Blue Cross/Blue Shield,,,,N,N,21129.63,5955.61
Long Island,Nassau,2908000,000511,NYU Winthrop Hospital,30 to 49,113,F,Other Race,Not Span/Hispanic,2,Emergency,Home or Self Care,2017,195,Other complications of birth; puerperium affecting management of mother,137,OT PRCS TO ASSIST DELIV,542,Vaginal delivery w complicating procedures exc sterilization &/or D&C,14,"Pregnancy, Childbirth and the Puerperium",2,Moderate,Minor,Surgical,Private Health Insurance,,,,N,N,19766.32,5095.63
Long Island,Nassau,2908000,000511,NYU Winthrop Hospital,30 to 49,117,F,Other Race,Unknown,3,Elective,Home or Self Care,2017,185,Prolonged pregnancy,137,OT PRCS TO ASSIST DELIV,542,Vaginal delivery w complicating procedures exc sterilization &/or D&C,14,"Pregnancy, Childbirth and the Puerperium",2,Moderate,Minor,Surgical,Blue Cross/Blue Shield,Blue Cross/Blue Shield,,,N,N,20070.11,5476.07
Long Island,Nassau,2908000,000511,NYU Winthrop Hospital,18 to 29,115,F,Black/African American,Not Span/Hispanic,3,Emergency,Home or Self Care,2017,195,Other complications of birth; puerperium affecting management of mother,137,OT PRCS TO ASSIST DELIV,542,Vaginal delivery w complicating procedures exc sterilization &/or D&C,14,"Pregnancy, Childbirth and the Puerperium",1,Minor,Minor,Surgical,Private Health Insurance,,,,N,N,23047.68,6189.48
Long Island,Nassau,2908000,000511,NYU Winthrop Hospital,30 to 49,115,F,White,Not Span/Hispanic,2,Elective,Home or Self Care,2017,181,Other complications of pregnancy,135,FORCEP;VAC;BREACH DELIV,542,Vaginal delivery w complicating procedures exc sterilization &/or D&C,14,"Pregnancy, Childbirth and the Puerperium",1,Minor,Minor,Surgical,Private Health Insurance,,,,N,N,17729.15,4516.71
Long Island,Nassau,2908000,000511,NYU Winthrop Hospital,30 to 49,115,F,White,Not Span/Hispanic,4,Elective,Home or Self Care,2017,185,Prolonged pregnancy,137,OT PRCS TO ASSIST DELIV,542,Vaginal delivery w complicating procedures exc sterilization &/or D&C,14,"Pregnancy, Childbirth and the Puerperium",2,Moderate,Minor,Surgical,Blue Cross/Blue Shield,,,,N,N,23970.76,6522.38
Long Island,Nassau,2908000,000511,NYU Winthrop Hospital,18 to 29,115,F,Black/African American,Not Span/Hispanic,2,Emergency,Home or Self Care,2017,195,Other complications of birth; puerperium affecting management of mother,137,OT PRCS TO ASSIST DELIV,542,Vaginal delivery w complicating procedures exc sterilization &/or D&C,14,"Pregnancy, Childbirth and the Puerperium",2,Moderate,Minor,Surgical,Medicaid,Medicaid,,,N,N,13972.86,3738.02
Long Island,Nassau,2908000,000511,NYU Winthrop Hospital,18 to 29,112,F,Black/African American,Not Span/Hispanic,3,Emergency,Home or Self Care,2017,195,Other complications of birth; puerperium affecting management of mother,135,FORCEP;VAC;BREACH DELIV,542,Vaginal delivery w complicating procedures exc sterilization &/or D&C,14,"Pregnancy, Childbirth and the Puerperium",2,Moderate,Minor,Surgical,Blue Cross/Blue Shield,,,,N,N,18366.13,5052.04
Long Island,Nassau,2908000,000511,NYU Winthrop Hospital,18 to 29,115,F,White,Not Span/Hispanic,2,Emergency,Home or Self Care,2017,193,OB-related trauma to perineum and vulva,137,OT PRCS TO ASSIST DELIV,542,Vaginal delivery w complicating procedures exc sterilization &/or D&C,14,"Pregnancy, Childbirth and the Puerperium",1,Minor,Minor,Surgical,Private Health Insurance,,,,N,N,17905.13,5066.50
Long Island,Nassau,2908000,000511,NYU Winthrop Hospital,18 to 29,115,F,Other Race,Spanish/Hispanic,3,Emergency,Home or Self Care,2017,181,Other complications of pregnancy,096,OT OR LOW GI THER PRCS,542,Vaginal delivery w complicating procedures exc sterilization &/or D&C,14,"Pregnancy, Childbirth and the Puerperium",1,Minor,Minor,Surgical,Medicaid,Medicaid,,,N,N,31413.47,9335.93
Long Island,Nassau,2908000,000511,NYU Winthrop Hospital,30 to 49,100,F,White,Not Span/Hispanic,2,Emergency,Home or Self Care,2017,185,Prolonged pregnancy,137,OT PRCS TO ASSIST DELIV,542,Vaginal delivery w complicating procedures exc sterilization &/or D&C,14,"Pregnancy, Childbirth and the Puerperium",2,Moderate,Minor,Surgical,Blue Cross/Blue Shield,,,,N,N,18506.12,5211.61
Long Island,Nassau,2908000,000511,NYU Winthrop Hospital,30 to 49,117,F,White,Not Span/Hispanic,2,Elective,Home or Self Care,2017,185,Prolonged pregnancy,137,OT PRCS TO ASSIST DELIV,542,Vaginal delivery w complicating procedures exc sterilization &/or D&C,14,"Pregnancy, Childbirth and the Puerperium",2,Moderate,Minor,Surgical,Blue Cross/Blue Shield,,,,N,N,14053.47,3829.28
Long Island,Nassau,2908000,000511,NYU Winthrop Hospital,18 to 29,118,F,Other Race,Not Span/Hispanic,2,Emergency,Home or Self Care,2017,192,Umbilical cord complication,137,OT PRCS TO ASSIST DELIV,542,Vaginal delivery w complicating procedures exc sterilization &/or D&C,14,"Pregnancy, Childbirth and the Puerperium",2,Moderate,Minor,Surgical,Private Health Insurance,,,,N,N,19880.56,5299.58
Long Island,Nassau,2908000,000511,NYU Winthrop Hospital,30 to 49,115,F,White,Not Span/Hispanic,2,Emergency,Home or Self Care,2017,195,Other complications of birth; puerperium affecting management of mother,137,OT PRCS TO ASSIST DELIV,542,Vaginal delivery w complicating procedures exc sterilization &/or D&C,14,"Pregnancy, Childbirth and the Puerperium",1,Minor,Minor,Surgical,Private Health Insurance,,,,N,N,12678.12,3379.64
Long Island,Nassau,2908000,000511,NYU Winthrop Hospital,18 to 29,115,F,Other Race,Not Span/Hispanic,2,Urgent,Home or Self Care,2017,193,OB-related trauma to perineum and vulva,137,OT PRCS TO ASSIST DELIV,542,Vaginal delivery w complicating procedures exc sterilization &/or D&C,14,"Pregnancy, Childbirth and the Puerperium",1,Minor,Minor,Surgical,Medicaid,,,,N,N,20236.18,5587.99
Long Island,Nassau,2908000,000511,NYU Winthrop Hospital,30 to 49,118,F,Other Race,Not Span/Hispanic,3,Urgent,Home or Self Care,2017,185,Prolonged pregnancy,135,FORCEP;VAC;BREACH DELIV,542,Vaginal delivery w complicating procedures exc sterilization &/or D&C,14,"Pregnancy, Childbirth and the Puerperium",2,Moderate,Minor,Surgical,Private Health Insurance,Private Health Insurance,,,N,N,21282.35,5508.06
Long Island,Nassau,2908000,000511,NYU Winthrop Hospital,30 to 49,111,F,White,Not Span/Hispanic,2,Urgent,Home or Self Care,2017,185,Prolonged pregnancy,137,OT PRCS TO ASSIST DELIV,542,Vaginal delivery w complicating procedures exc sterilization &/or D&C,14,"Pregnancy, Childbirth and the Puerperium",2,Moderate,Minor,Surgical,Blue Cross/Blue Shield,,,,N,N,19985.06,5633.49
Long Island,Nassau,2908000,000511,NYU Winthrop Hospital,18 to 29,110,F,White,Not Span/Hispanic,4,Emergency,Home or Self Care,2017,191,Polyhydramnios and other problems of amniotic cavity,137,OT PRCS TO ASSIST DELIV,542,Vaginal delivery w complicating procedures exc sterilization &/or D&C,14,"Pregnancy, Childbirth and the Puerperium",2,Moderate,Minor,Surgical,Private Health Insurance,,,,N,N,26458.74,7411.24
Long Island,Nassau,2908000,000511,NYU Winthrop Hospital,30 to 49,115,F,White,Not Span/Hispanic,3,Emergency,Home or Self Care,2017,183,Hypertension complicating pregnancy; childbirth and the puerperium,231,OTHER THERAPEUTIC PRCS,542,Vaginal delivery w complicating procedures exc sterilization &/or D&C,14,"Pregnancy, Childbirth and the Puerperium",3,Major,Minor,Surgical,Private Health Insurance,,,,N,N,36036.59,8967.29
Long Island,Nassau,2908000,000511,NYU Winthrop Hospital,30 to 49,115,F,White,Not Span/Hispanic,2,Emergency,Home or Self Care,2017,181,Other complications of pregnancy,137,OT PRCS TO ASSIST DELIV,542,Vaginal delivery w complicating procedures exc sterilization &/or D&C,14,"Pregnancy, Childbirth and the Puerperium",1,Minor,Minor,Surgical,Private Health Insurance,,,,N,N,21160.42,5685.78
Long Island,Nassau,2908000,000511,NYU Winthrop Hospital,18 to 29,,F,Black/African American,Not Span/Hispanic,4,Emergency,Home or Self Care,2017,185,Prolonged pregnancy,137,OT PRCS TO ASSIST DELIV,542,Vaginal delivery w complicating procedures exc sterilization &/or D&C,14,"Pregnancy, Childbirth and the Puerperium",3,Major,Minor,Surgical,Blue Cross/Blue Shield,,,,N,N,32412.11,8688.27
Long Island,Nassau,2908000,000511,NYU Winthrop Hospital,18 to 29,115,F,White,Spanish/Hispanic,2,Emergency,Home or Self Care,2017,195,Other complications of birth; puerperium affecting management of mother,137,OT PRCS TO ASSIST DELIV,542,Vaginal delivery w complicating procedures exc sterilization &/or D&C,14,"Pregnancy, Childbirth and the Puerperium",3,Major,Moderate,Surgical,Medicaid,Medicaid,,,N,N,41119.82,11855.03
Long Island,Nassau,2908000,000511,NYU Winthrop Hospital,30 to 49,115,F,Other Race,Not Span/Hispanic,3,Elective,Home or Self Care,2017,185,Prolonged pregnancy,137,OT PRCS TO ASSIST DELIV,542,Vaginal delivery w complicating procedures exc sterilization &/or D&C,14,"Pregnancy, Childbirth and the Puerperium",2,Moderate,Minor,Surgical,Blue Cross/Blue Shield,,,,N,N,33325.27,9551.11
Long Island,Nassau,2908000,000511,NYU Winthrop Hospital,18 to 29,115,F,White,Not Span/Hispanic,2,Emergency,Home or Self Care,2017,185,Prolonged pregnancy,137,OT PRCS TO ASSIST DELIV,542,Vaginal delivery w complicating procedures exc sterilization &/or D&C,14,"Pregnancy, Childbirth and the Puerperium",2,Moderate,Minor,Surgical,Blue Cross/Blue Shield,,,,N,N,63404.81,18793.70
Long Island,Nassau,2908000,000511,NYU Winthrop Hospital,30 to 49,115,F,White,Not Span/Hispanic,3,Urgent,Home or Self Care,2017,183,Hypertension complicating pregnancy; childbirth and the puerperium,137,OT PRCS TO ASSIST DELIV,542,Vaginal delivery w complicating procedures exc sterilization &/or D&C,14,"Pregnancy, Childbirth and the Puerperium",2,Moderate,Minor,Surgical,Blue Cross/Blue Shield,,,,N,N,46729.51,12850.71
Long Island,Nassau,2908000,000511,NYU Winthrop Hospital,30 to 49,115,F,Other Race,Not Span/Hispanic,2,Elective,Home or Self Care,2017,184,Early or threatened labor,133,EPISIOTOMY,542,Vaginal delivery w complicating procedures exc sterilization &/or D&C,14,"Pregnancy, Childbirth and the Puerperium",2,Moderate,Minor,Surgical,Private Health Insurance,,,,N,N,27595.15,7923.77
Long Island,Nassau,2908000,000511,NYU Winthrop Hospital,30 to 49,115,F,Other Race,Not Span/Hispanic,3,Urgent,Home or Self Care,2017,195,Other complications of birth; puerperium affecting management of mother,135,FORCEP;VAC;BREACH DELIV,542,Vaginal delivery w complicating procedures exc sterilization &/or D&C,14,"Pregnancy, Childbirth and the Puerperium",2,Moderate,Minor,Surgical,Blue Cross/Blue Shield,Self-Pay,,,N,N,37822.43,10586.61
Long Island,Nassau,2908000,000511,NYU Winthrop Hospital,18 to 29,113,F,Other Race,Not Span/Hispanic,3,Emergency,Home or Self Care,2017,193,OB-related trauma to perineum and vulva,137,OT PRCS TO ASSIST DELIV,542,Vaginal delivery w complicating procedures exc sterilization &/or D&C,14,"Pregnancy, Childbirth and the Puerperium",1,Minor,Minor,Surgical,Private Health Insurance,,,,N,N,46248.15,13661.95
Long Island,Nassau,2908000,000511,NYU Winthrop Hospital,30 to 49,117,F,White,Not Span/Hispanic,2,Elective,Home or Self Care,2017,193,OB-related trauma to perineum and vulva,133,EPISIOTOMY,542,Vaginal delivery w complicating procedures exc sterilization &/or D&C,14,"Pregnancy, Childbirth and the Puerperium",1,Minor,Minor,Surgical,Blue Cross/Blue Shield,,,,N,N,27840.48,7963.29
Long Island,Nassau,2908000,000511,NYU Winthrop Hospital,30 to 49,117,F,White,Not Span/Hispanic,2,Elective,Home or Self Care,2017,186,Diabetes or abnormal glucose tolerance complicating pregnancy; childbirth; or the puerperium,137,OT PRCS TO ASSIST DELIV,542,Vaginal delivery w complicating procedures exc sterilization &/or D&C,14,"Pregnancy, Childbirth and the Puerperium",2,Moderate,Minor,Surgical,Private Health Insurance,,,,N,N,36686.17,10026.20
Long Island,Nassau,2908000,000511,NYU Winthrop Hospital,18 to 29,117,F,White,Not Span/Hispanic,2,Emergency,Home or Self Care,2017,193,OB-related trauma to perineum and vulva,137,OT PRCS TO ASSIST DELIV,542,Vaginal delivery w complicating procedures exc sterilization &/or D&C,14,"Pregnancy, Childbirth and the Puerperium",1,Minor,Minor,Surgical,Blue Cross/Blue Shield,,,,N,N,28327.63,8160.72
Long Island,Nassau,2908000,000511,NYU Winthrop Hospital,30 to 49,115,F,White,Not Span/Hispanic,2,Urgent,Home or Self Care,2017,186,Diabetes or abnormal glucose tolerance complicating pregnancy; childbirth; or the puerperium,137,OT PRCS TO ASSIST DELIV,542,Vaginal delivery w complicating procedures exc sterilization &/or D&C,14,"Pregnancy, Childbirth and the Puerperium",2,Moderate,Minor,Surgical,Private Health Insurance,,,,N,N,34039.08,10022.11
Long Island,Nassau,2908000,000511,NYU Winthrop Hospital,18 to 29,117,F,White,Not Span/Hispanic,5,Emergency,Home or Self Care,2017,185,Prolonged pregnancy,137,OT PRCS TO ASSIST DELIV,542,Vaginal delivery w complicating procedures exc sterilization &/or D&C,14,"Pregnancy, Childbirth and the Puerperium",2,Moderate,Minor,Surgical,Blue Cross/Blue Shield,,,,N,N,65929.84,19075.82
Long Island,Nassau,2908000,000511,NYU Winthrop Hospital,30 to 49,115,F,White,Not Span/Hispanic,3,Emergency,Home or Self Care,2017,181,Other complications of pregnancy,137,OT PRCS TO ASSIST DELIV,542,Vaginal delivery w complicating procedures exc sterilization &/or D&C,14,"Pregnancy, Childbirth and the Puerperium",2,Moderate,Minor,Surgical,Blue Cross/Blue Shield,,,,N,N,54114.34,15443.29
Long Island,Nassau,2908000,000511,NYU Winthrop Hospital,18 to 29,117,F,White,Not Span/Hispanic,3,Emergency,Home or Self Care,2017,185,Prolonged pregnancy,137,OT PRCS TO ASSIST DELIV,542,Vaginal delivery w complicating procedures exc sterilization &/or D&C,14,"Pregnancy, Childbirth and the Puerperium",3,Major,Minor,Surgical,Blue Cross/Blue Shield,,,,N,N,46393.17,12655.57
Long Island,Nassau,2908000,000511,NYU Winthrop Hospital,30 to 49,117,F,White,Not Span/Hispanic,3,Emergency,Home or Self Care,2017,195,Other complications of birth; puerperium affecting management of mother,135,FORCEP;VAC;BREACH DELIV,542,Vaginal delivery w complicating procedures exc sterilization &/or D&C,14,"Pregnancy, Childbirth and the Puerperium",2,Moderate,Minor,Surgical,Blue Cross/Blue Shield,,,,N,N,45472.94,12511.22
Long Island,Nassau,2908000,000511,NYU Winthrop Hospital,30 to 49,117,F,Other Race,Not Span/Hispanic,2,Elective,Home or Self Care,2017,185,Prolonged pregnancy,135,FORCEP;VAC;BREACH DELIV,542,Vaginal delivery w complicating procedures exc sterilization &/or D&C,14,"Pregnancy, Childbirth and the Puerperium",2,Moderate,Minor,Surgical,Private Health Insurance,,,,N,N,27921.55,7994.12
Long Island,Nassau,2908000,000511,NYU Winthrop Hospital,30 to 49,118,F,Other Race,Not Span/Hispanic,2,Emergency,Home or Self Care,2017,186,Diabetes or abnormal glucose tolerance complicating pregnancy; childbirth; or the puerperium,137,OT PRCS TO ASSIST DELIV,542,Vaginal delivery w complicating procedures exc sterilization &/or D&C,14,"Pregnancy, Childbirth and the Puerperium",2,Moderate,Minor,Surgical,Private Health Insurance,,,,N,N,33525.81,9743.05
Long Island,Nassau,2908000,000511,NYU Winthrop Hospital,30 to 49,110,F,White,Not Span/Hispanic,3,Emergency,Home or Self Care,2017,193,OB-related trauma to perineum and vulva,005,INS CATHETER/SPNL STIM,542,Vaginal delivery w complicating procedures exc sterilization &/or D&C,14,"Pregnancy, Childbirth and the Puerperium",1,Minor,Minor,Surgical,Blue Cross/Blue Shield,,,,N,N,56246.15,16969.91
Long Island,Nassau,2908000,000511,NYU Winthrop Hospital,18 to 29,115,F,White,Not Span/Hispanic,2,Emergency,Home or Self Care,2017,195,Other complications of birth; puerperium affecting management of mother,137,OT PRCS TO ASSIST DELIV,542,Vaginal delivery w complicating procedures exc sterilization &/or D&C,14,"Pregnancy, Childbirth and the Puerperium",1,Minor,Minor,Surgical,Blue Cross/Blue Shield,Blue Cross/Blue Shield,,,N,N,34707.15,9289.81
Long Island,Nassau,2908000,000511,NYU Winthrop Hospital,30 to 49,117,F,White,Not Span/Hispanic,2,Emergency,Home or Self Care,2017,195,Other complications of birth; puerperium affecting management of mother,137,OT PRCS TO ASSIST DELIV,542,Vaginal delivery w complicating procedures exc sterilization &/or D&C,14,"Pregnancy, Childbirth and the Puerperium",2,Moderate,Minor,Surgical,Medicaid,Medicaid,,,N,N,40523.87,10786.82
Long Island,Nassau,2908000,000511,NYU Winthrop Hospital,30 to 49,115,F,White,Not Span/Hispanic,2,Urgent,Home or Self Care,2017,191,Polyhydramnios and other problems of amniotic cavity,137,OT PRCS TO ASSIST DELIV,542,Vaginal delivery w complicating procedures exc sterilization &/or D&C,14,"Pregnancy, Childbirth and the Puerperium",2,Moderate,Minor,Surgical,Private Health Insurance,,,,N,N,31836.81,9239.71
Long Island,Nassau,2908000,000511,NYU Winthrop Hospital,30 to 49,115,F,Other Race,Not Span/Hispanic,3,Urgent,Home or Self Care,2017,195,Other complications of birth; puerperium affecting management of mother,137,OT PRCS TO ASSIST DELIV,542,Vaginal delivery w complicating procedures exc sterilization &/or D&C,14,"Pregnancy, Childbirth and the Puerperium",1,Minor,Minor,Surgical,Medicaid,Medicaid,,,N,N,47499.70,13676.31
Long Island,Nassau,2908000,000511,NYU Winthrop Hospital,30 to 49,115,F,Other Race,Not Span/Hispanic,4,Emergency,Home or Self Care,2017,195,Other complications of birth; puerperium affecting management of mother,137,OT PRCS TO ASSIST DELIV,542,Vaginal delivery w complicating procedures exc sterilization &/or D&C,14,"Pregnancy, Childbirth and the Puerperium",2,Moderate,Minor,Surgical,Blue Cross/Blue Shield,Blue Cross/Blue Shield,,,N,N,58248.51,17029.32
Long Island,Nassau,2908000,000511,NYU Winthrop Hospital,30 to 49,115,F,White,Not Span/Hispanic,2,Emergency,Home or Self Care,2017,193,OB-related trauma to perineum and vulva,096,OT OR LOW GI THER PRCS,542,Vaginal delivery w complicating procedures exc sterilization &/or D&C,14,"Pregnancy, Childbirth and the Puerperium",1,Minor,Minor,Surgical,Blue Cross/Blue Shield,,,,N,N,36571.61,10796.10