Hospital Service Area,Hospital County,Operating Certificate Number,Permanent Facility Id,Facility Name,Age Group,Zip Code - 3 digits,Gender,Race,Ethnicity,Length of Stay,Type of Admission,Patient Disposition,Discharge Year,CCS Diagnosis Code,CCS Diagnosis Description,CCS Procedure Code,CCS Procedure Description,APR DRG Code,APR DRG Description,APR MDC Code,APR MDC Description,APR Severity of Illness Code,APR Severity of Illness Description,APR Risk of Mortality,APR Medical Surgical Description,Payment Typology 1,Payment Typology 2,Payment Typology 3,Birth Weight,Abortion Edit Indicator,Emergency Department Indicator,Total Charges,Total Costs
New York City,Manhattan,7002001,001438,Bellevue Hospital Center,30 to 49,111,F,Other Race,Not Span/Hispanic,1,Emergency,Home or Self Care,2017,181,Other complications of pregnancy,127,D&C; ASPIR AFT DLV/ABOR,544,"D&C, aspiration curettage or hysterotomy for obstetric diagnoses",14,"Pregnancy, Childbirth and the Puerperium",1,Minor,Minor,Surgical,Self-Pay,,,,N,Y,7206.63,4646.46
New York City,Manhattan,7002001,001438,Bellevue Hospital Center,30 to 49,100,F,Other Race,Not Span/Hispanic,1,Emergency,Home or Self Care,2017,181,Other complications of pregnancy,127,D&C; ASPIR AFT DLV/ABOR,544,"D&C, aspiration curettage or hysterotomy for obstetric diagnoses",14,"Pregnancy, Childbirth and the Puerperium",2,Moderate,Minor,Surgical,Medicaid,Medicaid,,,N,Y,7819.06,5041.32
New York City,Manhattan,7002001,001438,Bellevue Hospital Center,18 to 29,112,F,Other Race,Not Span/Hispanic,1,Emergency,Home or Self Care,2017,181,Other complications of pregnancy,127,D&C; ASPIR AFT DLV/ABOR,544,"D&C, aspiration curettage or hysterotomy for obstetric diagnoses",14,"Pregnancy, Childbirth and the Puerperium",1,Minor,Minor,Surgical,Medicaid,,,,N,N,2835.66,1828.29
New York City,Manhattan,7002001,001438,Bellevue Hospital Center,18 to 29,114,F,Black/African American,Not Span/Hispanic,3,Emergency,Psychiatric Hospital or Unit of Hosp,2017,195,Other complications of birth; puerperium affecting management of mother,127,D&C; ASPIR AFT DLV/ABOR,544,"D&C, aspiration curettage or hysterotomy for obstetric diagnoses",14,"Pregnancy, Childbirth and the Puerperium",2,Moderate,Minor,Surgical,Medicaid,Medicaid,,,N,Y,14960.48,9645.74
New York City,Manhattan,7002001,001438,Bellevue Hospital Center,30 to 49,112,F,Other Race,Spanish/Hispanic,1,Emergency,Home or Self Care,2017,181,Other complications of pregnancy,127,D&C; ASPIR AFT DLV/ABOR,544,"D&C, aspiration curettage or hysterotomy for obstetric diagnoses",14,"Pregnancy, Childbirth and the Puerperium",1,Minor,Minor,Surgical,Medicaid,Medicaid,,,N,Y,6000.39,3868.74
New York City,Manhattan,7002001,001438,Bellevue Hospital Center,30 to 49,113,F,Other Race,Spanish/Hispanic,2,Emergency,Home or Self Care,2017,181,Other complications of pregnancy,127,D&C; ASPIR AFT DLV/ABOR,544,"D&C, aspiration curettage or hysterotomy for obstetric diagnoses",14,"Pregnancy, Childbirth and the Puerperium",1,Minor,Minor,Surgical,Medicaid,Medicaid,,,N,Y,10234.10,6598.42
New York City,Manhattan,7002001,001438,Bellevue Hospital Center,30 to 49,112,F,Other Race,Spanish/Hispanic,1,Emergency,Home or Self Care,2017,195,Other complications of birth; puerperium affecting management of mother,127,D&C; ASPIR AFT DLV/ABOR,544,"D&C, aspiration curettage or hysterotomy for obstetric diagnoses",14,"Pregnancy, Childbirth and the Puerperium",1,Minor,Minor,Surgical,Medicaid,,,,N,Y,7131.22,4597.84
New York City,Manhattan,7002001,001438,Bellevue Hospital Center,30 to 49,112,F,White,Not Span/Hispanic,8,Elective,Short-term Hospital,2017,195,Other complications of birth; puerperium affecting management of mother,124,HYSTERECTOMY; AB/VAG,544,"D&C, aspiration curettage or hysterotomy for obstetric diagnoses",14,"Pregnancy, Childbirth and the Puerperium",4,Extreme,Extreme,Surgical,Medicaid,Medicaid,,,N,N,64350.30,41489.73
New York City,Manhattan,7002001,001438,Bellevue Hospital Center,30 to 49,100,F,Other Race,Not Span/Hispanic,1,Emergency,Home or Self Care,2017,181,Other complications of pregnancy,127,D&C; ASPIR AFT DLV/ABOR,544,"D&C, aspiration curettage or hysterotomy for obstetric diagnoses",14,"Pregnancy, Childbirth and the Puerperium",1,Minor,Minor,Surgical,Medicaid,Medicaid,,,N,Y,5016.62,3234.46
New York City,Manhattan,7002001,001438,Bellevue Hospital Center,30 to 49,112,F,Other Race,Not Span/Hispanic,20,Emergency,Home or Self Care,2017,181,Other complications of pregnancy,218,PSYCHO/PSYCHI EVAL/THER,544,"D&C, aspiration curettage or hysterotomy for obstetric diagnoses",14,"Pregnancy, Childbirth and the Puerperium",2,Moderate,Minor,Surgical,Medicare,Medicare,,,N,Y,30349.94,19568.06
New York City,Manhattan,7002001,001438,Bellevue Hospital Center,30 to 49,100,F,Other Race,Spanish/Hispanic,1,Emergency,Home or Self Care,2017,181,Other complications of pregnancy,127,D&C; ASPIR AFT DLV/ABOR,544,"D&C, aspiration curettage or hysterotomy for obstetric diagnoses",14,"Pregnancy, Childbirth and the Puerperium",1,Minor,Minor,Surgical,Medicaid,Medicaid,,,N,Y,5598.37,3609.54
New York City,Manhattan,7002001,001438,Bellevue Hospital Center,18 to 29,100,F,Other Race,Spanish/Hispanic,1,Emergency,Home or Self Care,2017,181,Other complications of pregnancy,127,D&C; ASPIR AFT DLV/ABOR,544,"D&C, aspiration curettage or hysterotomy for obstetric diagnoses",14,"Pregnancy, Childbirth and the Puerperium",1,Minor,Minor,Surgical,Medicaid,Medicaid,,,N,Y,5160.98,3327.53
