Hospital Service Area,Hospital County,Operating Certificate Number,Permanent Facility Id,Facility Name,Age Group,Zip Code - 3 digits,Gender,Race,Ethnicity,Length of Stay,Type of Admission,Patient Disposition,Discharge Year,CCS Diagnosis Code,CCS Diagnosis Description,CCS Procedure Code,CCS Procedure Description,APR DRG Code,APR DRG Description,APR MDC Code,APR MDC Description,APR Severity of Illness Code,APR Severity of Illness Description,APR Risk of Mortality,APR Medical Surgical Description,Payment Typology 1,Payment Typology 2,Payment Typology 3,Birth Weight,Abortion Edit Indicator,Emergency Department Indicator,Total Charges,Total Costs
New York City,Manhattan,7002001,001438,Bellevue Hospital Center,18 to 29,104,F,Other Race,Spanish/Hispanic,1,Elective,Home or Self Care,2020,PRG017,MATERNAL CARE FOR ABNORMALITY OF PELVIC ORGANS,CAR010,LIGATION AND EMBOLIZATION OF VESSELS,547,ANTEPARTUM W O.R. PROCEDURE,14,"PREGNANCY, CHILDBIRTH AND THE PUERPERIUM",2,Moderate,Minor,Surgical,Medicaid,,,,,N,36665.67,21085.84
New York City,Manhattan,7002001,001438,Bellevue Hospital Center,30 to 49,112,F,Black/African American,Not Span/Hispanic,1,Emergency,Home or Self Care,2020,PRG011,EARLY OR THREATENED LABOR,FRS009,CERVICAL CERCLAGE,547,ANTEPARTUM W O.R. PROCEDURE,14,"PREGNANCY, CHILDBIRTH AND THE PUERPERIUM",1,Minor,Minor,Surgical,Private Health Insurance,,,,,N,14890.41,8563.24
New York City,Manhattan,7002001,001438,Bellevue Hospital Center,30 to 49,104,F,Other Race,Spanish/Hispanic,1,Emergency,Home or Self Care,2020,PRG011,EARLY OR THREATENED LABOR,FRS009,CERVICAL CERCLAGE,547,ANTEPARTUM W O.R. PROCEDURE,14,"PREGNANCY, CHILDBIRTH AND THE PUERPERIUM",1,Minor,Minor,Surgical,Medicare,Medicaid,,,,N,6246.73,3592.39
New York City,Manhattan,7002001,001438,Bellevue Hospital Center,30 to 49,112,F,Other Race,Spanish/Hispanic,1,Elective,Home or Self Care,2020,PRG011,EARLY OR THREATENED LABOR,FRS009,CERVICAL CERCLAGE,547,ANTEPARTUM W O.R. PROCEDURE,14,"PREGNANCY, CHILDBIRTH AND THE PUERPERIUM",1,Minor,Minor,Surgical,Private Health Insurance,,,,,N,13531.81,7781.93
New York City,Manhattan,7002001,001438,Bellevue Hospital Center,30 to 49,113,F,Other Race,Spanish/Hispanic,15,Urgent,Home or Self Care,2020,PRG018,MATERNAL CARE RELATED TO DISORDERS OF THE PLACENTA AND PLACENTAL IMPLANTATION,PGN006,REMOVAL OF PLACENTA AND OTHER RETAINED PRODUCTS OF CONCEPTION,547,ANTEPARTUM W O.R. PROCEDURE,14,"PREGNANCY, CHILDBIRTH AND THE PUERPERIUM",3,Major,Minor,Surgical,Medicaid,,,,,N,141454.86,81348.43
New York City,Manhattan,7002001,001438,Bellevue Hospital Center,30 to 49,112,F,Black/African American,Unknown,1,Emergency,Home or Self Care,2020,PRG011,EARLY OR THREATENED LABOR,FRS009,CERVICAL CERCLAGE,547,ANTEPARTUM W O.R. PROCEDURE,14,"PREGNANCY, CHILDBIRTH AND THE PUERPERIUM",2,Moderate,Minor,Surgical,Medicaid,,,,,N,11628.4,6687.31
New York City,Manhattan,7002001,001438,Bellevue Hospital Center,18 to 29,100,F,Black/African American,Not Span/Hispanic,1,Elective,Home or Self Care,2020,PRG011,EARLY OR THREATENED LABOR,FRS009,CERVICAL CERCLAGE,547,ANTEPARTUM W O.R. PROCEDURE,14,"PREGNANCY, CHILDBIRTH AND THE PUERPERIUM",1,Minor,Minor,Surgical,Medicaid,,,,,N,18926.01,10884.05
New York City,Manhattan,7002001,001438,Bellevue Hospital Center,30 to 49,112,F,Other Race,Unknown,1,Elective,Home or Self Care,2020,PRG020,HYPERTENSION AND HYPERTENSIVE-RELATED CONDITIONS COMPLICATING PREGNANCY; CHILDBIRTH; AND THE PUERPERIUM,FRS009,CERVICAL CERCLAGE,547,ANTEPARTUM W O.R. PROCEDURE,14,"PREGNANCY, CHILDBIRTH AND THE PUERPERIUM",1,Minor,Minor,Surgical,Private Health Insurance,,,,,N,15219.51,8752.5
New York City,Manhattan,7002001,001438,Bellevue Hospital Center,30 to 49,111,F,Other Race,Not Span/Hispanic,1,Elective,Home or Self Care,2020,PRG011,EARLY OR THREATENED LABOR,FRS009,CERVICAL CERCLAGE,547,ANTEPARTUM W O.R. PROCEDURE,14,"PREGNANCY, CHILDBIRTH AND THE PUERPERIUM",1,Minor,Minor,Surgical,Medicaid,,,,,N,13076.45,7520.06
New York City,Manhattan,7002001,001438,Bellevue Hospital Center,30 to 49,111,F,Black/African American,Not Span/Hispanic,1,Elective,Home or Self Care,2020,PRG011,EARLY OR THREATENED LABOR,FRS009,CERVICAL CERCLAGE,547,ANTEPARTUM W O.R. PROCEDURE,14,"PREGNANCY, CHILDBIRTH AND THE PUERPERIUM",1,Minor,Minor,Surgical,Medicaid,,,,,N,17612.19,10128.49
New York City,Manhattan,7002001,001438,Bellevue Hospital Center,18 to 29,100,F,Black/African American,Not Span/Hispanic,1,Elective,Home or Self Care,2020,PRG028,OTHER SPECIFIED COMPLICATIONS IN PREGNANCY,FRS009,CERVICAL CERCLAGE,547,ANTEPARTUM W O.R. PROCEDURE,14,"PREGNANCY, CHILDBIRTH AND THE PUERPERIUM",1,Minor,Minor,Surgical,Private Health Insurance,,,,,N,17803.44,10238.47
New York City,Manhattan,7002001,001438,Bellevue Hospital Center,18 to 29,112,F,Black/African American,Spanish/Hispanic,1,Emergency,Home or Self Care,2020,PRG011,EARLY OR THREATENED LABOR,FRS009,CERVICAL CERCLAGE,547,ANTEPARTUM W O.R. PROCEDURE,14,"PREGNANCY, CHILDBIRTH AND THE PUERPERIUM",1,Minor,Minor,Surgical,Private Health Insurance,Medicaid,,,,N,20091.03,11554.03
New York City,Manhattan,7002001,001438,Bellevue Hospital Center,18 to 29,112,F,Other Race,Not Span/Hispanic,1,Emergency,Home or Self Care,2020,PRG011,EARLY OR THREATENED LABOR,FRS009,CERVICAL CERCLAGE,547,ANTEPARTUM W O.R. PROCEDURE,14,"PREGNANCY, CHILDBIRTH AND THE PUERPERIUM",1,Minor,Minor,Surgical,Medicaid,,,,,N,18538,10660.91
New York City,Manhattan,7002001,001438,Bellevue Hospital Center,30 to 49,112,F,Other Race,Not Span/Hispanic,9,Urgent,Home w/ Home Health Services,2020,PRG028,OTHER SPECIFIED COMPLICATIONS IN PREGNANCY,EYP001,EYE PROCEDURES,547,ANTEPARTUM W O.R. PROCEDURE,14,"PREGNANCY, CHILDBIRTH AND THE PUERPERIUM",2,Moderate,Minor,Surgical,Medicaid,,,,,N,96224.28,55337.04
New York City,Manhattan,7002001,001438,Bellevue Hospital Center,18 to 29,112,F,Other Race,Spanish/Hispanic,1,Emergency,Home or Self Care,2020,PRG028,OTHER SPECIFIED COMPLICATIONS IN PREGNANCY,GIS008,APPENDECTOMY,547,ANTEPARTUM W O.R. PROCEDURE,14,"PREGNANCY, CHILDBIRTH AND THE PUERPERIUM",2,Moderate,Minor,Surgical,Medicaid,,,,,N,22234.53,12786.72
New York City,Manhattan,7002001,001438,Bellevue Hospital Center,30 to 49,112,F,Other Race,Spanish/Hispanic,1,Elective,Home or Self Care,2020,PRG011,EARLY OR THREATENED LABOR,FRS009,CERVICAL CERCLAGE,547,ANTEPARTUM W O.R. PROCEDURE,14,"PREGNANCY, CHILDBIRTH AND THE PUERPERIUM",1,Minor,Minor,Surgical,Medicaid,,,,,N,14695.15,8450.95
