Hospital Service Area,Hospital County,Operating Certificate Number,Permanent Facility Id,Facility Name,Age Group,Zip Code - 3 digits,Gender,Race,Ethnicity,Length of Stay,Type of Admission,Patient Disposition,Discharge Year,CCS Diagnosis Code,CCS Diagnosis Description,CCS Procedure Code,CCS Procedure Description,APR DRG Code,APR DRG Description,APR MDC Code,APR MDC Description,APR Severity of Illness Code,APR Severity of Illness Description,APR Risk of Mortality,APR Medical Surgical Description,Payment Typology 1,Payment Typology 2,Payment Typology 3,Birth Weight,Abortion Edit Indicator,Emergency Department Indicator,Total Charges,Total Costs
Long Island,Suffolk,5123000,000885,Brookhaven Memorial Hospital Medical Center Inc,50 to 69,117,M,White,Not Span/Hispanic,35,Emergency,Psychiatric Hospital or Unit of Hosp,2017,233,Intracranial injury,216,RESP INTUB/MECH VENTIL,055,Head trauma w coma >1 hr or hemorrhage,01,Diseases and Disorders of the Nervous System,4,Extreme,Extreme,Medical,Private Health Insurance,Medicaid,,,N,Y,421246.85,73670.68
Long Island,Suffolk,5123000,000885,Brookhaven Memorial Hospital Medical Center Inc,50 to 69,117,M,White,Not Span/Hispanic,3,Emergency,Home w/ Home Health Services,2017,233,Intracranial injury,000,NO PROC,055,Head trauma w coma >1 hr or hemorrhage,01,Diseases and Disorders of the Nervous System,3,Major,Moderate,Medical,Private Health Insurance,Medicare,Medicare,,N,Y,40763.81,6063.86
Long Island,Suffolk,5123000,000885,Brookhaven Memorial Hospital Medical Center Inc,70 or Older,117,F,White,Not Span/Hispanic,8,Emergency,Skilled Nursing Home,2017,233,Intracranial injury,171,SUTURE SKIN/SUBCUT TISS,055,Head trauma w coma >1 hr or hemorrhage,01,Diseases and Disorders of the Nervous System,3,Major,Extreme,Medical,Medicare,Medicare,Blue Cross/Blue Shield,,N,Y,79189.51,12585.60
Long Island,Suffolk,5123000,000885,Brookhaven Memorial Hospital Medical Center Inc,70 or Older,119,M,Other Race,Not Span/Hispanic,5,Emergency,Skilled Nursing Home,2017,233,Intracranial injury,199,ELECTROENCEPHALOGRAM,055,Head trauma w coma >1 hr or hemorrhage,01,Diseases and Disorders of the Nervous System,3,Major,Major,Medical,Medicare,Medicare,Private Health Insurance,,N,Y,79110.40,11940.97
Long Island,Suffolk,5123000,000885,Brookhaven Memorial Hospital Medical Center Inc,70 or Older,117,F,White,Not Span/Hispanic,5,Emergency,Skilled Nursing Home,2017,233,Intracranial injury,171,SUTURE SKIN/SUBCUT TISS,055,Head trauma w coma >1 hr or hemorrhage,01,Diseases and Disorders of the Nervous System,2,Moderate,Moderate,Medical,Medicare,Medicare,Private Health Insurance,,N,Y,73115.91,9655.70
Long Island,Suffolk,5123000,000885,Brookhaven Memorial Hospital Medical Center Inc,70 or Older,117,F,White,Not Span/Hispanic,1,Emergency,Home or Self Care,2017,233,Intracranial injury,000,NO PROC,055,Head trauma w coma >1 hr or hemorrhage,01,Diseases and Disorders of the Nervous System,1,Minor,Minor,Medical,Private Health Insurance,Medicare,Medicare,,N,Y,36810.08,2411.20
Long Island,Suffolk,5123000,000885,Brookhaven Memorial Hospital Medical Center Inc,70 or Older,117,F,White,Not Span/Hispanic,4,Emergency,Skilled Nursing Home,2017,233,Intracranial injury,000,NO PROC,055,Head trauma w coma >1 hr or hemorrhage,01,Diseases and Disorders of the Nervous System,2,Moderate,Moderate,Medical,Medicare,Medicare,Blue Cross/Blue Shield,,N,Y,49602.94,7335.92
Long Island,Suffolk,5123000,000885,Brookhaven Memorial Hospital Medical Center Inc,18 to 29,117,M,White,Not Span/Hispanic,8,Emergency,Left Against Medical Advice,2017,233,Intracranial injury,000,NO PROC,055,Head trauma w coma >1 hr or hemorrhage,01,Diseases and Disorders of the Nervous System,1,Minor,Minor,Medical,Private Health Insurance,,,,N,Y,101000.32,14172.46
Long Island,Suffolk,5123000,000885,Brookhaven Memorial Hospital Medical Center Inc,30 to 49,119,F,White,Not Span/Hispanic,1,Emergency,Home or Self Care,2017,233,Intracranial injury,000,NO PROC,055,Head trauma w coma >1 hr or hemorrhage,01,Diseases and Disorders of the Nervous System,1,Minor,Minor,Medical,Private Health Insurance,,,,N,Y,21550.65,2465.26
Long Island,Suffolk,5123000,000885,Brookhaven Memorial Hospital Medical Center Inc,50 to 69,117,F,White,Not Span/Hispanic,3,Emergency,Home or Self Care,2017,233,Intracranial injury,000,NO PROC,055,Head trauma w coma >1 hr or hemorrhage,01,Diseases and Disorders of the Nervous System,1,Minor,Minor,Medical,Private Health Insurance,Private Health Insurance,,,N,Y,65073.06,7591.13
Long Island,Suffolk,5123000,000885,Brookhaven Memorial Hospital Medical Center Inc,70 or Older,117,F,White,Not Span/Hispanic,11,Emergency,Expired,2017,233,Intracranial injury,214,"TRACTN, SPLNT, OT WOUND",055,Head trauma w coma >1 hr or hemorrhage,01,Diseases and Disorders of the Nervous System,4,Extreme,Extreme,Medical,Medicare,Medicare,Private Health Insurance,,N,Y,123012.04,18182.57
Long Island,Suffolk,5123000,000885,Brookhaven Memorial Hospital Medical Center Inc,50 to 69,119,M,White,Not Span/Hispanic,1,Emergency,Home or Self Care,2017,233,Intracranial injury,000,NO PROC,055,Head trauma w coma >1 hr or hemorrhage,01,Diseases and Disorders of the Nervous System,3,Major,Major,Medical,Private Health Insurance,Medicare,Private Health Insurance,,N,Y,38560.79,2810.97
Long Island,Suffolk,5123000,000885,Brookhaven Memorial Hospital Medical Center Inc,30 to 49,117,M,White,Not Span/Hispanic,22,Emergency,Skilled Nursing Home,2017,233,Intracranial injury,216,RESP INTUB/MECH VENTIL,055,Head trauma w coma >1 hr or hemorrhage,01,Diseases and Disorders of the Nervous System,4,Extreme,Extreme,Medical,Private Health Insurance,,,,N,Y,247067.99,40812.99
Long Island,Suffolk,5123000,000885,Brookhaven Memorial Hospital Medical Center Inc,70 or Older,117,M,White,Not Span/Hispanic,10,Emergency,Skilled Nursing Home,2017,233,Intracranial injury,061,OT OR PRCS VES NOT HEAD,055,Head trauma w coma >1 hr or hemorrhage,01,Diseases and Disorders of the Nervous System,3,Major,Moderate,Medical,Medicare,Medicare,Private Health Insurance,,N,Y,139085.45,23018.49
Long Island,Suffolk,5123000,000885,Brookhaven Memorial Hospital Medical Center Inc,70 or Older,117,M,White,Not Span/Hispanic,26,Emergency,Hospice - Home,2017,233,Intracranial injury,223,ENTERAL/PARENTERAL NUTR,055,Head trauma w coma >1 hr or hemorrhage,01,Diseases and Disorders of the Nervous System,3,Major,Major,Medical,Medicare,Medicare,,,N,Y,196685.58,38332.36
Long Island,Suffolk,5123000,000885,Brookhaven Memorial Hospital Medical Center Inc,30 to 49,117,M,White,Not Span/Hispanic,5,Emergency,Home or Self Care,2017,233,Intracranial injury,000,NO PROC,055,Head trauma w coma >1 hr or hemorrhage,01,Diseases and Disorders of the Nervous System,3,Major,Moderate,Medical,Blue Cross/Blue Shield,,,,N,Y,68372.86,8466.92
Long Island,Suffolk,5123000,000885,Brookhaven Memorial Hospital Medical Center Inc,50 to 69,119,M,White,Not Span/Hispanic,15,Emergency,Skilled Nursing Home,2017,233,Intracranial injury,222,BLOOD TRANSFUSION,055,Head trauma w coma >1 hr or hemorrhage,01,Diseases and Disorders of the Nervous System,3,Major,Major,Medical,Medicare,Medicare,Private Health Insurance,,N,Y,171469.60,30699.20
Long Island,Suffolk,5123000,000885,Brookhaven Memorial Hospital Medical Center Inc,70 or Older,117,M,White,Not Span/Hispanic,2,Emergency,Home or Self Care,2017,233,Intracranial injury,171,SUTURE SKIN/SUBCUT TISS,055,Head trauma w coma >1 hr or hemorrhage,01,Diseases and Disorders of the Nervous System,1,Minor,Minor,Medical,Medicare,,,,N,Y,35630.62,4007.34
Long Island,Suffolk,5123000,000885,Brookhaven Memorial Hospital Medical Center Inc,50 to 69,119,F,Other Race,Not Span/Hispanic,3,Emergency,Home or Self Care,2017,233,Intracranial injury,000,NO PROC,055,Head trauma w coma >1 hr or hemorrhage,01,Diseases and Disorders of the Nervous System,1,Minor,Minor,Medical,Private Health Insurance,Blue Cross/Blue Shield,,,N,Y,73264.05,7044.10
Long Island,Suffolk,5123000,000885,Brookhaven Memorial Hospital Medical Center Inc,70 or Older,117,F,White,Not Span/Hispanic,9,Emergency,Inpatient Rehabilitation Facility,2017,233,Intracranial injury,199,ELECTROENCEPHALOGRAM,055,Head trauma w coma >1 hr or hemorrhage,01,Diseases and Disorders of the Nervous System,3,Major,Extreme,Medical,Private Health Insurance,Medicare,,,N,Y,123112.60,17666.89
Long Island,Suffolk,5123000,000885,Brookhaven Memorial Hospital Medical Center Inc,70 or Older,119,F,White,Not Span/Hispanic,10,Emergency,Skilled Nursing Home,2017,233,Intracranial injury,222,BLOOD TRANSFUSION,055,Head trauma w coma >1 hr or hemorrhage,01,Diseases and Disorders of the Nervous System,2,Moderate,Moderate,Medical,Medicare,Medicare,Private Health Insurance,,N,Y,95041.52,15928.96
Long Island,Suffolk,5123000,000885,Brookhaven Memorial Hospital Medical Center Inc,50 to 69,119,M,White,Not Span/Hispanic,1,Emergency,Short-term Hospital,2017,233,Intracranial injury,000,NO PROC,055,Head trauma w coma >1 hr or hemorrhage,01,Diseases and Disorders of the Nervous System,2,Moderate,Minor,Medical,Private Health Insurance,,,,N,Y,53327.18,3069.65
Long Island,Suffolk,5123000,000885,Brookhaven Memorial Hospital Medical Center Inc,18 to 29,117,M,Black/African American,Not Span/Hispanic,10,Emergency,Home or Self Care,2017,233,Intracranial injury,214,"TRACTN, SPLNT, OT WOUND",055,Head trauma w coma >1 hr or hemorrhage,01,Diseases and Disorders of the Nervous System,3,Major,Major,Medical,Private Health Insurance,Blue Cross/Blue Shield,Private Health Insurance,,N,Y,132059.94,18373.84
Long Island,Suffolk,5123000,000885,Brookhaven Memorial Hospital Medical Center Inc,50 to 69,117,F,White,Not Span/Hispanic,10,Emergency,Expired,2017,233,Intracranial injury,216,RESP INTUB/MECH VENTIL,055,Head trauma w coma >1 hr or hemorrhage,01,Diseases and Disorders of the Nervous System,4,Extreme,Extreme,Medical,Medicare,Medicare,Blue Cross/Blue Shield,,N,Y,172651.12,26119.80
Long Island,Suffolk,5123000,000885,Brookhaven Memorial Hospital Medical Center Inc,70 or Older,117,M,White,Not Span/Hispanic,4,Emergency,Home or Self Care,2017,233,Intracranial injury,222,BLOOD TRANSFUSION,055,Head trauma w coma >1 hr or hemorrhage,01,Diseases and Disorders of the Nervous System,2,Moderate,Minor,Medical,Medicare,Medicare,Blue Cross/Blue Shield,,N,Y,91584.81,10573.98
Long Island,Suffolk,5123000,000885,Brookhaven Memorial Hospital Medical Center Inc,30 to 49,117,M,White,Not Span/Hispanic,1,Emergency,Short-term Hospital,2017,233,Intracranial injury,000,NO PROC,055,Head trauma w coma >1 hr or hemorrhage,01,Diseases and Disorders of the Nervous System,1,Minor,Minor,Medical,Medicaid,,,,N,Y,41971.69,3071.36
Long Island,Suffolk,5123000,000885,Brookhaven Memorial Hospital Medical Center Inc,70 or Older,119,F,White,Not Span/Hispanic,9,Emergency,Expired,2017,233,Intracranial injury,222,BLOOD TRANSFUSION,055,Head trauma w coma >1 hr or hemorrhage,01,Diseases and Disorders of the Nervous System,3,Major,Major,Medical,Medicare,Private Health Insurance,,,N,Y,77324.67,15553.81
Long Island,Suffolk,5123000,000885,Brookhaven Memorial Hospital Medical Center Inc,50 to 69,115,M,White,Not Span/Hispanic,1,Emergency,Left Against Medical Advice,2017,233,Intracranial injury,000,NO PROC,055,Head trauma w coma >1 hr or hemorrhage,01,Diseases and Disorders of the Nervous System,2,Moderate,Minor,Medical,Self-Pay,,,,N,Y,49477.36,3254.94
Long Island,Suffolk,5123000,000885,Brookhaven Memorial Hospital Medical Center Inc,70 or Older,117,F,White,Not Span/Hispanic,10,Emergency,Short-term Hospital,2017,233,Intracranial injury,000,NO PROC,055,Head trauma w coma >1 hr or hemorrhage,01,Diseases and Disorders of the Nervous System,3,Major,Extreme,Medical,Medicare,Medicare,Private Health Insurance,,N,Y,112588.85,17540.98
Long Island,Suffolk,5123000,000885,Brookhaven Memorial Hospital Medical Center Inc,50 to 69,117,M,White,Not Span/Hispanic,8,Emergency,Home or Self Care,2017,233,Intracranial injury,000,NO PROC,055,Head trauma w coma >1 hr or hemorrhage,01,Diseases and Disorders of the Nervous System,2,Moderate,Moderate,Medical,Medicare,Medicaid,,,N,Y,67925.77,10856.30
Long Island,Suffolk,5123000,000885,Brookhaven Memorial Hospital Medical Center Inc,18 to 29,117,M,Other Race,Not Span/Hispanic,1,Emergency,Home or Self Care,2017,233,Intracranial injury,000,NO PROC,055,Head trauma w coma >1 hr or hemorrhage,01,Diseases and Disorders of the Nervous System,2,Moderate,Minor,Medical,Private Health Insurance,,,,N,Y,72445.21,5099.94
Long Island,Suffolk,5123000,000885,Brookhaven Memorial Hospital Medical Center Inc,50 to 69,117,M,White,Not Span/Hispanic,27,Emergency,Skilled Nursing Home,2017,233,Intracranial injury,219,ALCO/DRUG REHAB/DETOX,055,Head trauma w coma >1 hr or hemorrhage,01,Diseases and Disorders of the Nervous System,3,Major,Major,Medical,Private Health Insurance,,,,N,Y,185760.82,36537.12
Long Island,Suffolk,5123000,000885,Brookhaven Memorial Hospital Medical Center Inc,70 or Older,117,F,White,Not Span/Hispanic,14,Emergency,Expired,2017,233,Intracranial injury,062,OT DX CARDIOVASC PRCS,055,Head trauma w coma >1 hr or hemorrhage,01,Diseases and Disorders of the Nervous System,4,Extreme,Extreme,Medical,Medicare,,,,N,Y,214674.98,34540.25
Long Island,Suffolk,5123000,000885,Brookhaven Memorial Hospital Medical Center Inc,18 to 29,117,M,White,Not Span/Hispanic,2,Emergency,Home or Self Care,2017,228,Skull and face fractures,000,NO PROC,055,Head trauma w coma >1 hr or hemorrhage,01,Diseases and Disorders of the Nervous System,1,Minor,Minor,Medical,Private Health Insurance,,,,N,Y,42977.59,3996.73
Long Island,Suffolk,5123000,000885,Brookhaven Memorial Hospital Medical Center Inc,50 to 69,119,M,Black/African American,Not Span/Hispanic,3,Emergency,Home or Self Care,2017,233,Intracranial injury,222,BLOOD TRANSFUSION,055,Head trauma w coma >1 hr or hemorrhage,01,Diseases and Disorders of the Nervous System,2,Moderate,Moderate,Medical,Private Health Insurance,Medicare,,,N,Y,67451.74,8134.25
Long Island,Suffolk,5123000,000885,Brookhaven Memorial Hospital Medical Center Inc,70 or Older,119,M,White,Not Span/Hispanic,4,Emergency,Skilled Nursing Home,2017,233,Intracranial injury,000,NO PROC,055,Head trauma w coma >1 hr or hemorrhage,01,Diseases and Disorders of the Nervous System,2,Moderate,Moderate,Medical,Medicare,Medicare,Private Health Insurance,,N,Y,72844.91,8709.34
Long Island,Suffolk,5123000,000885,Brookhaven Memorial Hospital Medical Center Inc,70 or Older,119,F,White,Not Span/Hispanic,21,Emergency,Skilled Nursing Home,2017,233,Intracranial injury,222,BLOOD TRANSFUSION,055,Head trauma w coma >1 hr or hemorrhage,01,Diseases and Disorders of the Nervous System,3,Major,Extreme,Medical,Medicare,Medicare,Blue Cross/Blue Shield,,N,Y,202060.00,33385.01
Long Island,Suffolk,5123000,000885,Brookhaven Memorial Hospital Medical Center Inc,70 or Older,119,M,Other Race,Not Span/Hispanic,20,Emergency,Hospice - Home,2017,233,Intracranial injury,222,BLOOD TRANSFUSION,055,Head trauma w coma >1 hr or hemorrhage,01,Diseases and Disorders of the Nervous System,3,Major,Major,Medical,Medicare,,,,N,Y,284212.45,51581.91
Long Island,Suffolk,5123000,000885,Brookhaven Memorial Hospital Medical Center Inc,30 to 49,119,M,White,Not Span/Hispanic,8,Emergency,Home w/ Home Health Services,2017,233,Intracranial injury,000,NO PROC,055,Head trauma w coma >1 hr or hemorrhage,01,Diseases and Disorders of the Nervous System,2,Moderate,Minor,Medical,Medicaid,,,,N,Y,128102.50,15796.96
Long Island,Suffolk,5123000,000885,Brookhaven Memorial Hospital Medical Center Inc,70 or Older,119,F,White,Not Span/Hispanic,6,Emergency,Home or Self Care,2017,233,Intracranial injury,000,NO PROC,055,Head trauma w coma >1 hr or hemorrhage,01,Diseases and Disorders of the Nervous System,3,Major,Moderate,Medical,Medicare,Medicare,Blue Cross/Blue Shield,,N,Y,78558.72,9827.68
Long Island,Suffolk,5123000,000885,Brookhaven Memorial Hospital Medical Center Inc,50 to 69,119,M,Black/African American,Not Span/Hispanic,3,Emergency,Short-term Hospital,2017,233,Intracranial injury,199,ELECTROENCEPHALOGRAM,055,Head trauma w coma >1 hr or hemorrhage,01,Diseases and Disorders of the Nervous System,2,Moderate,Moderate,Medical,Medicare,Medicare,,,N,Y,81930.78,16583.68
Long Island,Suffolk,5123000,000885,Brookhaven Memorial Hospital Medical Center Inc,50 to 69,117,M,White,Not Span/Hispanic,1,Emergency,Home or Self Care,2017,233,Intracranial injury,000,NO PROC,055,Head trauma w coma >1 hr or hemorrhage,01,Diseases and Disorders of the Nervous System,1,Minor,Minor,Medical,Medicare,Medicare,Private Health Insurance,,N,Y,18578.04,2449.02
Long Island,Suffolk,5123000,000885,Brookhaven Memorial Hospital Medical Center Inc,70 or Older,117,M,Other Race,Not Span/Hispanic,4,Emergency,Skilled Nursing Home,2017,233,Intracranial injury,171,SUTURE SKIN/SUBCUT TISS,055,Head trauma w coma >1 hr or hemorrhage,01,Diseases and Disorders of the Nervous System,2,Moderate,Moderate,Medical,Medicare,Medicare,Medicaid,,N,Y,51224.19,8463.20
Long Island,Suffolk,5123000,000885,Brookhaven Memorial Hospital Medical Center Inc,50 to 69,117,M,White,Not Span/Hispanic,6,Emergency,Home or Self Care,2017,233,Intracranial injury,000,NO PROC,055,Head trauma w coma >1 hr or hemorrhage,01,Diseases and Disorders of the Nervous System,3,Major,Major,Medical,Medicare,Medicaid,,,N,Y,93055.71,12876.69
Long Island,Suffolk,5123000,000885,Brookhaven Memorial Hospital Medical Center Inc,70 or Older,117,M,Other Race,Not Span/Hispanic,2,Emergency,Home or Self Care,2017,233,Intracranial injury,171,SUTURE SKIN/SUBCUT TISS,055,Head trauma w coma >1 hr or hemorrhage,01,Diseases and Disorders of the Nervous System,2,Moderate,Minor,Medical,Medicare,Medicare,Private Health Insurance,,N,Y,54898.06,5212.20
Long Island,Suffolk,5123000,000885,Brookhaven Memorial Hospital Medical Center Inc,50 to 69,119,F,White,Not Span/Hispanic,1,Emergency,Home or Self Care,2017,233,Intracranial injury,000,NO PROC,055,Head trauma w coma >1 hr or hemorrhage,01,Diseases and Disorders of the Nervous System,1,Minor,Minor,Medical,Private Health Insurance,,,,N,Y,21819.69,2507.65
Long Island,Suffolk,5123000,000885,Brookhaven Memorial Hospital Medical Center Inc,70 or Older,117,F,White,Not Span/Hispanic,12,Emergency,Home w/ Home Health Services,2017,233,Intracranial injury,199,ELECTROENCEPHALOGRAM,055,Head trauma w coma >1 hr or hemorrhage,01,Diseases and Disorders of the Nervous System,3,Major,Major,Medical,Medicare,Medicare,Blue Cross/Blue Shield,,N,Y,88730.19,17475.05
Long Island,Suffolk,5123000,000885,Brookhaven Memorial Hospital Medical Center Inc,50 to 69,117,M,White,Not Span/Hispanic,5,Emergency,Home or Self Care,2017,233,Intracranial injury,216,RESP INTUB/MECH VENTIL,055,Head trauma w coma >1 hr or hemorrhage,01,Diseases and Disorders of the Nervous System,3,Major,Extreme,Medical,Private Health Insurance,,,,N,Y,106753.61,13785.66
Long Island,Suffolk,5123000,000885,Brookhaven Memorial Hospital Medical Center Inc,70 or Older,117,F,White,Not Span/Hispanic,5,Emergency,Skilled Nursing Home,2017,233,Intracranial injury,173,OT DX PRC SKIN/SUBCUTAN,055,Head trauma w coma >1 hr or hemorrhage,01,Diseases and Disorders of the Nervous System,3,Major,Moderate,Medical,Medicare,Medicare,Private Health Insurance,,N,Y,189965.23,34793.97
Long Island,Suffolk,5123000,000885,Brookhaven Memorial Hospital Medical Center Inc,30 to 49,119,M,White,Not Span/Hispanic,2,Emergency,Home or Self Care,2017,233,Intracranial injury,000,NO PROC,055,Head trauma w coma >1 hr or hemorrhage,01,Diseases and Disorders of the Nervous System,1,Minor,Minor,Medical,Private Health Insurance,Medicaid,,,N,Y,70560.70,4782.01
Long Island,Suffolk,5123000,000885,Brookhaven Memorial Hospital Medical Center Inc,70 or Older,119,F,White,Not Span/Hispanic,7,Emergency,Home w/ Home Health Services,2017,233,Intracranial injury,061,OT OR PRCS VES NOT HEAD,055,Head trauma w coma >1 hr or hemorrhage,01,Diseases and Disorders of the Nervous System,3,Major,Moderate,Medical,Medicare,Medicare,Private Health Insurance,,N,Y,112377.34,17562.98
Long Island,Suffolk,5123000,000885,Brookhaven Memorial Hospital Medical Center Inc,50 to 69,117,M,White,Not Span/Hispanic,5,Emergency,Left Against Medical Advice,2017,233,Intracranial injury,216,RESP INTUB/MECH VENTIL,055,Head trauma w coma >1 hr or hemorrhage,01,Diseases and Disorders of the Nervous System,4,Extreme,Extreme,Medical,Medicare,Medicare,,,N,Y,106763.51,15520.81
Long Island,Suffolk,5123000,000885,Brookhaven Memorial Hospital Medical Center Inc,50 to 69,119,M,White,Not Span/Hispanic,5,Emergency,Left Against Medical Advice,2017,233,Intracranial injury,000,NO PROC,055,Head trauma w coma >1 hr or hemorrhage,01,Diseases and Disorders of the Nervous System,2,Moderate,Minor,Medical,Medicare,Medicare,,,N,Y,83639.49,9757.98
Long Island,Suffolk,5123000,000885,Brookhaven Memorial Hospital Medical Center Inc,30 to 49,117,M,White,Not Span/Hispanic,6,Emergency,Skilled Nursing Home,2017,233,Intracranial injury,171,SUTURE SKIN/SUBCUT TISS,055,Head trauma w coma >1 hr or hemorrhage,01,Diseases and Disorders of the Nervous System,1,Minor,Minor,Medical,Medicare,Medicare,Medicaid,,N,Y,76221.88,9859.20
Long Island,Suffolk,5123000,000885,Brookhaven Memorial Hospital Medical Center Inc,70 or Older,117,M,White,Not Span/Hispanic,2,Emergency,Home or Self Care,2017,233,Intracranial injury,000,NO PROC,055,Head trauma w coma >1 hr or hemorrhage,01,Diseases and Disorders of the Nervous System,2,Moderate,Minor,Medical,Private Health Insurance,,,,N,Y,51848.70,5089.89
Long Island,Suffolk,5123000,000885,Brookhaven Memorial Hospital Medical Center Inc,18 to 29,119,M,Other Race,Not Span/Hispanic,8,Emergency,Court/Law Enforcement,2017,228,Skull and face fractures,000,NO PROC,055,Head trauma w coma >1 hr or hemorrhage,01,Diseases and Disorders of the Nervous System,2,Moderate,Minor,Medical,Medicaid,,,,N,Y,106156.25,13891.16
Long Island,Suffolk,5123000,000885,Brookhaven Memorial Hospital Medical Center Inc,70 or Older,119,M,White,Not Span/Hispanic,8,Emergency,Skilled Nursing Home,2017,233,Intracranial injury,222,BLOOD TRANSFUSION,055,Head trauma w coma >1 hr or hemorrhage,01,Diseases and Disorders of the Nervous System,3,Major,Moderate,Medical,Medicare,Medicare,,,N,Y,130554.62,17027.91
Long Island,Suffolk,5123000,000885,Brookhaven Memorial Hospital Medical Center Inc,50 to 69,OOS,M,White,Not Span/Hispanic,1,Emergency,Short-term Hospital,2017,233,Intracranial injury,000,NO PROC,055,Head trauma w coma >1 hr or hemorrhage,01,Diseases and Disorders of the Nervous System,2,Moderate,Moderate,Medical,Medicaid,,,,N,Y,48889.35,2669.90
Long Island,Suffolk,5123000,000885,Brookhaven Memorial Hospital Medical Center Inc,70 or Older,119,F,White,Not Span/Hispanic,3,Emergency,Home or Self Care,2017,233,Intracranial injury,171,SUTURE SKIN/SUBCUT TISS,055,Head trauma w coma >1 hr or hemorrhage,01,Diseases and Disorders of the Nervous System,1,Minor,Moderate,Medical,Private Health Insurance,Medicare,Medicare,,N,Y,61436.61,6252.17
Long Island,Suffolk,5123000,000885,Brookhaven Memorial Hospital Medical Center Inc,70 or Older,117,M,White,Not Span/Hispanic,9,Emergency,Skilled Nursing Home,2017,233,Intracranial injury,222,BLOOD TRANSFUSION,055,Head trauma w coma >1 hr or hemorrhage,01,Diseases and Disorders of the Nervous System,3,Major,Moderate,Medical,Medicare,Medicare,Medicaid,,N,Y,168590.12,22974.90
Long Island,Suffolk,5123000,000885,Brookhaven Memorial Hospital Medical Center Inc,70 or Older,117,M,Black/African American,Not Span/Hispanic,6,Emergency,Expired,2017,233,Intracranial injury,216,RESP INTUB/MECH VENTIL,055,Head trauma w coma >1 hr or hemorrhage,01,Diseases and Disorders of the Nervous System,4,Extreme,Extreme,Medical,Medicaid,,,,N,Y,89870.47,14549.72