Hospital Service Area,Hospital County,Operating Certificate Number,Permanent Facility Id,Facility Name,Age Group,Zip Code - 3 digits,Gender,Race,Ethnicity,Length of Stay,Type of Admission,Patient Disposition,Discharge Year,CCS Diagnosis Code,CCS Diagnosis Description,CCS Procedure Code,CCS Procedure Description,APR DRG Code,APR DRG Description,APR MDC Code,APR MDC Description,APR Severity of Illness Code,APR Severity of Illness Description,APR Risk of Mortality,APR Medical Surgical Description,Payment Typology 1,Payment Typology 2,Payment Typology 3,Birth Weight,Abortion Edit Indicator,Emergency Department Indicator,Total Charges,Total Costs
Capital/Adirond,Columbia,1001000,000146,Columbia Memorial Hospital,70 or Older,120,F,White,Not Span/Hispanic,3,Elective,Skilled Nursing Home,2018,INJ008,"TRAUMATIC BRAIN INJURY (TBI); CONCUSSION, INITIAL ENCOUNTER",,,055,HEAD TRAUMA W COMA >1 HR OR HEMORRHAGE,01,DISEASES AND DISORDERS OF THE NERVOUS SYSTEM,2,Moderate,Moderate,Medical,Medicare,Private Health Insurance,,,,true,10059.12,3207.87
Hudson Valley,Dutchess,1302001,000181,Vassar Brothers Medical Center,50 to 69,126,M,White,Not Span/Hispanic,2,Emergency,Home or Self Care,2018,INJ008,"TRAUMATIC BRAIN INJURY (TBI); CONCUSSION, INITIAL ENCOUNTER",,,055,HEAD TRAUMA W COMA >1 HR OR HEMORRHAGE,01,DISEASES AND DISORDERS OF THE NERVOUS SYSTEM,2,Moderate,Minor,Medical,Self-Pay,,,,,true,20733.58,4496.62
New York City,Manhattan,7002054,001458,New York-Presbyterian Hospital - New York Weill Cornell Center,18 to 29,100,F,Other Race,Not Span/Hispanic,26,Emergency,Expired,2018,INJ008,"TRAUMATIC BRAIN INJURY (TBI); CONCUSSION, INITIAL ENCOUNTER",CNS002,LUMBAR PUNCTURE,055,HEAD TRAUMA W COMA >1 HR OR HEMORRHAGE,01,DISEASES AND DISORDERS OF THE NERVOUS SYSTEM,4,Extreme,Major,Medical,Private Health Insurance,Self-Pay,,,,false,349779.68,114482.49
Long Island,Nassau,2908000,000511,NYU Langone Hospital-Long Island,70 or Older,115,M,Black/African American,Not Span/Hispanic,3,Emergency,Home or Self Care,2018,INJ008,"TRAUMATIC BRAIN INJURY (TBI); CONCUSSION, INITIAL ENCOUNTER",,,055,HEAD TRAUMA W COMA >1 HR OR HEMORRHAGE,01,DISEASES AND DISORDERS OF THE NERVOUS SYSTEM,2,Moderate,Minor,Medical,Medicare,Medicare,,,,true,96665.28,11691.77
New York City,Kings,7001020,001305,Maimonides Medical Center,70 or Older,112,F,Other Race,Not Span/Hispanic,1,Emergency,Home w/ Home Health Services,2018,INJ008,"TRAUMATIC BRAIN INJURY (TBI); CONCUSSION, INITIAL ENCOUNTER",SKB006,SKIN LACERATION REPAIR (EXCLUDING PERINEUM),055,HEAD TRAUMA W COMA >1 HR OR HEMORRHAGE,01,DISEASES AND DISORDERS OF THE NERVOUS SYSTEM,2,Moderate,Moderate,Medical,Medicare,Medicare,Medicaid,,,true,12774.02,3641.51
Hudson Valley,Westchester,5957001,001139,Westchester Medical Center,70 or Older,105,F,White,Not Span/Hispanic,7,Emergency,Home or Self Care,2018,INJ008,"TRAUMATIC BRAIN INJURY (TBI); CONCUSSION, INITIAL ENCOUNTER",ADM001,TRANSFUSION OF BLOOD AND BLOOD PRODUCTS,055,HEAD TRAUMA W COMA >1 HR OR HEMORRHAGE,01,DISEASES AND DISORDERS OF THE NERVOUS SYSTEM,3,Major,Moderate,Medical,Medicare,Medicare,,,,true,178546.36,32489.83
Long Island,Suffolk,5153000,000913,Huntington Hospital,50 to 69,117,M,Other Race,Not Span/Hispanic,2,Emergency,Home or Self Care,2018,INJ008,"TRAUMATIC BRAIN INJURY (TBI); CONCUSSION, INITIAL ENCOUNTER",,,055,HEAD TRAUMA W COMA >1 HR OR HEMORRHAGE,01,DISEASES AND DISORDERS OF THE NERVOUS SYSTEM,2,Moderate,Moderate,Medical,Medicaid,Medicaid,,,,true,42061.55,6819.52
Long Island,Suffolk,5153000,000913,Huntington Hospital,70 or Older,117,F,White,Not Span/Hispanic,5,Emergency,Skilled Nursing Home,2018,INJ008,"TRAUMATIC BRAIN INJURY (TBI); CONCUSSION, INITIAL ENCOUNTER",ADM004,TRANSFUSION OF CLOTTING FACTORS,055,HEAD TRAUMA W COMA >1 HR OR HEMORRHAGE,01,DISEASES AND DISORDERS OF THE NERVOUS SYSTEM,3,Major,Major,Medical,Medicare,Federal/State/Local/VA,,,,true,71930.42,12694.57
Capital/Adirond,Albany,0101004,000005,St. Peter's Hospital,70 or Older,122,F,White,Not Span/Hispanic,7,Elective,Inpatient Rehabilitation Facility,2018,INJ008,"TRAUMATIC BRAIN INJURY (TBI); CONCUSSION, INITIAL ENCOUNTER",,,055,HEAD TRAUMA W COMA >1 HR OR HEMORRHAGE,01,DISEASES AND DISORDERS OF THE NERVOUS SYSTEM,3,Major,Major,Medical,Medicare,Medicare,,,,false,53047.67,17950.3
New York City,Kings,7001009,001294,Coney Island Hospital,50 to 69,112,M,Black/African American,Not Span/Hispanic,54,Emergency,Skilled Nursing Home,2018,INJ008,"TRAUMATIC BRAIN INJURY (TBI); CONCUSSION, INITIAL ENCOUNTER",CAR028,INFERIOR VENA CAVA (IVC) FILTER PROCEDURES,055,HEAD TRAUMA W COMA >1 HR OR HEMORRHAGE,01,DISEASES AND DISORDERS OF THE NERVOUS SYSTEM,4,Extreme,Extreme,Medical,Medicare,Medicare,,,,true,311664.66,174447.75
Central NY,Onondaga,3301007,000635,University Hospital SUNY Health Science Center,70 or Older,130,F,White,Not Span/Hispanic,5,Emergency,Skilled Nursing Home,2018,INJ008,"TRAUMATIC BRAIN INJURY (TBI); CONCUSSION, INITIAL ENCOUNTER",,,055,HEAD TRAUMA W COMA >1 HR OR HEMORRHAGE,01,DISEASES AND DISORDERS OF THE NERVOUS SYSTEM,1,Minor,Moderate,Medical,Medicare,Private Health Insurance,,,,false,54735.66,13593.17
Central NY,Onondaga,3301007,000635,University Hospital SUNY Health Science Center,18 to 29,131,M,White,Not Span/Hispanic,2,Emergency,Home or Self Care,2018,INJ008,"TRAUMATIC BRAIN INJURY (TBI); CONCUSSION, INITIAL ENCOUNTER",ESA003,MECHANICAL VENTILATION,055,HEAD TRAUMA W COMA >1 HR OR HEMORRHAGE,01,DISEASES AND DISORDERS OF THE NERVOUS SYSTEM,3,Major,Major,Medical,Miscellaneous/Other,,,,,true,67523.88,14008.67
Long Island,Nassau,2950001,000527,Mount Sinai South Nassau,70 or Older,115,F,White,Not Span/Hispanic,3,Emergency,Skilled Nursing Home,2018,INJ008,"TRAUMATIC BRAIN INJURY (TBI); CONCUSSION, INITIAL ENCOUNTER",,,055,HEAD TRAUMA W COMA >1 HR OR HEMORRHAGE,01,DISEASES AND DISORDERS OF THE NERVOUS SYSTEM,1,Minor,Moderate,Medical,Medicare,Medicare,,,,true,39854.67,6216.44
New York City,Bronx,7000006,003058,Montefiore Med Center - Jack D Weiler Hosp of A Einstein College Div,70 or Older,104,F,Black/African American,Not Span/Hispanic,2,Emergency,Home w/ Home Health Services,2018,INJ008,"TRAUMATIC BRAIN INJURY (TBI); CONCUSSION, INITIAL ENCOUNTER",IMG007,COMPUTERIZED TOMOGRAPHY (CT) WITHOUT CONTRAST,055,HEAD TRAUMA W COMA >1 HR OR HEMORRHAGE,01,DISEASES AND DISORDERS OF THE NERVOUS SYSTEM,1,Minor,Moderate,Medical,Medicare,,,,,true,58061.83,7363.9
Long Island,Nassau,2951001,000541,North Shore University Hospital,70 or Older,114,F,Other Race,Unknown,5,Urgent,Home w/ Home Health Services,2018,INJ008,"TRAUMATIC BRAIN INJURY (TBI); CONCUSSION, INITIAL ENCOUNTER",,,055,HEAD TRAUMA W COMA >1 HR OR HEMORRHAGE,01,DISEASES AND DISORDERS OF THE NERVOUS SYSTEM,2,Moderate,Moderate,Medical,Medicare,Medicare,Medicaid,,,false,52180.71,8433.03
New York City,Bronx,7000006,001169,Montefiore Medical Center - Henry & Lucy Moses Div,70 or Older,104,F,Other Race,Spanish/Hispanic,7,Emergency,Home w/ Home Health Services,2018,INJ008,"TRAUMATIC BRAIN INJURY (TBI); CONCUSSION, INITIAL ENCOUNTER",ESA001,HEMODIALYSIS,055,HEAD TRAUMA W COMA >1 HR OR HEMORRHAGE,01,DISEASES AND DISORDERS OF THE NERVOUS SYSTEM,3,Major,Major,Medical,Medicare,Medicaid,,,,true,84776.94,15770.66
Long Island,Suffolk,5155000,000938,Peconic Bay Medical Center,70 or Older,119,F,White,Spanish/Hispanic,1,Emergency,Expired,2018,INJ008,"TRAUMATIC BRAIN INJURY (TBI); CONCUSSION, INITIAL ENCOUNTER",,,055,HEAD TRAUMA W COMA >1 HR OR HEMORRHAGE,01,DISEASES AND DISORDERS OF THE NERVOUS SYSTEM,1,Minor,Minor,Medical,Medicare,,,,,true,53813,7324.91
Hudson Valley,Westchester,5957001,001139,Westchester Medical Center,0 to 17,108,M,White,Not Span/Hispanic,8,Emergency,Home or Self Care,2018,INJ008,"TRAUMATIC BRAIN INJURY (TBI); CONCUSSION, INITIAL ENCOUNTER",CNS002,LUMBAR PUNCTURE,055,HEAD TRAUMA W COMA >1 HR OR HEMORRHAGE,01,DISEASES AND DISORDERS OF THE NERVOUS SYSTEM,3,Major,Minor,Medical,Blue Cross/Blue Shield,,,,,true,139943.31,23181.65
Capital/Adirond,Albany,0101004,000005,St. Peter's Hospital,70 or Older,121,M,White,Not Span/Hispanic,4,Emergency,Home w/ Home Health Services,2018,INJ008,"TRAUMATIC BRAIN INJURY (TBI); CONCUSSION, INITIAL ENCOUNTER",,,055,HEAD TRAUMA W COMA >1 HR OR HEMORRHAGE,01,DISEASES AND DISORDERS OF THE NERVOUS SYSTEM,2,Moderate,Moderate,Medical,Medicare,Medicare,,,,true,28533.25,8758.07
New York City,Queens,7003000,001626,Elmhurst Hospital Center,30 to 49,111,M,Other Race,Spanish/Hispanic,15,Emergency,Home or Self Care,2018,INJ008,"TRAUMATIC BRAIN INJURY (TBI); CONCUSSION, INITIAL ENCOUNTER",,,055,HEAD TRAUMA W COMA >1 HR OR HEMORRHAGE,01,DISEASES AND DISORDERS OF THE NERVOUS SYSTEM,3,Major,Minor,Medical,Medicaid,,,,,true,82370.52,49007.66
Hudson Valley,Westchester,5902001,001045,White Plains Hospital Center,70 or Older,105,F,Other Race,Not Span/Hispanic,5,Emergency,Skilled Nursing Home,2018,INJ008,"TRAUMATIC BRAIN INJURY (TBI); CONCUSSION, INITIAL ENCOUNTER",,,055,HEAD TRAUMA W COMA >1 HR OR HEMORRHAGE,01,DISEASES AND DISORDERS OF THE NERVOUS SYSTEM,2,Moderate,Moderate,Medical,Medicare,Blue Cross/Blue Shield,,,,true,54673,12635.66
Long Island,Suffolk,5149000,000895,John T Mather Memorial Hospital of Port Jefferson New York Inc,50 to 69,117,M,White,Not Span/Hispanic,1,Emergency,Home or Self Care,2018,INJ008,"TRAUMATIC BRAIN INJURY (TBI); CONCUSSION, INITIAL ENCOUNTER",SKB006,SKIN LACERATION REPAIR (EXCLUDING PERINEUM),055,HEAD TRAUMA W COMA >1 HR OR HEMORRHAGE,01,DISEASES AND DISORDERS OF THE NERVOUS SYSTEM,1,Minor,Minor,Medical,Medicare,Medicare,Medicaid,,,true,17659.52,3752.18
New York City,Queens,7003010,001637,New York - Presbyterian/Queens,70 or Older,113,F,White,Spanish/Hispanic,3,Emergency,Skilled Nursing Home,2018,INJ008,"TRAUMATIC BRAIN INJURY (TBI); CONCUSSION, INITIAL ENCOUNTER",IMG007,COMPUTERIZED TOMOGRAPHY (CT) WITHOUT CONTRAST,055,HEAD TRAUMA W COMA >1 HR OR HEMORRHAGE,01,DISEASES AND DISORDERS OF THE NERVOUS SYSTEM,2,Moderate,Moderate,Medical,Medicare,Self-Pay,,,,true,25692.02,6052.59
Long Island,Suffolk,5151001,000245,Stony Brook University Hospital,70 or Older,119,M,White,Not Span/Hispanic,9,Emergency,Inpatient Rehabilitation Facility,2018,INJ008,"TRAUMATIC BRAIN INJURY (TBI); CONCUSSION, INITIAL ENCOUNTER",ADM004,TRANSFUSION OF CLOTTING FACTORS,055,HEAD TRAUMA W COMA >1 HR OR HEMORRHAGE,01,DISEASES AND DISORDERS OF THE NERVOUS SYSTEM,3,Major,Moderate,Medical,Medicare,Blue Cross/Blue Shield,,,,true,106312.07,30263.21
Western NY,Erie,1401008,000213,Mercy Hospital of Buffalo,70 or Older,142,M,White,Not Span/Hispanic,5,Emergency,Home w/ Home Health Services,2018,INJ008,"TRAUMATIC BRAIN INJURY (TBI); CONCUSSION, INITIAL ENCOUNTER",IMG002,FLUOROSCOPIC ANGIOGRAPHY (EXCLUDING CORONARY),055,HEAD TRAUMA W COMA >1 HR OR HEMORRHAGE,01,DISEASES AND DISORDERS OF THE NERVOUS SYSTEM,3,Major,Moderate,Medical,Medicare,Medicare,Blue Cross/Blue Shield,,,true,31014.37,11459.94
Finger Lakes,Monroe,2701001,000409,Highland Hospital,70 or Older,146,F,White,Not Span/Hispanic,14,Emergency,Skilled Nursing Home,2018,INJ008,"TRAUMATIC BRAIN INJURY (TBI); CONCUSSION, INITIAL ENCOUNTER",SKB006,SKIN LACERATION REPAIR (EXCLUDING PERINEUM),055,HEAD TRAUMA W COMA >1 HR OR HEMORRHAGE,01,DISEASES AND DISORDERS OF THE NERVOUS SYSTEM,2,Moderate,Moderate,Medical,Medicare,,,,,true,30122.51,10877.17
Long Island,Nassau,2951001,000541,North Shore University Hospital,70 or Older,113,M,Other Race,Not Span/Hispanic,7,Emergency,Skilled Nursing Home,2018,INJ008,"TRAUMATIC BRAIN INJURY (TBI); CONCUSSION, INITIAL ENCOUNTER",URN006,BLADDER CATHETERIZATION AND DRAINAGE,055,HEAD TRAUMA W COMA >1 HR OR HEMORRHAGE,01,DISEASES AND DISORDERS OF THE NERVOUS SYSTEM,3,Major,Major,Medical,Medicare,Blue Cross/Blue Shield,,,,true,91415.93,13719.09
New York City,Manhattan,7002054,001464,New York-Presbyterian Hospital - Columbia Presbyterian Center,0 to 17,104,F,White,Spanish/Hispanic,6,Emergency,Home or Self Care,2018,INJ008,"TRAUMATIC BRAIN INJURY (TBI); CONCUSSION, INITIAL ENCOUNTER",ESA004,NON-INVASIVE VENTILATION,055,HEAD TRAUMA W COMA >1 HR OR HEMORRHAGE,01,DISEASES AND DISORDERS OF THE NERVOUS SYSTEM,4,Extreme,Major,Medical,Private Health Insurance,Self-Pay,,,,true,96990.29,27596.38
New York City,Manhattan,7002032,001469,Mount Sinai Morningside,70 or Older,113,M,Other Race,Unknown,1,Emergency,Home or Self Care,2018,INJ008,"TRAUMATIC BRAIN INJURY (TBI); CONCUSSION, INITIAL ENCOUNTER",IMG007,COMPUTERIZED TOMOGRAPHY (CT) WITHOUT CONTRAST,055,HEAD TRAUMA W COMA >1 HR OR HEMORRHAGE,01,DISEASES AND DISORDERS OF THE NERVOUS SYSTEM,2,Moderate,Moderate,Medical,Medicare,Medicare,Medicaid,,,true,20765.19,5728.84
Western NY,Erie,1401014,000207,Buffalo General Medical Center,70 or Older,140,M,White,Not Span/Hispanic,3,Emergency,Home or Self Care,2018,INJ008,"TRAUMATIC BRAIN INJURY (TBI); CONCUSSION, INITIAL ENCOUNTER",ADM001,TRANSFUSION OF BLOOD AND BLOOD PRODUCTS,055,HEAD TRAUMA W COMA >1 HR OR HEMORRHAGE,01,DISEASES AND DISORDERS OF THE NERVOUS SYSTEM,2,Moderate,Moderate,Medical,Medicare,Private Health Insurance,Self-Pay,,,true,25512.24,6776.86
New York City,Kings,7001020,001305,Maimonides Medical Center,70 or Older,112,F,White,Not Span/Hispanic,7,Emergency,Home w/ Home Health Services,2018,INJ008,"TRAUMATIC BRAIN INJURY (TBI); CONCUSSION, INITIAL ENCOUNTER",IMG007,COMPUTERIZED TOMOGRAPHY (CT) WITHOUT CONTRAST,055,HEAD TRAUMA W COMA >1 HR OR HEMORRHAGE,01,DISEASES AND DISORDERS OF THE NERVOUS SYSTEM,2,Moderate,Moderate,Medical,Miscellaneous/Other,Medicare,Medicaid,,,true,56430.03,15209.9
Central NY,Onondaga,3301007,000635,University Hospital SUNY Health Science Center,50 to 69,133,M,White,Not Span/Hispanic,5,Emergency,Home or Self Care,2018,INJ008,"TRAUMATIC BRAIN INJURY (TBI); CONCUSSION, INITIAL ENCOUNTER",SKB006,SKIN LACERATION REPAIR (EXCLUDING PERINEUM),055,HEAD TRAUMA W COMA >1 HR OR HEMORRHAGE,01,DISEASES AND DISORDERS OF THE NERVOUS SYSTEM,1,Minor,Minor,Medical,Medicaid,,,,,true,56436.76,14091.94
New York City,Bronx,7000008,001172,Lincoln Medical & Mental Health Center,50 to 69,104,M,Other Race,Not Span/Hispanic,13,Emergency,Inpatient Rehabilitation Facility,2018,INJ008,"TRAUMATIC BRAIN INJURY (TBI); CONCUSSION, INITIAL ENCOUNTER",,,055,HEAD TRAUMA W COMA >1 HR OR HEMORRHAGE,01,DISEASES AND DISORDERS OF THE NERVOUS SYSTEM,2,Moderate,Minor,Medical,Medicaid,Medicaid,,,,true,69222.27,40879.7
New York City,Bronx,7000008,001172,Lincoln Medical & Mental Health Center,30 to 49,104,M,Other Race,Spanish/Hispanic,11,Emergency,Inpatient Rehabilitation Facility,2018,INJ008,"TRAUMATIC BRAIN INJURY (TBI); CONCUSSION, INITIAL ENCOUNTER",ESA003,MECHANICAL VENTILATION,055,HEAD TRAUMA W COMA >1 HR OR HEMORRHAGE,01,DISEASES AND DISORDERS OF THE NERVOUS SYSTEM,3,Major,Major,Medical,Medicaid,,,,,true,62236.02,36753.92
New York City,Kings,7002053,001304,NYU Langone Hospital-Brooklyn,18 to 29,112,M,Other Race,Unknown,3,Emergency,Home or Self Care,2018,INJ008,"TRAUMATIC BRAIN INJURY (TBI); CONCUSSION, INITIAL ENCOUNTER",RES007,AIRWAY INTUBATION,055,HEAD TRAUMA W COMA >1 HR OR HEMORRHAGE,01,DISEASES AND DISORDERS OF THE NERVOUS SYSTEM,3,Major,Extreme,Medical,Medicaid,,,,,true,98509.64,28416.5
Hudson Valley,Orange,3522000,000694,St Luke's Cornwall Hospital/Newburgh,50 to 69,125,F,Other Race,Spanish/Hispanic,5,Emergency,Skilled Nursing Home,2018,INJ008,"TRAUMATIC BRAIN INJURY (TBI); CONCUSSION, INITIAL ENCOUNTER",ADM001,TRANSFUSION OF BLOOD AND BLOOD PRODUCTS,055,HEAD TRAUMA W COMA >1 HR OR HEMORRHAGE,01,DISEASES AND DISORDERS OF THE NERVOUS SYSTEM,3,Major,Major,Medical,Medicare,Medicaid,,,,true,79425.5,18554.95
Western NY,Erie,1401014,000207,Buffalo General Medical Center,70 or Older,142,F,White,Not Span/Hispanic,1,Emergency,Home or Self Care,2018,INJ008,"TRAUMATIC BRAIN INJURY (TBI); CONCUSSION, INITIAL ENCOUNTER",,,055,HEAD TRAUMA W COMA >1 HR OR HEMORRHAGE,01,DISEASES AND DISORDERS OF THE NERVOUS SYSTEM,2,Moderate,Minor,Medical,Medicare,Blue Cross/Blue Shield,Self-Pay,,,true,7893.74,2196.63
Capital/Adirond,Albany,0101000,000001,Albany Medical Center Hospital,50 to 69,100,F,White,Not Span/Hispanic,1,Trauma,Home or Self Care,2018,INJ008,"TRAUMATIC BRAIN INJURY (TBI); CONCUSSION, INITIAL ENCOUNTER",,,055,HEAD TRAUMA W COMA >1 HR OR HEMORRHAGE,01,DISEASES AND DISORDERS OF THE NERVOUS SYSTEM,1,Minor,Minor,Medical,Private Health Insurance,,,,,true,10894.86,3062.99
Capital/Adirond,Albany,0101000,000001,Albany Medical Center Hospital,70 or Older,137,F,White,Not Span/Hispanic,6,Emergency,Skilled Nursing Home,2018,INJ008,"TRAUMATIC BRAIN INJURY (TBI); CONCUSSION, INITIAL ENCOUNTER",,,055,HEAD TRAUMA W COMA >1 HR OR HEMORRHAGE,01,DISEASES AND DISORDERS OF THE NERVOUS SYSTEM,2,Moderate,Moderate,Medical,Medicare,Private Health Insurance,,,,true,52383.35,14201.56
New York City,Manhattan,7002054,001437,New York-Presbyterian/Lower Manhattan Hospital,70 or Older,100,F,Other Race,Spanish/Hispanic,7,Emergency,Home w/ Home Health Services,2018,INJ008,"TRAUMATIC BRAIN INJURY (TBI); CONCUSSION, INITIAL ENCOUNTER",ADM021,"ADMINISTRATION OF THERAPEUTIC SUBSTANCES, NEC",055,HEAD TRAUMA W COMA >1 HR OR HEMORRHAGE,01,DISEASES AND DISORDERS OF THE NERVOUS SYSTEM,3,Major,Major,Medical,Medicare,Medicare,Medicaid,,,true,101879.55,29001.53
Long Island,Nassau,2950002,000528,Nassau University Medical Center,30 to 49,117,F,Other Race,Not Span/Hispanic,2,Trauma,Home or Self Care,2018,INJ008,"TRAUMATIC BRAIN INJURY (TBI); CONCUSSION, INITIAL ENCOUNTER",ADM021,"ADMINISTRATION OF THERAPEUTIC SUBSTANCES, NEC",055,HEAD TRAUMA W COMA >1 HR OR HEMORRHAGE,01,DISEASES AND DISORDERS OF THE NERVOUS SYSTEM,1,Minor,Minor,Medical,Blue Cross/Blue Shield,Self-Pay,,,,false,32579.45,9952.55
Capital/Adirond,Albany,0101000,000001,Albany Medical Center Hospital,50 to 69,120,M,White,Not Span/Hispanic,3,Emergency,Home w/ Home Health Services,2018,INJ008,"TRAUMATIC BRAIN INJURY (TBI); CONCUSSION, INITIAL ENCOUNTER",,,055,HEAD TRAUMA W COMA >1 HR OR HEMORRHAGE,01,DISEASES AND DISORDERS OF THE NERVOUS SYSTEM,2,Moderate,Minor,Medical,Medicare,,,,,true,30721.91,6443.68
New York City,Queens,7003003,001629,Jamaica Hospital Medical Center,70 or Older,113,F,Other Race,Not Span/Hispanic,2,Emergency,Home or Self Care,2018,INJ008,"TRAUMATIC BRAIN INJURY (TBI); CONCUSSION, INITIAL ENCOUNTER",,,055,HEAD TRAUMA W COMA >1 HR OR HEMORRHAGE,01,DISEASES AND DISORDERS OF THE NERVOUS SYSTEM,2,Moderate,Minor,Medical,Medicare,Medicaid,,,,true,8637,4159.82
Southern Tier,Broome,0303001,000058,United Health Services Hospitals Inc. - Wilson Medical Center,70 or Older,139,M,White,Not Span/Hispanic,3,Emergency,Home or Self Care,2018,INJ008,"TRAUMATIC BRAIN INJURY (TBI); CONCUSSION, INITIAL ENCOUNTER",IMG005,MAGNETIC RESONANCE IMAGING (MRI),055,HEAD TRAUMA W COMA >1 HR OR HEMORRHAGE,01,DISEASES AND DISORDERS OF THE NERVOUS SYSTEM,2,Moderate,Minor,Medical,Medicare,Medicare,,,,true,13380.2,4928.13
New York City,Manhattan,7002054,001464,New York-Presbyterian Hospital - Columbia Presbyterian Center,70 or Older,100,M,Other Race,Spanish/Hispanic,9,Emergency,Skilled Nursing Home,2018,INJ008,"TRAUMATIC BRAIN INJURY (TBI); CONCUSSION, INITIAL ENCOUNTER",IMG005,MAGNETIC RESONANCE IMAGING (MRI),055,HEAD TRAUMA W COMA >1 HR OR HEMORRHAGE,01,DISEASES AND DISORDERS OF THE NERVOUS SYSTEM,2,Moderate,Minor,Medical,Medicare,Medicare,Medicaid,,,true,102337.05,22803.76
New York City,Kings,7001021,001306,New York - Presbyterian Brooklyn Methodist Hospital,70 or Older,112,F,Black/African American,Not Span/Hispanic,1,Emergency,Home or Self Care,2018,INJ008,"TRAUMATIC BRAIN INJURY (TBI); CONCUSSION, INITIAL ENCOUNTER",,,055,HEAD TRAUMA W COMA >1 HR OR HEMORRHAGE,01,DISEASES AND DISORDERS OF THE NERVOUS SYSTEM,2,Moderate,Moderate,Medical,Medicare,Private Health Insurance,Self-Pay,,,true,17042.1,4825.65
New York City,Kings,7001016,001301,Kings County Hospital Center,50 to 69,112,M,Black/African American,Not Span/Hispanic,5,Emergency,Home or Self Care,2018,INJ008,"TRAUMATIC BRAIN INJURY (TBI); CONCUSSION, INITIAL ENCOUNTER",,,055,HEAD TRAUMA W COMA >1 HR OR HEMORRHAGE,01,DISEASES AND DISORDERS OF THE NERVOUS SYSTEM,1,Minor,Minor,Medical,Medicaid,,,,,true,36903.56,26214.85
Western NY,Erie,1401005,000210,Erie County Medical Center,70 or Older,142,F,White,Not Span/Hispanic,8,Emergency,Home w/ Home Health Services,2018,INJ008,"TRAUMATIC BRAIN INJURY (TBI); CONCUSSION, INITIAL ENCOUNTER",,,055,HEAD TRAUMA W COMA >1 HR OR HEMORRHAGE,01,DISEASES AND DISORDERS OF THE NERVOUS SYSTEM,3,Major,Major,Medical,Medicare,Medicare,,,,true,19454.87,11162.04
Western NY,Erie,1401005,000210,Erie County Medical Center,70 or Older,143,F,White,Not Span/Hispanic,4,Emergency,Home or Self Care,2018,INJ008,"TRAUMATIC BRAIN INJURY (TBI); CONCUSSION, INITIAL ENCOUNTER",,,055,HEAD TRAUMA W COMA >1 HR OR HEMORRHAGE,01,DISEASES AND DISORDERS OF THE NERVOUS SYSTEM,3,Major,Major,Medical,Medicare,Private Health Insurance,,,,true,16739.4,6762.02
Long Island,Nassau,2951001,000541,North Shore University Hospital,50 to 69,113,M,White,Not Span/Hispanic,6,Urgent,Home or Self Care,2018,INJ008,"TRAUMATIC BRAIN INJURY (TBI); CONCUSSION, INITIAL ENCOUNTER",ESA003,MECHANICAL VENTILATION,055,HEAD TRAUMA W COMA >1 HR OR HEMORRHAGE,01,DISEASES AND DISORDERS OF THE NERVOUS SYSTEM,2,Moderate,Major,Medical,Medicaid,,,,,false,88052.48,15145.14
Central NY,Onondaga,3301007,000635,University Hospital SUNY Health Science Center,50 to 69,131,M,White,Not Span/Hispanic,7,Emergency,Home or Self Care,2018,INJ008,"TRAUMATIC BRAIN INJURY (TBI); CONCUSSION, INITIAL ENCOUNTER",MAM011,ELECTROENCEPHALOGRAM (EEG),055,HEAD TRAUMA W COMA >1 HR OR HEMORRHAGE,01,DISEASES AND DISORDERS OF THE NERVOUS SYSTEM,3,Major,Major,Medical,Medicare,,,,,true,105905.52,24218.39
New York City,Queens,7003000,001626,Elmhurst Hospital Center,30 to 49,112,M,Other Race,Spanish/Hispanic,3,Urgent,Home w/ Home Health Services,2018,INJ008,"TRAUMATIC BRAIN INJURY (TBI); CONCUSSION, INITIAL ENCOUNTER",,,055,HEAD TRAUMA W COMA >1 HR OR HEMORRHAGE,01,DISEASES AND DISORDERS OF THE NERVOUS SYSTEM,1,Minor,Minor,Medical,Medicaid,,,,,false,17073.17,10157.96
New York City,Manhattan,7002054,001437,New York-Presbyterian/Lower Manhattan Hospital,70 or Older,100,F,Other Race,Not Span/Hispanic,4,Emergency,Home w/ Home Health Services,2018,INJ008,"TRAUMATIC BRAIN INJURY (TBI); CONCUSSION, INITIAL ENCOUNTER",ADM021,"ADMINISTRATION OF THERAPEUTIC SUBSTANCES, NEC",055,HEAD TRAUMA W COMA >1 HR OR HEMORRHAGE,01,DISEASES AND DISORDERS OF THE NERVOUS SYSTEM,1,Minor,Moderate,Medical,Medicare,Medicare,Medicaid,,,true,91908.67,41812.51
New York City,Manhattan,7002054,001464,New York-Presbyterian Hospital - Columbia Presbyterian Center,50 to 69,100,F,Black/African American,Not Span/Hispanic,15,Emergency,Inpatient Rehabilitation Facility,2018,INJ008,"TRAUMATIC BRAIN INJURY (TBI); CONCUSSION, INITIAL ENCOUNTER",IMG002,FLUOROSCOPIC ANGIOGRAPHY (EXCLUDING CORONARY),055,HEAD TRAUMA W COMA >1 HR OR HEMORRHAGE,01,DISEASES AND DISORDERS OF THE NERVOUS SYSTEM,3,Major,Major,Medical,Private Health Insurance,Self-Pay,,,,true,270445.69,119067.77
New York City,Richmond,7004003,001740,Staten Island University Hosp-North,70 or Older,103,M,White,Not Span/Hispanic,4,Emergency,Hospice - Medical Facility,2018,INJ008,"TRAUMATIC BRAIN INJURY (TBI); CONCUSSION, INITIAL ENCOUNTER",SKB006,SKIN LACERATION REPAIR (EXCLUDING PERINEUM),055,HEAD TRAUMA W COMA >1 HR OR HEMORRHAGE,01,DISEASES AND DISORDERS OF THE NERVOUS SYSTEM,3,Major,Major,Medical,Medicare,Private Health Insurance,,,,true,33044.16,7593.2
New York City,Manhattan,7002009,001445,Harlem Hospital Center,30 to 49,100,M,Other Race,Spanish/Hispanic,17,Emergency,Skilled Nursing Home,2018,INJ008,"TRAUMATIC BRAIN INJURY (TBI); CONCUSSION, INITIAL ENCOUNTER",ADM001,TRANSFUSION OF BLOOD AND BLOOD PRODUCTS,055,HEAD TRAUMA W COMA >1 HR OR HEMORRHAGE,01,DISEASES AND DISORDERS OF THE NERVOUS SYSTEM,4,Extreme,Extreme,Medical,Medicaid,,,,,true,112790.21,83817.9