Hospital Service Area,Hospital County,Operating Certificate Number,Permanent Facility Id,Facility Name,Age Group,Zip Code - 3 digits,Gender,Race,Ethnicity,Length of Stay,Type of Admission,Patient Disposition,Discharge Year,CCS Diagnosis Code,CCS Diagnosis Description,CCS Procedure Code,CCS Procedure Description,APR DRG Code,APR DRG Description,APR MDC Code,APR MDC Description,APR Severity of Illness Code,APR Severity of Illness Description,APR Risk of Mortality,APR Medical Surgical Description,Payment Typology 1,Payment Typology 2,Payment Typology 3,Birth Weight,Abortion Edit Indicator,Emergency Department Indicator,Total Charges,Total Costs
New York City,Manhattan,7002001,001438,Bellevue Hospital Center,50 to 69,100,M,Black/African American,Not Span/Hispanic,14,Emergency,Inpatient Rehabilitation Facility,2019,INJ008,"TRAUMATIC BRAIN INJURY (TBI); CONCUSSION, INITIAL ENCOUNTER",ADM021,"ADMINISTRATION OF THERAPEUTIC SUBSTANCES, NEC",055,HEAD TRAUMA W COMA >1 HR OR HEMORRHAGE,01,DISEASES AND DISORDERS OF THE NERVOUS SYSTEM,2,Moderate,Minor,Medical,Medicaid,Medicaid,,,,true,79295.51,52699.8
New York City,Manhattan,7002001,001438,Bellevue Hospital Center,50 to 69,112,F,Other Race,Not Span/Hispanic,17,Emergency,Skilled Nursing Home,2019,INJ008,"TRAUMATIC BRAIN INJURY (TBI); CONCUSSION, INITIAL ENCOUNTER",MST028,"SUBCUTANEOUS TISSUE AND FASCIA PROCEDURES, NEC",055,HEAD TRAUMA W COMA >1 HR OR HEMORRHAGE,01,DISEASES AND DISORDERS OF THE NERVOUS SYSTEM,4,Extreme,Extreme,Medical,Medicare,Medicare,Medicaid,,,false,121566.76,80793.27
New York City,Manhattan,7002001,001438,Bellevue Hospital Center,30 to 49,104,M,Other Race,Not Span/Hispanic,3,Emergency,Left Against Medical Advice,2019,INJ008,"TRAUMATIC BRAIN INJURY (TBI); CONCUSSION, INITIAL ENCOUNTER",IMG007,COMPUTERIZED TOMOGRAPHY (CT) WITHOUT CONTRAST,055,HEAD TRAUMA W COMA >1 HR OR HEMORRHAGE,01,DISEASES AND DISORDERS OF THE NERVOUS SYSTEM,2,Moderate,Minor,Medical,Medicaid,Medicaid,Medicaid,,,false,20694.82,13753.78
New York City,Manhattan,7002001,001438,Bellevue Hospital Center,70 or Older,100,M,White,Not Span/Hispanic,15,Emergency,Home or Self Care,2019,INJ008,"TRAUMATIC BRAIN INJURY (TBI); CONCUSSION, INITIAL ENCOUNTER",ADM021,"ADMINISTRATION OF THERAPEUTIC SUBSTANCES, NEC",055,HEAD TRAUMA W COMA >1 HR OR HEMORRHAGE,01,DISEASES AND DISORDERS OF THE NERVOUS SYSTEM,2,Moderate,Minor,Medical,Medicare,Blue Cross/Blue Shield,,,,true,91174.6,60594.64
New York City,Manhattan,7002001,001438,Bellevue Hospital Center,18 to 29,100,M,Other Race,Not Span/Hispanic,4,Emergency,Home or Self Care,2019,INJ008,"TRAUMATIC BRAIN INJURY (TBI); CONCUSSION, INITIAL ENCOUNTER",IMG006,COMPUTERIZED TOMOGRAPHY (CT) WITH CONTRAST,055,HEAD TRAUMA W COMA >1 HR OR HEMORRHAGE,01,DISEASES AND DISORDERS OF THE NERVOUS SYSTEM,2,Moderate,Minor,Medical,Private Health Insurance,,,,,true,36170.51,24038.92
New York City,Manhattan,7002001,001438,Bellevue Hospital Center,50 to 69,100,M,Black/African American,Not Span/Hispanic,3,Emergency,Expired,2019,INJ008,"TRAUMATIC BRAIN INJURY (TBI); CONCUSSION, INITIAL ENCOUNTER",ADM021,"ADMINISTRATION OF THERAPEUTIC SUBSTANCES, NEC",055,HEAD TRAUMA W COMA >1 HR OR HEMORRHAGE,01,DISEASES AND DISORDERS OF THE NERVOUS SYSTEM,4,Extreme,Extreme,Medical,Medicare,Medicare,,,,false,19836,13183.01
New York City,Manhattan,7002001,001438,Bellevue Hospital Center,18 to 29,104,M,Black/African American,Spanish/Hispanic,5,Emergency,Home or Self Care,2019,INJ008,"TRAUMATIC BRAIN INJURY (TBI); CONCUSSION, INITIAL ENCOUNTER",MST015,CLOSED REDUCTION OF BONES AND JOINTS,055,HEAD TRAUMA W COMA >1 HR OR HEMORRHAGE,01,DISEASES AND DISORDERS OF THE NERVOUS SYSTEM,2,Moderate,Minor,Medical,Miscellaneous/Other,,,,,true,48388.77,32159.18
New York City,Manhattan,7002001,001438,Bellevue Hospital Center,50 to 69,112,F,Other Race,Not Span/Hispanic,3,Emergency,Home or Self Care,2019,INJ008,"TRAUMATIC BRAIN INJURY (TBI); CONCUSSION, INITIAL ENCOUNTER",IMG007,COMPUTERIZED TOMOGRAPHY (CT) WITHOUT CONTRAST,055,HEAD TRAUMA W COMA >1 HR OR HEMORRHAGE,01,DISEASES AND DISORDERS OF THE NERVOUS SYSTEM,1,Minor,Minor,Medical,Medicare,Medicare,,,,false,25479.12,16933.42
New York City,Manhattan,7002001,001438,Bellevue Hospital Center,50 to 69,100,M,Black/African American,Not Span/Hispanic,7,Emergency,Home or Self Care,2019,INJ008,"TRAUMATIC BRAIN INJURY (TBI); CONCUSSION, INITIAL ENCOUNTER",IMG007,COMPUTERIZED TOMOGRAPHY (CT) WITHOUT CONTRAST,055,HEAD TRAUMA W COMA >1 HR OR HEMORRHAGE,01,DISEASES AND DISORDERS OF THE NERVOUS SYSTEM,3,Major,Moderate,Medical,Medicaid,Medicaid,,,,false,44440.04,29534.85
New York City,Manhattan,7002001,001438,Bellevue Hospital Center,50 to 69,100,F,Other Race,Not Span/Hispanic,3,Emergency,Home or Self Care,2019,INJ008,"TRAUMATIC BRAIN INJURY (TBI); CONCUSSION, INITIAL ENCOUNTER",IMG007,COMPUTERIZED TOMOGRAPHY (CT) WITHOUT CONTRAST,055,HEAD TRAUMA W COMA >1 HR OR HEMORRHAGE,01,DISEASES AND DISORDERS OF THE NERVOUS SYSTEM,2,Moderate,Minor,Medical,Private Health Insurance,,,,,false,22400.88,14887.62
New York City,Manhattan,7002001,001438,Bellevue Hospital Center,30 to 49,112,M,White,Not Span/Hispanic,4,Emergency,Home or Self Care,2019,INJ008,"TRAUMATIC BRAIN INJURY (TBI); CONCUSSION, INITIAL ENCOUNTER",MST015,CLOSED REDUCTION OF BONES AND JOINTS,055,HEAD TRAUMA W COMA >1 HR OR HEMORRHAGE,01,DISEASES AND DISORDERS OF THE NERVOUS SYSTEM,2,Moderate,Minor,Medical,Miscellaneous/Other,Miscellaneous/Other,Private Health Insurance,,,true,40897.09,27180.21
New York City,Manhattan,7002001,001438,Bellevue Hospital Center,70 or Older,100,M,Other Race,Not Span/Hispanic,8,Emergency,Skilled Nursing Home,2019,INJ008,"TRAUMATIC BRAIN INJURY (TBI); CONCUSSION, INITIAL ENCOUNTER",ADM021,"ADMINISTRATION OF THERAPEUTIC SUBSTANCES, NEC",055,HEAD TRAUMA W COMA >1 HR OR HEMORRHAGE,01,DISEASES AND DISORDERS OF THE NERVOUS SYSTEM,2,Moderate,Major,Medical,Medicare,Medicare,Medicaid,,,true,44658.11,29679.78
New York City,Manhattan,7002001,001438,Bellevue Hospital Center,30 to 49,100,F,Other Race,Not Span/Hispanic,8,Emergency,Home or Self Care,2019,INJ008,"TRAUMATIC BRAIN INJURY (TBI); CONCUSSION, INITIAL ENCOUNTER",SKB006,SKIN LACERATION REPAIR (EXCLUDING PERINEUM),055,HEAD TRAUMA W COMA >1 HR OR HEMORRHAGE,01,DISEASES AND DISORDERS OF THE NERVOUS SYSTEM,2,Moderate,Minor,Medical,Miscellaneous/Other,Private Health Insurance,Medicaid,,,true,73691.76,48975.54
New York City,Manhattan,7002001,001438,Bellevue Hospital Center,18 to 29,104,F,Other Race,Not Span/Hispanic,3,Emergency,Home w/ Home Health Services,2019,INJ008,"TRAUMATIC BRAIN INJURY (TBI); CONCUSSION, INITIAL ENCOUNTER",RES007,AIRWAY INTUBATION,055,HEAD TRAUMA W COMA >1 HR OR HEMORRHAGE,01,DISEASES AND DISORDERS OF THE NERVOUS SYSTEM,3,Major,Extreme,Medical,Miscellaneous/Other,,,,,true,34677.56,23046.71
New York City,Manhattan,7002001,001438,Bellevue Hospital Center,70 or Older,100,F,White,Not Span/Hispanic,8,Emergency,Another Type Not Listed,2019,INJ008,"TRAUMATIC BRAIN INJURY (TBI); CONCUSSION, INITIAL ENCOUNTER",IMG007,COMPUTERIZED TOMOGRAPHY (CT) WITHOUT CONTRAST,055,HEAD TRAUMA W COMA >1 HR OR HEMORRHAGE,01,DISEASES AND DISORDERS OF THE NERVOUS SYSTEM,3,Major,Major,Medical,Medicare,Private Health Insurance,,,,true,50803.11,33763.75
New York City,Manhattan,7002001,001438,Bellevue Hospital Center,18 to 29,100,F,Other Race,Spanish/Hispanic,4,Emergency,Home or Self Care,2019,INJ008,"TRAUMATIC BRAIN INJURY (TBI); CONCUSSION, INITIAL ENCOUNTER",MST015,CLOSED REDUCTION OF BONES AND JOINTS,055,HEAD TRAUMA W COMA >1 HR OR HEMORRHAGE,01,DISEASES AND DISORDERS OF THE NERVOUS SYSTEM,2,Moderate,Minor,Medical,Medicaid,,,,,true,42375.77,28162.94
New York City,Manhattan,7002001,001438,Bellevue Hospital Center,70 or Older,112,F,White,Not Span/Hispanic,102,Emergency,Home or Self Care,2019,INJ008,"TRAUMATIC BRAIN INJURY (TBI); CONCUSSION, INITIAL ENCOUNTER",ADM021,"ADMINISTRATION OF THERAPEUTIC SUBSTANCES, NEC",055,HEAD TRAUMA W COMA >1 HR OR HEMORRHAGE,01,DISEASES AND DISORDERS OF THE NERVOUS SYSTEM,3,Major,Major,Medical,Medicaid,Medicaid,,,,false,517266.54,343775.34
New York City,Manhattan,7002001,001438,Bellevue Hospital Center,30 to 49,103,M,White,Not Span/Hispanic,1,Emergency,Home or Self Care,2019,INJ008,"TRAUMATIC BRAIN INJURY (TBI); CONCUSSION, INITIAL ENCOUNTER",SKB006,SKIN LACERATION REPAIR (EXCLUDING PERINEUM),055,HEAD TRAUMA W COMA >1 HR OR HEMORRHAGE,01,DISEASES AND DISORDERS OF THE NERVOUS SYSTEM,2,Moderate,Minor,Medical,Self-Pay,,,,,true,18328.44,12181.08
New York City,Manhattan,7002001,001438,Bellevue Hospital Center,0 to 17,112,M,Black/African American,Not Span/Hispanic,6,Emergency,Home or Self Care,2019,INJ008,"TRAUMATIC BRAIN INJURY (TBI); CONCUSSION, INITIAL ENCOUNTER",IMG005,MAGNETIC RESONANCE IMAGING (MRI),055,HEAD TRAUMA W COMA >1 HR OR HEMORRHAGE,01,DISEASES AND DISORDERS OF THE NERVOUS SYSTEM,3,Major,Major,Medical,Medicaid,,,,,true,47091.12,31296.76
New York City,Manhattan,7002001,001438,Bellevue Hospital Center,70 or Older,100,F,Other Race,Not Span/Hispanic,10,Emergency,Skilled Nursing Home,2019,INJ008,"TRAUMATIC BRAIN INJURY (TBI); CONCUSSION, INITIAL ENCOUNTER",MST015,CLOSED REDUCTION OF BONES AND JOINTS,055,HEAD TRAUMA W COMA >1 HR OR HEMORRHAGE,01,DISEASES AND DISORDERS OF THE NERVOUS SYSTEM,2,Moderate,Moderate,Medical,Medicare,,,,,false,61225.02,40690.15
New York City,Manhattan,7002001,001438,Bellevue Hospital Center,0 to 17,100,M,Other Race,Not Span/Hispanic,1,Emergency,Home or Self Care,2019,INJ001,"FRACTURE OF HEAD AND NECK, INITIAL ENCOUNTER",IMG007,COMPUTERIZED TOMOGRAPHY (CT) WITHOUT CONTRAST,055,HEAD TRAUMA W COMA >1 HR OR HEMORRHAGE,01,DISEASES AND DISORDERS OF THE NERVOUS SYSTEM,1,Minor,Minor,Medical,Medicaid,Medicaid,,,,true,8581.95,5703.56
New York City,Manhattan,7002001,001438,Bellevue Hospital Center,0 to 17,112,F,Other Race,Spanish/Hispanic,1,Urgent,Home or Self Care,2019,INJ001,"FRACTURE OF HEAD AND NECK, INITIAL ENCOUNTER",,,055,HEAD TRAUMA W COMA >1 HR OR HEMORRHAGE,01,DISEASES AND DISORDERS OF THE NERVOUS SYSTEM,1,Minor,Minor,Medical,Medicaid,,,,,false,7027.77,4670.66
New York City,Manhattan,7002001,001438,Bellevue Hospital Center,30 to 49,100,M,Other Race,Not Span/Hispanic,3,Emergency,Home or Self Care,2019,INJ008,"TRAUMATIC BRAIN INJURY (TBI); CONCUSSION, INITIAL ENCOUNTER",IMG007,COMPUTERIZED TOMOGRAPHY (CT) WITHOUT CONTRAST,055,HEAD TRAUMA W COMA >1 HR OR HEMORRHAGE,01,DISEASES AND DISORDERS OF THE NERVOUS SYSTEM,2,Moderate,Minor,Medical,Blue Cross/Blue Shield,,,,,true,46153.33,30673.5
New York City,Manhattan,7002001,001438,Bellevue Hospital Center,30 to 49,100,M,Other Race,Not Span/Hispanic,12,Emergency,Home or Self Care,2019,INJ008,"TRAUMATIC BRAIN INJURY (TBI); CONCUSSION, INITIAL ENCOUNTER",SKB006,SKIN LACERATION REPAIR (EXCLUDING PERINEUM),055,HEAD TRAUMA W COMA >1 HR OR HEMORRHAGE,01,DISEASES AND DISORDERS OF THE NERVOUS SYSTEM,3,Major,Minor,Medical,Medicaid,Medicaid,,,,true,76143.18,50604.76
New York City,Manhattan,7002001,001438,Bellevue Hospital Center,70 or Older,100,M,Other Race,Not Span/Hispanic,4,Emergency,Inpatient Rehabilitation Facility,2019,INJ008,"TRAUMATIC BRAIN INJURY (TBI); CONCUSSION, INITIAL ENCOUNTER",IMG007,COMPUTERIZED TOMOGRAPHY (CT) WITHOUT CONTRAST,055,HEAD TRAUMA W COMA >1 HR OR HEMORRHAGE,01,DISEASES AND DISORDERS OF THE NERVOUS SYSTEM,2,Moderate,Minor,Medical,Medicare,Blue Cross/Blue Shield,,,,true,37249.26,24755.86
New York City,Manhattan,7002001,001438,Bellevue Hospital Center,50 to 69,100,M,White,Not Span/Hispanic,1,Emergency,Home or Self Care,2019,INJ008,"TRAUMATIC BRAIN INJURY (TBI); CONCUSSION, INITIAL ENCOUNTER",IMG007,COMPUTERIZED TOMOGRAPHY (CT) WITHOUT CONTRAST,055,HEAD TRAUMA W COMA >1 HR OR HEMORRHAGE,01,DISEASES AND DISORDERS OF THE NERVOUS SYSTEM,1,Minor,Minor,Medical,Medicaid,Medicaid,,,,true,10604.22,7047.56
New York City,Manhattan,7002001,001438,Bellevue Hospital Center,70 or Older,100,F,Other Race,Not Span/Hispanic,4,Emergency,Home w/ Home Health Services,2019,INJ008,"TRAUMATIC BRAIN INJURY (TBI); CONCUSSION, INITIAL ENCOUNTER",IMG007,COMPUTERIZED TOMOGRAPHY (CT) WITHOUT CONTRAST,055,HEAD TRAUMA W COMA >1 HR OR HEMORRHAGE,01,DISEASES AND DISORDERS OF THE NERVOUS SYSTEM,2,Moderate,Moderate,Medical,Medicare,Medicare,Medicaid,,,true,40390.24,26843.35
New York City,Manhattan,7002001,001438,Bellevue Hospital Center,50 to 69,116,M,White,Not Span/Hispanic,1,Emergency,Home or Self Care,2019,INJ008,"TRAUMATIC BRAIN INJURY (TBI); CONCUSSION, INITIAL ENCOUNTER",IMG007,COMPUTERIZED TOMOGRAPHY (CT) WITHOUT CONTRAST,055,HEAD TRAUMA W COMA >1 HR OR HEMORRHAGE,01,DISEASES AND DISORDERS OF THE NERVOUS SYSTEM,3,Major,Moderate,Medical,Medicaid,Medicaid,,,,true,9632.21,6401.57
New York City,Manhattan,7002001,001438,Bellevue Hospital Center,50 to 69,100,F,Other Race,Not Span/Hispanic,1,Emergency,Home or Self Care,2019,INJ008,"TRAUMATIC BRAIN INJURY (TBI); CONCUSSION, INITIAL ENCOUNTER",ADM007,INTRAVENOUS INDUCTION OF LABOR,055,HEAD TRAUMA W COMA >1 HR OR HEMORRHAGE,01,DISEASES AND DISORDERS OF THE NERVOUS SYSTEM,2,Moderate,Minor,Medical,Self-Pay,,,,,false,7141.11,4745.98
New York City,Manhattan,7002001,001438,Bellevue Hospital Center,50 to 69,100,M,White,Not Span/Hispanic,13,Emergency,Another Type Not Listed,2019,INJ008,"TRAUMATIC BRAIN INJURY (TBI); CONCUSSION, INITIAL ENCOUNTER",ADM020,"ADMINISTRATION OF DIAGNOSTIC SUBSTANCES, NEC",055,HEAD TRAUMA W COMA >1 HR OR HEMORRHAGE,01,DISEASES AND DISORDERS OF THE NERVOUS SYSTEM,3,Major,Moderate,Medical,Private Health Insurance,Medicaid,,,,true,93080.44,61861.26
New York City,Manhattan,7002001,001438,Bellevue Hospital Center,50 to 69,100,M,Black/African American,Not Span/Hispanic,8,Emergency,Skilled Nursing Home,2019,INJ008,"TRAUMATIC BRAIN INJURY (TBI); CONCUSSION, INITIAL ENCOUNTER",SUD001,SUBSTANCE USE DETOXIFICATION,055,HEAD TRAUMA W COMA >1 HR OR HEMORRHAGE,01,DISEASES AND DISORDERS OF THE NERVOUS SYSTEM,3,Major,Moderate,Medical,Medicaid,Medicaid,,,,true,63730.16,42355.06
New York City,Manhattan,7002001,001438,Bellevue Hospital Center,30 to 49,112,M,Other Race,Spanish/Hispanic,4,Emergency,Home or Self Care,2019,INJ008,"TRAUMATIC BRAIN INJURY (TBI); CONCUSSION, INITIAL ENCOUNTER",IMG005,MAGNETIC RESONANCE IMAGING (MRI),055,HEAD TRAUMA W COMA >1 HR OR HEMORRHAGE,01,DISEASES AND DISORDERS OF THE NERVOUS SYSTEM,2,Moderate,Moderate,Medical,Self-Pay,,,,,false,35183.34,23382.85
New York City,Manhattan,7002001,001438,Bellevue Hospital Center,18 to 29,,M,Other Race,Not Span/Hispanic,3,Emergency,Home or Self Care,2019,INJ008,"TRAUMATIC BRAIN INJURY (TBI); CONCUSSION, INITIAL ENCOUNTER",ADM021,"ADMINISTRATION OF THERAPEUTIC SUBSTANCES, NEC",055,HEAD TRAUMA W COMA >1 HR OR HEMORRHAGE,01,DISEASES AND DISORDERS OF THE NERVOUS SYSTEM,2,Moderate,Minor,Medical,Miscellaneous/Other,,,,,true,33554.23,22300.14
New York City,Manhattan,7002001,001438,Bellevue Hospital Center,30 to 49,103,M,White,Not Span/Hispanic,5,Emergency,Left Against Medical Advice,2019,INJ008,"TRAUMATIC BRAIN INJURY (TBI); CONCUSSION, INITIAL ENCOUNTER",IMG007,COMPUTERIZED TOMOGRAPHY (CT) WITHOUT CONTRAST,055,HEAD TRAUMA W COMA >1 HR OR HEMORRHAGE,01,DISEASES AND DISORDERS OF THE NERVOUS SYSTEM,3,Major,Major,Medical,Self-Pay,,,,,true,52494.31,34887.72
New York City,Manhattan,7002001,001438,Bellevue Hospital Center,70 or Older,100,M,White,Not Span/Hispanic,1,Emergency,Home or Self Care,2019,INJ008,"TRAUMATIC BRAIN INJURY (TBI); CONCUSSION, INITIAL ENCOUNTER",ADM010,VACCINATIONS,055,HEAD TRAUMA W COMA >1 HR OR HEMORRHAGE,01,DISEASES AND DISORDERS OF THE NERVOUS SYSTEM,2,Moderate,Moderate,Medical,Medicare,Private Health Insurance,,,,true,11259.69,7483.19
New York City,Manhattan,7002001,001438,Bellevue Hospital Center,70 or Older,112,M,Other Race,Spanish/Hispanic,12,Emergency,Home or Self Care,2019,INJ008,"TRAUMATIC BRAIN INJURY (TBI); CONCUSSION, INITIAL ENCOUNTER",ADM001,TRANSFUSION OF BLOOD AND BLOOD PRODUCTS,055,HEAD TRAUMA W COMA >1 HR OR HEMORRHAGE,01,DISEASES AND DISORDERS OF THE NERVOUS SYSTEM,4,Extreme,Extreme,Medical,Medicare,,,,,true,74062.82,49222.15
New York City,Manhattan,7002001,001438,Bellevue Hospital Center,30 to 49,112,M,White,Not Span/Hispanic,3,Emergency,Home or Self Care,2019,INJ001,"FRACTURE OF HEAD AND NECK, INITIAL ENCOUNTER",IMG007,COMPUTERIZED TOMOGRAPHY (CT) WITHOUT CONTRAST,055,HEAD TRAUMA W COMA >1 HR OR HEMORRHAGE,01,DISEASES AND DISORDERS OF THE NERVOUS SYSTEM,2,Moderate,Minor,Medical,Private Health Insurance,,,,,true,31775.09,21117.72
New York City,Manhattan,7002001,001438,Bellevue Hospital Center,30 to 49,100,M,Black/African American,Not Span/Hispanic,1,Emergency,Left Against Medical Advice,2019,INJ008,"TRAUMATIC BRAIN INJURY (TBI); CONCUSSION, INITIAL ENCOUNTER",IMG007,COMPUTERIZED TOMOGRAPHY (CT) WITHOUT CONTRAST,055,HEAD TRAUMA W COMA >1 HR OR HEMORRHAGE,01,DISEASES AND DISORDERS OF THE NERVOUS SYSTEM,1,Minor,Minor,Medical,Self-Pay,,,,,true,11334.09,7532.64
New York City,Manhattan,7002001,001438,Bellevue Hospital Center,50 to 69,100,F,Other Race,Not Span/Hispanic,8,Emergency,Inpatient Rehabilitation Facility,2019,INJ008,"TRAUMATIC BRAIN INJURY (TBI); CONCUSSION, INITIAL ENCOUNTER",IMG007,COMPUTERIZED TOMOGRAPHY (CT) WITHOUT CONTRAST,055,HEAD TRAUMA W COMA >1 HR OR HEMORRHAGE,01,DISEASES AND DISORDERS OF THE NERVOUS SYSTEM,4,Extreme,Major,Medical,Blue Cross/Blue Shield,,,,,false,81732.43,54319.37
New York City,Manhattan,7002001,001438,Bellevue Hospital Center,70 or Older,100,M,Other Race,Not Span/Hispanic,9,Emergency,Home w/ Home Health Services,2019,INJ008,"TRAUMATIC BRAIN INJURY (TBI); CONCUSSION, INITIAL ENCOUNTER",IMG007,COMPUTERIZED TOMOGRAPHY (CT) WITHOUT CONTRAST,055,HEAD TRAUMA W COMA >1 HR OR HEMORRHAGE,01,DISEASES AND DISORDERS OF THE NERVOUS SYSTEM,3,Major,Moderate,Medical,Medicare,Medicare,,,,true,80126.35,53251.97
New York City,Manhattan,7002001,001438,Bellevue Hospital Center,18 to 29,100,M,Other Race,Not Span/Hispanic,3,Emergency,Home or Self Care,2019,INJ008,"TRAUMATIC BRAIN INJURY (TBI); CONCUSSION, INITIAL ENCOUNTER",IMG007,COMPUTERIZED TOMOGRAPHY (CT) WITHOUT CONTRAST,055,HEAD TRAUMA W COMA >1 HR OR HEMORRHAGE,01,DISEASES AND DISORDERS OF THE NERVOUS SYSTEM,1,Minor,Minor,Medical,Miscellaneous/Other,Private Health Insurance,,,,true,28323.18,18823.59
New York City,Manhattan,7002001,001438,Bellevue Hospital Center,70 or Older,100,F,Other Race,Not Span/Hispanic,2,Emergency,Home or Self Care,2019,INJ008,"TRAUMATIC BRAIN INJURY (TBI); CONCUSSION, INITIAL ENCOUNTER",IMG007,COMPUTERIZED TOMOGRAPHY (CT) WITHOUT CONTRAST,055,HEAD TRAUMA W COMA >1 HR OR HEMORRHAGE,01,DISEASES AND DISORDERS OF THE NERVOUS SYSTEM,2,Moderate,Moderate,Medical,Medicare,Medicare,,,,true,15910.9,10574.38
New York City,Manhattan,7002001,001438,Bellevue Hospital Center,50 to 69,112,M,White,Not Span/Hispanic,7,Emergency,Psychiatric Hospital or Unit of Hosp,2019,INJ008,"TRAUMATIC BRAIN INJURY (TBI); CONCUSSION, INITIAL ENCOUNTER",ADM021,"ADMINISTRATION OF THERAPEUTIC SUBSTANCES, NEC",055,HEAD TRAUMA W COMA >1 HR OR HEMORRHAGE,01,DISEASES AND DISORDERS OF THE NERVOUS SYSTEM,2,Moderate,Minor,Medical,Medicare,Private Health Insurance,,,,false,38710,25726.67
New York City,Manhattan,7002001,001438,Bellevue Hospital Center,30 to 49,100,M,Other Race,Not Span/Hispanic,1,Emergency,Home or Self Care,2019,INJ008,"TRAUMATIC BRAIN INJURY (TBI); CONCUSSION, INITIAL ENCOUNTER",ADM021,"ADMINISTRATION OF THERAPEUTIC SUBSTANCES, NEC",055,HEAD TRAUMA W COMA >1 HR OR HEMORRHAGE,01,DISEASES AND DISORDERS OF THE NERVOUS SYSTEM,2,Moderate,Minor,Medical,Medicaid,Medicaid,,,,false,9593.39,6375.77
New York City,Manhattan,7002001,001438,Bellevue Hospital Center,18 to 29,112,M,Black/African American,Not Span/Hispanic,1,Emergency,Home or Self Care,2019,INJ008,"TRAUMATIC BRAIN INJURY (TBI); CONCUSSION, INITIAL ENCOUNTER",SKB006,SKIN LACERATION REPAIR (EXCLUDING PERINEUM),055,HEAD TRAUMA W COMA >1 HR OR HEMORRHAGE,01,DISEASES AND DISORDERS OF THE NERVOUS SYSTEM,2,Moderate,Minor,Medical,Medicaid,,,,,true,16617.42,11043.94
New York City,Manhattan,7002001,001438,Bellevue Hospital Center,70 or Older,100,F,Other Race,Not Span/Hispanic,7,Emergency,Home w/ Home Health Services,2019,INJ008,"TRAUMATIC BRAIN INJURY (TBI); CONCUSSION, INITIAL ENCOUNTER",IMG007,COMPUTERIZED TOMOGRAPHY (CT) WITHOUT CONTRAST,055,HEAD TRAUMA W COMA >1 HR OR HEMORRHAGE,01,DISEASES AND DISORDERS OF THE NERVOUS SYSTEM,3,Major,Major,Medical,Medicare,Medicaid,,,,true,58457.94,38851.15
New York City,Manhattan,7002001,001438,Bellevue Hospital Center,30 to 49,114,M,White,Not Span/Hispanic,3,Emergency,Home or Self Care,2019,INJ008,"TRAUMATIC BRAIN INJURY (TBI); CONCUSSION, INITIAL ENCOUNTER",SKB006,SKIN LACERATION REPAIR (EXCLUDING PERINEUM),055,HEAD TRAUMA W COMA >1 HR OR HEMORRHAGE,01,DISEASES AND DISORDERS OF THE NERVOUS SYSTEM,1,Minor,Minor,Medical,Medicaid,Medicaid,,,,true,25001.34,16615.89
New York City,Manhattan,7002001,001438,Bellevue Hospital Center,30 to 49,100,M,Other Race,Spanish/Hispanic,1,Emergency,Home or Self Care,2019,INJ008,"TRAUMATIC BRAIN INJURY (TBI); CONCUSSION, INITIAL ENCOUNTER",IMG007,COMPUTERIZED TOMOGRAPHY (CT) WITHOUT CONTRAST,055,HEAD TRAUMA W COMA >1 HR OR HEMORRHAGE,01,DISEASES AND DISORDERS OF THE NERVOUS SYSTEM,1,Minor,Minor,Medical,Medicaid,,,,,true,20777.86,13808.97
New York City,Manhattan,7002001,001438,Bellevue Hospital Center,70 or Older,100,M,Other Race,Unknown,9,Urgent,Home w/ Home Health Services,2019,INJ008,"TRAUMATIC BRAIN INJURY (TBI); CONCUSSION, INITIAL ENCOUNTER",ADM021,"ADMINISTRATION OF THERAPEUTIC SUBSTANCES, NEC",055,HEAD TRAUMA W COMA >1 HR OR HEMORRHAGE,01,DISEASES AND DISORDERS OF THE NERVOUS SYSTEM,2,Moderate,Major,Medical,Medicare,Private Health Insurance,,,,false,62113.58,41280.69
New York City,Manhattan,7002001,001438,Bellevue Hospital Center,50 to 69,100,M,Other Race,Not Span/Hispanic,8,Emergency,Inpatient Rehabilitation Facility,2019,INJ008,"TRAUMATIC BRAIN INJURY (TBI); CONCUSSION, INITIAL ENCOUNTER",IMG007,COMPUTERIZED TOMOGRAPHY (CT) WITHOUT CONTRAST,055,HEAD TRAUMA W COMA >1 HR OR HEMORRHAGE,01,DISEASES AND DISORDERS OF THE NERVOUS SYSTEM,2,Moderate,Minor,Medical,Medicare,,,,,true,63280.16,42055.99
New York City,Manhattan,7002001,001438,Bellevue Hospital Center,70 or Older,100,M,Other Race,Not Span/Hispanic,10,Emergency,Medicaid Cert Nursing Facility,2019,INJ008,"TRAUMATIC BRAIN INJURY (TBI); CONCUSSION, INITIAL ENCOUNTER",ADM015,ADMINISTRATION OF ANTIBIOTICS,055,HEAD TRAUMA W COMA >1 HR OR HEMORRHAGE,01,DISEASES AND DISORDERS OF THE NERVOUS SYSTEM,4,Extreme,Extreme,Medical,Medicare,Medicaid,,,,true,73065.73,48559.48
New York City,Manhattan,7002001,001438,Bellevue Hospital Center,50 to 69,100,M,Black/African American,Not Span/Hispanic,11,Emergency,Inpatient Rehabilitation Facility,2019,INJ008,"TRAUMATIC BRAIN INJURY (TBI); CONCUSSION, INITIAL ENCOUNTER",ADM021,"ADMINISTRATION OF THERAPEUTIC SUBSTANCES, NEC",055,HEAD TRAUMA W COMA >1 HR OR HEMORRHAGE,01,DISEASES AND DISORDERS OF THE NERVOUS SYSTEM,2,Moderate,Minor,Medical,Medicaid,,,,,true,81202.56,53967.22
New York City,Manhattan,7002001,001438,Bellevue Hospital Center,70 or Older,104,M,Other Race,Spanish/Hispanic,5,Emergency,Home or Self Care,2019,INJ008,"TRAUMATIC BRAIN INJURY (TBI); CONCUSSION, INITIAL ENCOUNTER",IMG007,COMPUTERIZED TOMOGRAPHY (CT) WITHOUT CONTRAST,055,HEAD TRAUMA W COMA >1 HR OR HEMORRHAGE,01,DISEASES AND DISORDERS OF THE NERVOUS SYSTEM,2,Moderate,Minor,Medical,Medicare,,,,,true,45452.36,30207.64
New York City,Manhattan,7002001,001438,Bellevue Hospital Center,70 or Older,100,M,Other Race,Spanish/Hispanic,9,Urgent,Hospice - Home,2019,INJ008,"TRAUMATIC BRAIN INJURY (TBI); CONCUSSION, INITIAL ENCOUNTER",ADM017,ADMINISTRATION OF NUTRITIONAL AND ELECTROLYTIC SUBSTANCES,055,HEAD TRAUMA W COMA >1 HR OR HEMORRHAGE,01,DISEASES AND DISORDERS OF THE NERVOUS SYSTEM,2,Moderate,Major,Medical,Medicare,Medicaid,,,,false,79067.02,52547.94