Hospital Service Area,Hospital County,Operating Certificate Number,Permanent Facility Id,Facility Name,Age Group,Zip Code - 3 digits,Gender,Race,Ethnicity,Length of Stay,Type of Admission,Patient Disposition,Discharge Year,CCS Diagnosis Code,CCS Diagnosis Description,CCS Procedure Code,CCS Procedure Description,APR DRG Code,APR DRG Description,APR MDC Code,APR MDC Description,APR Severity of Illness Code,APR Severity of Illness Description,APR Risk of Mortality,APR Medical Surgical Description,Payment Typology 1,Payment Typology 2,Payment Typology 3,Birth Weight,Abortion Edit Indicator,Emergency Department Indicator,Total Charges,Total Costs
Long Island,Nassau,2908000,000511,NYU Langone Hospital-Long Island,70 or Older,118,F,White,Not Span/Hispanic,1,Emergency,Home w/ Home Health Services,2020,INJ008,"TRAUMATIC BRAIN INJURY (TBI); CONCUSSION, INITIAL ENCOUNTER",,,055,HEAD TRAUMA W COMA >1 HR OR HEMORRHAGE,01,DISEASES AND DISORDERS OF THE NERVOUS SYSTEM,1,Minor,Moderate,Medical,Medicare,Medicare,,,,Y,86838.03,13694.05
Long Island,Nassau,2908000,000511,NYU Langone Hospital-Long Island,30 to 49,115,M,White,Spanish/Hispanic,2,Emergency,Home or Self Care,2020,INJ008,"TRAUMATIC BRAIN INJURY (TBI); CONCUSSION, INITIAL ENCOUNTER",,,055,HEAD TRAUMA W COMA >1 HR OR HEMORRHAGE,01,DISEASES AND DISORDERS OF THE NERVOUS SYSTEM,1,Minor,Minor,Medical,Medicaid,,,,,Y,71717.08,15274.44
Long Island,Nassau,2908000,000511,NYU Langone Hospital-Long Island,70 or Older,115,M,White,Not Span/Hispanic,5,Emergency,Skilled Nursing Home,2020,INJ008,"TRAUMATIC BRAIN INJURY (TBI); CONCUSSION, INITIAL ENCOUNTER",,,055,HEAD TRAUMA W COMA >1 HR OR HEMORRHAGE,01,DISEASES AND DISORDERS OF THE NERVOUS SYSTEM,1,Minor,Moderate,Medical,Medicare,Blue Cross/Blue Shield,,,,Y,94283.88,19681.8
Long Island,Nassau,2908000,000511,NYU Langone Hospital-Long Island,50 to 69,115,F,White,Unknown,1,Emergency,Home or Self Care,2020,INJ008,"TRAUMATIC BRAIN INJURY (TBI); CONCUSSION, INITIAL ENCOUNTER",SKB006,SKIN LACERATION REPAIR (EXCLUDING PERINEUM),055,HEAD TRAUMA W COMA >1 HR OR HEMORRHAGE,01,DISEASES AND DISORDERS OF THE NERVOUS SYSTEM,1,Minor,Minor,Medical,Private Health Insurance,,,,,Y,43851.9,10235.39
Long Island,Nassau,2908000,000511,NYU Langone Hospital-Long Island,30 to 49,OOS,M,Other Race,Not Span/Hispanic,4,Emergency,Home or Self Care,2020,INJ008,"TRAUMATIC BRAIN INJURY (TBI); CONCUSSION, INITIAL ENCOUNTER",,,055,HEAD TRAUMA W COMA >1 HR OR HEMORRHAGE,01,DISEASES AND DISORDERS OF THE NERVOUS SYSTEM,2,Moderate,Minor,Medical,Miscellaneous/Other,,,,,Y,143114.5,20933.5
Long Island,Nassau,2908000,000511,NYU Langone Hospital-Long Island,30 to 49,OOS,M,Other Race,Not Span/Hispanic,6,Emergency,Home or Self Care,2020,INJ008,"TRAUMATIC BRAIN INJURY (TBI); CONCUSSION, INITIAL ENCOUNTER",,,055,HEAD TRAUMA W COMA >1 HR OR HEMORRHAGE,01,DISEASES AND DISORDERS OF THE NERVOUS SYSTEM,2,Moderate,Minor,Medical,Miscellaneous/Other,,,,,Y,110244.63,30637.11
Long Island,Nassau,2908000,000511,NYU Langone Hospital-Long Island,50 to 69,115,M,White,Not Span/Hispanic,4,Trauma,Home or Self Care,2020,INJ008,"TRAUMATIC BRAIN INJURY (TBI); CONCUSSION, INITIAL ENCOUNTER",SUD004,COUNSELING FOR SUBSTANCE USE,055,HEAD TRAUMA W COMA >1 HR OR HEMORRHAGE,01,DISEASES AND DISORDERS OF THE NERVOUS SYSTEM,2,Moderate,Moderate,Medical,Private Health Insurance,,,,,Y,125085.58,26210.16
Long Island,Nassau,2908000,000511,NYU Langone Hospital-Long Island,70 or Older,110,F,White,Not Span/Hispanic,4,Emergency,Home w/ Home Health Services,2020,INJ008,"TRAUMATIC BRAIN INJURY (TBI); CONCUSSION, INITIAL ENCOUNTER",,,055,HEAD TRAUMA W COMA >1 HR OR HEMORRHAGE,01,DISEASES AND DISORDERS OF THE NERVOUS SYSTEM,2,Moderate,Moderate,Medical,Medicare,Private Health Insurance,,,,Y,72219.26,20137.95
Long Island,Nassau,2908000,000511,NYU Langone Hospital-Long Island,70 or Older,117,F,White,Not Span/Hispanic,1,Trauma,Hospice - Medical Facility,2020,INJ008,"TRAUMATIC BRAIN INJURY (TBI); CONCUSSION, INITIAL ENCOUNTER",,,055,HEAD TRAUMA W COMA >1 HR OR HEMORRHAGE,01,DISEASES AND DISORDERS OF THE NERVOUS SYSTEM,2,Moderate,Moderate,Medical,Medicare,,,,,Y,44767.66,11329.82
Long Island,Nassau,2908000,000511,NYU Langone Hospital-Long Island,50 to 69,110,M,White,Not Span/Hispanic,3,Emergency,Home w/ Home Health Services,2020,INJ008,"TRAUMATIC BRAIN INJURY (TBI); CONCUSSION, INITIAL ENCOUNTER",ADM005,ADMINISTRATION OF THROMBOLYTICS AND PLATELET INHIBITORS,055,HEAD TRAUMA W COMA >1 HR OR HEMORRHAGE,01,DISEASES AND DISORDERS OF THE NERVOUS SYSTEM,3,Major,Major,Medical,Private Health Insurance,,,,,Y,135286.96,29576.65
Long Island,Nassau,2908000,000511,NYU Langone Hospital-Long Island,70 or Older,110,F,White,Not Span/Hispanic,9,Emergency,Home w/ Home Health Services,2020,INJ008,"TRAUMATIC BRAIN INJURY (TBI); CONCUSSION, INITIAL ENCOUNTER",,,055,HEAD TRAUMA W COMA >1 HR OR HEMORRHAGE,01,DISEASES AND DISORDERS OF THE NERVOUS SYSTEM,3,Major,Major,Medical,Medicare,Blue Cross/Blue Shield,,,,Y,113614.56,35135.81
Long Island,Nassau,2908000,000511,NYU Langone Hospital-Long Island,70 or Older,115,F,White,Unknown,21,Emergency,Skilled Nursing Home,2020,INJ008,"TRAUMATIC BRAIN INJURY (TBI); CONCUSSION, INITIAL ENCOUNTER",IMG002,FLUOROSCOPIC ANGIOGRAPHY (EXCLUDING CORONARY),055,HEAD TRAUMA W COMA >1 HR OR HEMORRHAGE,01,DISEASES AND DISORDERS OF THE NERVOUS SYSTEM,4,Extreme,Extreme,Medical,Medicare,Medicare,,,,Y,566253.38,135158.07
Long Island,Nassau,2908000,000511,NYU Langone Hospital-Long Island,70 or Older,115,M,White,Not Span/Hispanic,4,Emergency,Skilled Nursing Home,2020,INJ008,"TRAUMATIC BRAIN INJURY (TBI); CONCUSSION, INITIAL ENCOUNTER",,,055,HEAD TRAUMA W COMA >1 HR OR HEMORRHAGE,01,DISEASES AND DISORDERS OF THE NERVOUS SYSTEM,1,Minor,Minor,Medical,Medicare,Private Health Insurance,Blue Cross/Blue Shield,,,Y,72940.9,22362.24
Long Island,Nassau,2908000,000511,NYU Langone Hospital-Long Island,70 or Older,115,F,White,Not Span/Hispanic,6,Trauma,Skilled Nursing Home,2020,INJ008,"TRAUMATIC BRAIN INJURY (TBI); CONCUSSION, INITIAL ENCOUNTER",SKB006,SKIN LACERATION REPAIR (EXCLUDING PERINEUM),055,HEAD TRAUMA W COMA >1 HR OR HEMORRHAGE,01,DISEASES AND DISORDERS OF THE NERVOUS SYSTEM,2,Moderate,Moderate,Medical,Medicare,,,,,Y,94956.31,25655.46
Long Island,Nassau,2908000,000511,NYU Langone Hospital-Long Island,70 or Older,115,M,White,Not Span/Hispanic,3,Emergency,Skilled Nursing Home,2020,INJ008,"TRAUMATIC BRAIN INJURY (TBI); CONCUSSION, INITIAL ENCOUNTER",,,055,HEAD TRAUMA W COMA >1 HR OR HEMORRHAGE,01,DISEASES AND DISORDERS OF THE NERVOUS SYSTEM,2,Moderate,Moderate,Medical,Medicare,Private Health Insurance,,,,Y,59426.97,15623.95
Long Island,Nassau,2908000,000511,NYU Langone Hospital-Long Island,18 to 29,117,M,White,Not Span/Hispanic,1,Trauma,Home or Self Care,2020,INJ008,"TRAUMATIC BRAIN INJURY (TBI); CONCUSSION, INITIAL ENCOUNTER",,,055,HEAD TRAUMA W COMA >1 HR OR HEMORRHAGE,01,DISEASES AND DISORDERS OF THE NERVOUS SYSTEM,1,Minor,Minor,Medical,Medicaid,,,,,Y,40013.85,9809.02
Long Island,Nassau,2908000,000511,NYU Langone Hospital-Long Island,70 or Older,115,F,White,Not Span/Hispanic,3,Emergency,Home or Self Care,2020,INJ008,"TRAUMATIC BRAIN INJURY (TBI); CONCUSSION, INITIAL ENCOUNTER",SKB006,SKIN LACERATION REPAIR (EXCLUDING PERINEUM),055,HEAD TRAUMA W COMA >1 HR OR HEMORRHAGE,01,DISEASES AND DISORDERS OF THE NERVOUS SYSTEM,2,Moderate,Major,Medical,Medicare,,,,,Y,53993.08,18261.85
Long Island,Nassau,2908000,000511,NYU Langone Hospital-Long Island,70 or Older,119,F,White,Not Span/Hispanic,2,Emergency,Home w/ Home Health Services,2020,INJ008,"TRAUMATIC BRAIN INJURY (TBI); CONCUSSION, INITIAL ENCOUNTER",,,055,HEAD TRAUMA W COMA >1 HR OR HEMORRHAGE,01,DISEASES AND DISORDERS OF THE NERVOUS SYSTEM,1,Minor,Minor,Medical,Medicare,Blue Cross/Blue Shield,,,,Y,60816,16357.49
Long Island,Nassau,2908000,000511,NYU Langone Hospital-Long Island,70 or Older,115,F,White,Not Span/Hispanic,3,Emergency,Home w/ Home Health Services,2020,INJ008,"TRAUMATIC BRAIN INJURY (TBI); CONCUSSION, INITIAL ENCOUNTER",,,055,HEAD TRAUMA W COMA >1 HR OR HEMORRHAGE,01,DISEASES AND DISORDERS OF THE NERVOUS SYSTEM,2,Moderate,Major,Medical,Medicare,Blue Cross/Blue Shield,,,,Y,65517.06,13444.25
Long Island,Nassau,2908000,000511,NYU Langone Hospital-Long Island,50 to 69,115,F,White,Not Span/Hispanic,3,Emergency,Home or Self Care,2020,INJ008,"TRAUMATIC BRAIN INJURY (TBI); CONCUSSION, INITIAL ENCOUNTER",SKB006,SKIN LACERATION REPAIR (EXCLUDING PERINEUM),055,HEAD TRAUMA W COMA >1 HR OR HEMORRHAGE,01,DISEASES AND DISORDERS OF THE NERVOUS SYSTEM,2,Moderate,Moderate,Medical,Medicare,Blue Cross/Blue Shield,,,,Y,46402.01,15078.36
Long Island,Nassau,2908000,000511,NYU Langone Hospital-Long Island,0 to 17,115,M,Other Race,Spanish/Hispanic,2,Emergency,Home or Self Care,2020,INJ008,"TRAUMATIC BRAIN INJURY (TBI); CONCUSSION, INITIAL ENCOUNTER",,,055,HEAD TRAUMA W COMA >1 HR OR HEMORRHAGE,01,DISEASES AND DISORDERS OF THE NERVOUS SYSTEM,1,Minor,Minor,Medical,Medicaid,,,,,Y,51012.23,15674.64
Long Island,Nassau,2908000,000511,NYU Langone Hospital-Long Island,70 or Older,114,M,White,Not Span/Hispanic,1,Emergency,Home w/ Home Health Services,2020,INJ008,"TRAUMATIC BRAIN INJURY (TBI); CONCUSSION, INITIAL ENCOUNTER",,,055,HEAD TRAUMA W COMA >1 HR OR HEMORRHAGE,01,DISEASES AND DISORDERS OF THE NERVOUS SYSTEM,1,Minor,Moderate,Medical,Medicare,Private Health Insurance,,,,Y,43705.62,9461.97
Long Island,Nassau,2908000,000511,NYU Langone Hospital-Long Island,70 or Older,115,M,Other Race,Spanish/Hispanic,2,Trauma,Home or Self Care,2020,INJ008,"TRAUMATIC BRAIN INJURY (TBI); CONCUSSION, INITIAL ENCOUNTER",SKB006,SKIN LACERATION REPAIR (EXCLUDING PERINEUM),055,HEAD TRAUMA W COMA >1 HR OR HEMORRHAGE,01,DISEASES AND DISORDERS OF THE NERVOUS SYSTEM,1,Minor,Moderate,Medical,Medicaid,,,,,Y,221776.47,21971.36
Long Island,Nassau,2908000,000511,NYU Langone Hospital-Long Island,70 or Older,117,F,White,Not Span/Hispanic,4,Trauma,Skilled Nursing Home,2020,INJ008,"TRAUMATIC BRAIN INJURY (TBI); CONCUSSION, INITIAL ENCOUNTER",,,055,HEAD TRAUMA W COMA >1 HR OR HEMORRHAGE,01,DISEASES AND DISORDERS OF THE NERVOUS SYSTEM,3,Major,Extreme,Medical,Medicare,Medicare,,,,Y,84872.13,19689.65
Long Island,Nassau,2908000,000511,NYU Langone Hospital-Long Island,70 or Older,110,M,White,Not Span/Hispanic,2,Trauma,Home or Self Care,2020,INJ008,"TRAUMATIC BRAIN INJURY (TBI); CONCUSSION, INITIAL ENCOUNTER",,,055,HEAD TRAUMA W COMA >1 HR OR HEMORRHAGE,01,DISEASES AND DISORDERS OF THE NERVOUS SYSTEM,1,Minor,Minor,Medical,Medicare,,,,,Y,56536.89,11546.52
Long Island,Nassau,2908000,000511,NYU Langone Hospital-Long Island,70 or Older,113,F,White,Not Span/Hispanic,2,Emergency,Home w/ Home Health Services,2020,INJ008,"TRAUMATIC BRAIN INJURY (TBI); CONCUSSION, INITIAL ENCOUNTER",ADM001,TRANSFUSION OF BLOOD AND BLOOD PRODUCTS,055,HEAD TRAUMA W COMA >1 HR OR HEMORRHAGE,01,DISEASES AND DISORDERS OF THE NERVOUS SYSTEM,3,Major,Major,Medical,Medicare,Medicare,,,,Y,137872.89,13833.53
Long Island,Nassau,2908000,000511,NYU Langone Hospital-Long Island,70 or Older,,F,White,Not Span/Hispanic,4,Emergency,Skilled Nursing Home,2020,INJ008,"TRAUMATIC BRAIN INJURY (TBI); CONCUSSION, INITIAL ENCOUNTER",,,055,HEAD TRAUMA W COMA >1 HR OR HEMORRHAGE,01,DISEASES AND DISORDERS OF THE NERVOUS SYSTEM,2,Moderate,Minor,Medical,Medicare,Blue Cross/Blue Shield,,,,Y,99210.87,18221.81
Long Island,Nassau,2908000,000511,NYU Langone Hospital-Long Island,50 to 69,110,M,White,Not Span/Hispanic,1,Emergency,Home or Self Care,2020,INJ008,"TRAUMATIC BRAIN INJURY (TBI); CONCUSSION, INITIAL ENCOUNTER",CAR024,VENOUS AND ARTERIAL CATHETER PLACEMENT,055,HEAD TRAUMA W COMA >1 HR OR HEMORRHAGE,01,DISEASES AND DISORDERS OF THE NERVOUS SYSTEM,2,Moderate,Moderate,Medical,Medicare,,,,,Y,109279.24,10304.66
Long Island,Nassau,2908000,000511,NYU Langone Hospital-Long Island,70 or Older,117,F,White,Not Span/Hispanic,8,Emergency,Expired,2020,INJ008,"TRAUMATIC BRAIN INJURY (TBI); CONCUSSION, INITIAL ENCOUNTER",ADM001,TRANSFUSION OF BLOOD AND BLOOD PRODUCTS,055,HEAD TRAUMA W COMA >1 HR OR HEMORRHAGE,01,DISEASES AND DISORDERS OF THE NERVOUS SYSTEM,4,Extreme,Major,Medical,Medicare,Medicare,,,,Y,285050.73,51598
Long Island,Nassau,2908000,000511,NYU Langone Hospital-Long Island,50 to 69,115,M,Other Race,Spanish/Hispanic,11,Trauma,Home or Self Care,2020,INJ008,"TRAUMATIC BRAIN INJURY (TBI); CONCUSSION, INITIAL ENCOUNTER",ESA003,MECHANICAL VENTILATION,055,HEAD TRAUMA W COMA >1 HR OR HEMORRHAGE,01,DISEASES AND DISORDERS OF THE NERVOUS SYSTEM,3,Major,Extreme,Medical,Self-Pay,,,,,Y,222601.97,47601.6
Long Island,Nassau,2908000,000511,NYU Langone Hospital-Long Island,70 or Older,110,M,White,Not Span/Hispanic,6,Trauma,Hospice - Medical Facility,2020,INJ008,"TRAUMATIC BRAIN INJURY (TBI); CONCUSSION, INITIAL ENCOUNTER",ADM004,TRANSFUSION OF CLOTTING FACTORS,055,HEAD TRAUMA W COMA >1 HR OR HEMORRHAGE,01,DISEASES AND DISORDERS OF THE NERVOUS SYSTEM,4,Extreme,Extreme,Medical,Medicare,Blue Cross/Blue Shield,,,,Y,193372.91,47667.44
Long Island,Nassau,2908000,000511,NYU Langone Hospital-Long Island,18 to 29,115,M,Other Race,Not Span/Hispanic,27,Emergency,Home or Self Care,2020,INJ008,"TRAUMATIC BRAIN INJURY (TBI); CONCUSSION, INITIAL ENCOUNTER",OTR004,ISOLATION PROCEDURES,055,HEAD TRAUMA W COMA >1 HR OR HEMORRHAGE,01,DISEASES AND DISORDERS OF THE NERVOUS SYSTEM,4,Extreme,Extreme,Medical,Private Health Insurance,,,,,Y,720628.18,207304.68
Long Island,Nassau,2908000,000511,NYU Langone Hospital-Long Island,70 or Older,115,F,Black/African American,Not Span/Hispanic,2,Trauma,Skilled Nursing Home,2020,INJ008,"TRAUMATIC BRAIN INJURY (TBI); CONCUSSION, INITIAL ENCOUNTER",ADM004,TRANSFUSION OF CLOTTING FACTORS,055,HEAD TRAUMA W COMA >1 HR OR HEMORRHAGE,01,DISEASES AND DISORDERS OF THE NERVOUS SYSTEM,3,Major,Extreme,Medical,Medicare,,,,,Y,147791.09,16057.83
Long Island,Nassau,2908000,000511,NYU Langone Hospital-Long Island,50 to 69,110,F,White,Not Span/Hispanic,2,Emergency,Home or Self Care,2020,INJ008,"TRAUMATIC BRAIN INJURY (TBI); CONCUSSION, INITIAL ENCOUNTER",,,055,HEAD TRAUMA W COMA >1 HR OR HEMORRHAGE,01,DISEASES AND DISORDERS OF THE NERVOUS SYSTEM,2,Moderate,Minor,Medical,Medicare,Medicaid,,,,Y,40613.94,9555.22
Long Island,Nassau,2908000,000511,NYU Langone Hospital-Long Island,70 or Older,110,F,White,Not Span/Hispanic,5,Emergency,Home w/ Home Health Services,2020,INJ008,"TRAUMATIC BRAIN INJURY (TBI); CONCUSSION, INITIAL ENCOUNTER",ADM005,ADMINISTRATION OF THROMBOLYTICS AND PLATELET INHIBITORS,055,HEAD TRAUMA W COMA >1 HR OR HEMORRHAGE,01,DISEASES AND DISORDERS OF THE NERVOUS SYSTEM,2,Moderate,Moderate,Medical,Medicare,Blue Cross/Blue Shield,,,,Y,154477.44,24261.23
Long Island,Nassau,2908000,000511,NYU Langone Hospital-Long Island,18 to 29,115,M,White,Not Span/Hispanic,4,Trauma,Home w/ Home Health Services,2020,INJ008,"TRAUMATIC BRAIN INJURY (TBI); CONCUSSION, INITIAL ENCOUNTER",,,055,HEAD TRAUMA W COMA >1 HR OR HEMORRHAGE,01,DISEASES AND DISORDERS OF THE NERVOUS SYSTEM,2,Moderate,Moderate,Medical,Miscellaneous/Other,Private Health Insurance,,,,Y,139187.12,38883.44
Long Island,Nassau,2908000,000511,NYU Langone Hospital-Long Island,70 or Older,115,F,White,Not Span/Hispanic,1,Emergency,Home or Self Care,2020,INJ008,"TRAUMATIC BRAIN INJURY (TBI); CONCUSSION, INITIAL ENCOUNTER",,,055,HEAD TRAUMA W COMA >1 HR OR HEMORRHAGE,01,DISEASES AND DISORDERS OF THE NERVOUS SYSTEM,1,Minor,Minor,Medical,Medicare,Private Health Insurance,,,,Y,37222.93,8471.31
Long Island,Nassau,2908000,000511,NYU Langone Hospital-Long Island,50 to 69,115,M,Other Race,Not Span/Hispanic,1,Emergency,Home or Self Care,2020,INJ008,"TRAUMATIC BRAIN INJURY (TBI); CONCUSSION, INITIAL ENCOUNTER",,,055,HEAD TRAUMA W COMA >1 HR OR HEMORRHAGE,01,DISEASES AND DISORDERS OF THE NERVOUS SYSTEM,1,Minor,Minor,Medical,Medicaid,,,,,Y,57665.82,10336.27
Long Island,Nassau,2908000,000511,NYU Langone Hospital-Long Island,70 or Older,115,F,White,Not Span/Hispanic,1,Emergency,Home w/ Home Health Services,2020,INJ008,"TRAUMATIC BRAIN INJURY (TBI); CONCUSSION, INITIAL ENCOUNTER",,,055,HEAD TRAUMA W COMA >1 HR OR HEMORRHAGE,01,DISEASES AND DISORDERS OF THE NERVOUS SYSTEM,1,Minor,Minor,Medical,Medicare,,,,,Y,37788.03,7128.15
Long Island,Nassau,2908000,000511,NYU Langone Hospital-Long Island,70 or Older,117,F,White,Not Span/Hispanic,3,Emergency,Home w/ Home Health Services,2020,INJ008,"TRAUMATIC BRAIN INJURY (TBI); CONCUSSION, INITIAL ENCOUNTER",SKB006,SKIN LACERATION REPAIR (EXCLUDING PERINEUM),055,HEAD TRAUMA W COMA >1 HR OR HEMORRHAGE,01,DISEASES AND DISORDERS OF THE NERVOUS SYSTEM,3,Major,Moderate,Medical,Medicare,Blue Cross/Blue Shield,,,,Y,70793.57,15013.68
Long Island,Nassau,2908000,000511,NYU Langone Hospital-Long Island,70 or Older,118,M,Other Race,Spanish/Hispanic,2,Emergency,Home w/ Home Health Services,2020,INJ008,"TRAUMATIC BRAIN INJURY (TBI); CONCUSSION, INITIAL ENCOUNTER",SKB006,SKIN LACERATION REPAIR (EXCLUDING PERINEUM),055,HEAD TRAUMA W COMA >1 HR OR HEMORRHAGE,01,DISEASES AND DISORDERS OF THE NERVOUS SYSTEM,2,Moderate,Minor,Medical,Medicare,,,,,Y,45935.17,10049.03
Long Island,Nassau,2908000,000511,NYU Langone Hospital-Long Island,50 to 69,115,M,Black/African American,Not Span/Hispanic,1,Trauma,Home or Self Care,2020,INJ008,"TRAUMATIC BRAIN INJURY (TBI); CONCUSSION, INITIAL ENCOUNTER",,,055,HEAD TRAUMA W COMA >1 HR OR HEMORRHAGE,01,DISEASES AND DISORDERS OF THE NERVOUS SYSTEM,1,Minor,Minor,Medical,Medicaid,,,,,Y,52545.89,11364.03
Long Island,Nassau,2908000,000511,NYU Langone Hospital-Long Island,70 or Older,115,F,White,Not Span/Hispanic,1,Emergency,Home or Self Care,2020,INJ008,"TRAUMATIC BRAIN INJURY (TBI); CONCUSSION, INITIAL ENCOUNTER",EST001,PHERESIS THERAPY,055,HEAD TRAUMA W COMA >1 HR OR HEMORRHAGE,01,DISEASES AND DISORDERS OF THE NERVOUS SYSTEM,2,Moderate,Moderate,Medical,Medicare,Medicare,,,,Y,53033.56,10693.35
Long Island,Nassau,2908000,000511,NYU Langone Hospital-Long Island,70 or Older,115,F,White,Not Span/Hispanic,1,Emergency,Home or Self Care,2020,INJ008,"TRAUMATIC BRAIN INJURY (TBI); CONCUSSION, INITIAL ENCOUNTER",,,055,HEAD TRAUMA W COMA >1 HR OR HEMORRHAGE,01,DISEASES AND DISORDERS OF THE NERVOUS SYSTEM,2,Moderate,Moderate,Medical,Medicare,,,,,Y,38600.63,9234.5
Long Island,Nassau,2908000,000511,NYU Langone Hospital-Long Island,70 or Older,117,F,White,Not Span/Hispanic,3,Emergency,Home w/ Home Health Services,2020,INJ008,"TRAUMATIC BRAIN INJURY (TBI); CONCUSSION, INITIAL ENCOUNTER",MST015,CLOSED REDUCTION OF BONES AND JOINTS,055,HEAD TRAUMA W COMA >1 HR OR HEMORRHAGE,01,DISEASES AND DISORDERS OF THE NERVOUS SYSTEM,2,Moderate,Minor,Medical,Medicare,Blue Cross/Blue Shield,,,,Y,95291.58,24624.56
Long Island,Nassau,2908000,000511,NYU Langone Hospital-Long Island,70 or Older,115,M,White,Unknown,1,Emergency,Home or Self Care,2020,INJ008,"TRAUMATIC BRAIN INJURY (TBI); CONCUSSION, INITIAL ENCOUNTER",,,055,HEAD TRAUMA W COMA >1 HR OR HEMORRHAGE,01,DISEASES AND DISORDERS OF THE NERVOUS SYSTEM,1,Minor,Minor,Medical,Medicare,Private Health Insurance,,,,Y,42043.03,8467.03
Long Island,Nassau,2908000,000511,NYU Langone Hospital-Long Island,50 to 69,117,M,White,Not Span/Hispanic,2,Emergency,Home or Self Care,2020,INJ008,"TRAUMATIC BRAIN INJURY (TBI); CONCUSSION, INITIAL ENCOUNTER",SKB006,SKIN LACERATION REPAIR (EXCLUDING PERINEUM),055,HEAD TRAUMA W COMA >1 HR OR HEMORRHAGE,01,DISEASES AND DISORDERS OF THE NERVOUS SYSTEM,2,Moderate,Minor,Medical,Blue Cross/Blue Shield,,,,,Y,54831.86,13614.59
Long Island,Nassau,2908000,000511,NYU Langone Hospital-Long Island,70 or Older,117,F,White,Not Span/Hispanic,1,Emergency,Skilled Nursing Home,2020,INJ008,"TRAUMATIC BRAIN INJURY (TBI); CONCUSSION, INITIAL ENCOUNTER",ADM001,TRANSFUSION OF BLOOD AND BLOOD PRODUCTS,055,HEAD TRAUMA W COMA >1 HR OR HEMORRHAGE,01,DISEASES AND DISORDERS OF THE NERVOUS SYSTEM,2,Moderate,Moderate,Medical,Medicare,Private Health Insurance,,,,Y,56540.9,12308.16
Long Island,Nassau,2908000,000511,NYU Langone Hospital-Long Island,70 or Older,117,F,White,Not Span/Hispanic,1,Emergency,Skilled Nursing Home,2020,INJ008,"TRAUMATIC BRAIN INJURY (TBI); CONCUSSION, INITIAL ENCOUNTER",MAM011,ELECTROENCEPHALOGRAM (EEG),055,HEAD TRAUMA W COMA >1 HR OR HEMORRHAGE,01,DISEASES AND DISORDERS OF THE NERVOUS SYSTEM,2,Moderate,Moderate,Medical,Medicare,Private Health Insurance,,,,Y,65708.86,9525.66
Long Island,Nassau,2908000,000511,NYU Langone Hospital-Long Island,0 to 17,115,F,Other Race,Not Span/Hispanic,2,Urgent,Home or Self Care,2020,INJ008,"TRAUMATIC BRAIN INJURY (TBI); CONCUSSION, INITIAL ENCOUNTER",,,055,HEAD TRAUMA W COMA >1 HR OR HEMORRHAGE,01,DISEASES AND DISORDERS OF THE NERVOUS SYSTEM,1,Minor,Minor,Medical,Medicaid,,,,,N,22468.24,7432.05
Long Island,Nassau,2908000,000511,NYU Langone Hospital-Long Island,30 to 49,115,F,Other Race,Not Span/Hispanic,4,Emergency,Home or Self Care,2020,INJ008,"TRAUMATIC BRAIN INJURY (TBI); CONCUSSION, INITIAL ENCOUNTER",MST028,"SUBCUTANEOUS TISSUE AND FASCIA PROCEDURES, NEC",055,HEAD TRAUMA W COMA >1 HR OR HEMORRHAGE,01,DISEASES AND DISORDERS OF THE NERVOUS SYSTEM,3,Major,Moderate,Medical,Private Health Insurance,,,,,Y,164001.59,37540.13
Long Island,Nassau,2908000,000511,NYU Langone Hospital-Long Island,50 to 69,110,F,White,Not Span/Hispanic,1,Emergency,Home or Self Care,2020,INJ008,"TRAUMATIC BRAIN INJURY (TBI); CONCUSSION, INITIAL ENCOUNTER",,,055,HEAD TRAUMA W COMA >1 HR OR HEMORRHAGE,01,DISEASES AND DISORDERS OF THE NERVOUS SYSTEM,1,Minor,Minor,Medical,Miscellaneous/Other,Blue Cross/Blue Shield,,,,Y,23194.23,6311.7
Long Island,Nassau,2908000,000511,NYU Langone Hospital-Long Island,70 or Older,110,F,White,Not Span/Hispanic,2,Trauma,Home w/ Home Health Services,2020,INJ008,"TRAUMATIC BRAIN INJURY (TBI); CONCUSSION, INITIAL ENCOUNTER",SKB006,SKIN LACERATION REPAIR (EXCLUDING PERINEUM),055,HEAD TRAUMA W COMA >1 HR OR HEMORRHAGE,01,DISEASES AND DISORDERS OF THE NERVOUS SYSTEM,2,Moderate,Moderate,Medical,Medicare,Private Health Insurance,,,,Y,104227.64,19255.86
Long Island,Nassau,2908000,000511,NYU Langone Hospital-Long Island,50 to 69,115,M,Other Race,Spanish/Hispanic,8,Emergency,Inpatient Rehabilitation Facility,2020,INJ008,"TRAUMATIC BRAIN INJURY (TBI); CONCUSSION, INITIAL ENCOUNTER",,,055,HEAD TRAUMA W COMA >1 HR OR HEMORRHAGE,01,DISEASES AND DISORDERS OF THE NERVOUS SYSTEM,2,Moderate,Minor,Medical,Medicare,Medicaid,,,,Y,170522.79,47620.15
Long Island,Nassau,2908000,000511,NYU Langone Hospital-Long Island,50 to 69,110,M,White,Not Span/Hispanic,1,Emergency,Home or Self Care,2020,INJ008,"TRAUMATIC BRAIN INJURY (TBI); CONCUSSION, INITIAL ENCOUNTER",SKB006,SKIN LACERATION REPAIR (EXCLUDING PERINEUM),055,HEAD TRAUMA W COMA >1 HR OR HEMORRHAGE,01,DISEASES AND DISORDERS OF THE NERVOUS SYSTEM,1,Minor,Minor,Medical,Private Health Insurance,,,,,Y,59368.42,12270.26
Long Island,Nassau,2908000,000511,NYU Langone Hospital-Long Island,70 or Older,115,F,White,Not Span/Hispanic,1,Emergency,Home or Self Care,2020,INJ008,"TRAUMATIC BRAIN INJURY (TBI); CONCUSSION, INITIAL ENCOUNTER",,,055,HEAD TRAUMA W COMA >1 HR OR HEMORRHAGE,01,DISEASES AND DISORDERS OF THE NERVOUS SYSTEM,1,Minor,Minor,Medical,Medicare,Blue Cross/Blue Shield,,,,Y,51205.93,9136.28
Long Island,Nassau,2908000,000511,NYU Langone Hospital-Long Island,50 to 69,110,F,White,Not Span/Hispanic,2,Trauma,Home or Self Care,2020,INJ008,"TRAUMATIC BRAIN INJURY (TBI); CONCUSSION, INITIAL ENCOUNTER",ADM001,TRANSFUSION OF BLOOD AND BLOOD PRODUCTS,055,HEAD TRAUMA W COMA >1 HR OR HEMORRHAGE,01,DISEASES AND DISORDERS OF THE NERVOUS SYSTEM,2,Moderate,Moderate,Medical,Private Health Insurance,,,,,Y,77197.33,14095.9
Long Island,Nassau,2908000,000511,NYU Langone Hospital-Long Island,70 or Older,117,F,White,Not Span/Hispanic,2,Emergency,Home or Self Care,2020,INJ008,"TRAUMATIC BRAIN INJURY (TBI); CONCUSSION, INITIAL ENCOUNTER",,,055,HEAD TRAUMA W COMA >1 HR OR HEMORRHAGE,01,DISEASES AND DISORDERS OF THE NERVOUS SYSTEM,2,Moderate,Minor,Medical,Medicare,Blue Cross/Blue Shield,,,,Y,93213.59,15885.98