Hospital Service Area,Hospital County,Operating Certificate Number,Permanent Facility Id,Facility Name,Age Group,Zip Code - 3 digits,Gender,Race,Ethnicity,Length of Stay,Type of Admission,Patient Disposition,Discharge Year,CCS Diagnosis Code,CCS Diagnosis Description,CCS Procedure Code,CCS Procedure Description,APR DRG Code,APR DRG Description,APR MDC Code,APR MDC Description,APR Severity of Illness Code,APR Severity of Illness Description,APR Risk of Mortality,APR Medical Surgical Description,Payment Typology 1,Payment Typology 2,Payment Typology 3,Birth Weight,Abortion Edit Indicator,Emergency Department Indicator,Total Charges,Total Costs
New York City,Manhattan,7002053,001463,NYU Langone Hospitals,30 to 49,111,F,White,Not Span/Hispanic,3,Elective,Home or Self Care,2019,PRG026,OB-RELATED TRAUMA TO PERINEUM AND VULVA,PGN002,SPONTANEOUS VAGINAL DELIVERY,560,VAGINAL DELIVERY,14,"PREGNANCY, CHILDBIRTH AND THE PUERPERIUM",1,Minor,Minor,Medical,Private Health Insurance,,,,,false,33412.12,12970.16
New York City,Manhattan,7002053,001463,NYU Langone Hospitals,30 to 49,112,F,White,Not Span/Hispanic,2,Elective,Home or Self Care,2019,PRG023,COMPLICATIONS SPECIFIED DURING CHILDBIRTH,PGN002,SPONTANEOUS VAGINAL DELIVERY,560,VAGINAL DELIVERY,14,"PREGNANCY, CHILDBIRTH AND THE PUERPERIUM",2,Moderate,Minor,Medical,Blue Cross/Blue Shield,,,,,false,34218.32,10674.53
New York City,Manhattan,7002053,001463,NYU Langone Hospitals,18 to 29,112,F,White,Not Span/Hispanic,2,Elective,Home or Self Care,2019,PRG022,PROLONGED PREGNANCY,PGN002,SPONTANEOUS VAGINAL DELIVERY,560,VAGINAL DELIVERY,14,"PREGNANCY, CHILDBIRTH AND THE PUERPERIUM",1,Minor,Minor,Medical,Private Health Insurance,Medicaid,,,,false,22793.58,9508.94
New York City,Manhattan,7002053,001463,NYU Langone Hospitals,30 to 49,117,F,Other Race,Unknown,4,Emergency,Home or Self Care,2019,PRG013,MATERNAL CARE RELATED TO FETAL CONDITIONS,PGN001,FETAL HEART RATE MONITORING,560,VAGINAL DELIVERY,14,"PREGNANCY, CHILDBIRTH AND THE PUERPERIUM",2,Moderate,Minor,Medical,Medicaid,,,,,true,50296.99,17380.9
New York City,Manhattan,7002053,001463,NYU Langone Hospitals,30 to 49,112,F,White,Not Span/Hispanic,3,Elective,Home or Self Care,2019,PRG014,POLYHYDRAMNIOS AND OTHER PROBLEMS OF AMNIOTIC CAVITY,PGN002,SPONTANEOUS VAGINAL DELIVERY,560,VAGINAL DELIVERY,14,"PREGNANCY, CHILDBIRTH AND THE PUERPERIUM",1,Minor,Minor,Medical,Blue Cross/Blue Shield,,,,,false,34922.62,12996.57
New York City,Manhattan,7002053,001463,NYU Langone Hospitals,30 to 49,112,F,White,Not Span/Hispanic,3,Elective,Home or Self Care,2019,PRG014,POLYHYDRAMNIOS AND OTHER PROBLEMS OF AMNIOTIC CAVITY,PGN002,SPONTANEOUS VAGINAL DELIVERY,560,VAGINAL DELIVERY,14,"PREGNANCY, CHILDBIRTH AND THE PUERPERIUM",2,Moderate,Minor,Medical,Private Health Insurance,,,,,false,31770.07,12712.9
New York City,Manhattan,7002053,001463,NYU Langone Hospitals,18 to 29,112,F,White,Not Span/Hispanic,2,Elective,Home or Self Care,2019,PRG022,PROLONGED PREGNANCY,PGN002,SPONTANEOUS VAGINAL DELIVERY,560,VAGINAL DELIVERY,14,"PREGNANCY, CHILDBIRTH AND THE PUERPERIUM",1,Minor,Minor,Medical,Medicaid,,,,,false,24285.31,9575.47
New York City,Manhattan,7002053,001463,NYU Langone Hospitals,30 to 49,104,F,Other Race,Spanish/Hispanic,2,Elective,Home or Self Care,2019,PRG017,MATERNAL CARE FOR ABNORMALITY OF PELVIC ORGANS,PGN002,SPONTANEOUS VAGINAL DELIVERY,560,VAGINAL DELIVERY,14,"PREGNANCY, CHILDBIRTH AND THE PUERPERIUM",2,Moderate,Minor,Medical,Private Health Insurance,,,,,false,22092.89,9312.97
New York City,Manhattan,7002053,001463,NYU Langone Hospitals,30 to 49,100,F,White,Not Span/Hispanic,3,Elective,Home or Self Care,2019,PRG029,"UNCOMPLICATED PREGNANCY, DELIVERY OR PUERPERIUM",PGN002,SPONTANEOUS VAGINAL DELIVERY,560,VAGINAL DELIVERY,14,"PREGNANCY, CHILDBIRTH AND THE PUERPERIUM",2,Moderate,Minor,Medical,Blue Cross/Blue Shield,,,,,false,38223.98,13174.15
New York City,Manhattan,7002053,001463,NYU Langone Hospitals,30 to 49,100,F,White,Not Span/Hispanic,2,Elective,Home or Self Care,2019,PRG026,OB-RELATED TRAUMA TO PERINEUM AND VULVA,PGN002,SPONTANEOUS VAGINAL DELIVERY,560,VAGINAL DELIVERY,14,"PREGNANCY, CHILDBIRTH AND THE PUERPERIUM",1,Minor,Minor,Medical,Private Health Insurance,,,,,false,24344.03,9539.64
New York City,Manhattan,7002053,001463,NYU Langone Hospitals,30 to 49,103,F,White,Not Span/Hispanic,2,Elective,Home or Self Care,2019,PRG022,PROLONGED PREGNANCY,PGN005,EPISIOTOMY,560,VAGINAL DELIVERY,14,"PREGNANCY, CHILDBIRTH AND THE PUERPERIUM",1,Minor,Minor,Medical,Medicaid,,,,,false,29155.63,12388.68
New York City,Manhattan,7002053,001463,NYU Langone Hospitals,30 to 49,112,F,White,Not Span/Hispanic,2,Elective,Home or Self Care,2019,PRG022,PROLONGED PREGNANCY,PGN002,SPONTANEOUS VAGINAL DELIVERY,560,VAGINAL DELIVERY,14,"PREGNANCY, CHILDBIRTH AND THE PUERPERIUM",1,Minor,Minor,Medical,Private Health Insurance,,,,,false,26447.56,9749.68
New York City,Manhattan,7002053,001463,NYU Langone Hospitals,18 to 29,112,F,White,Not Span/Hispanic,3,Elective,Home or Self Care,2019,PRG029,"UNCOMPLICATED PREGNANCY, DELIVERY OR PUERPERIUM",SKB005,PERINEAL SKIN REPAIR (1ST DEGREE OBSTETRICAL AND OTHER),560,VAGINAL DELIVERY,14,"PREGNANCY, CHILDBIRTH AND THE PUERPERIUM",1,Minor,Minor,Medical,Medicaid,,,,,false,29330.27,12462.3
New York City,Manhattan,7002053,001463,NYU Langone Hospitals,30 to 49,112,F,White,Not Span/Hispanic,2,Elective,Home or Self Care,2019,PRG011,EARLY OR THREATENED LABOR,PGN002,SPONTANEOUS VAGINAL DELIVERY,560,VAGINAL DELIVERY,14,"PREGNANCY, CHILDBIRTH AND THE PUERPERIUM",2,Moderate,Minor,Medical,Private Health Insurance,,,,,false,26675.53,9896.16
New York City,Manhattan,7002053,001463,NYU Langone Hospitals,18 to 29,100,F,White,Spanish/Hispanic,3,Emergency,Home or Self Care,2019,PRG013,MATERNAL CARE RELATED TO FETAL CONDITIONS,PGN002,SPONTANEOUS VAGINAL DELIVERY,560,VAGINAL DELIVERY,14,"PREGNANCY, CHILDBIRTH AND THE PUERPERIUM",2,Moderate,Minor,Medical,Medicaid,,,,,false,36394.36,13008.22
New York City,Manhattan,7002053,001463,NYU Langone Hospitals,30 to 49,100,F,White,Not Span/Hispanic,2,Elective,Home or Self Care,2019,PRG026,OB-RELATED TRAUMA TO PERINEUM AND VULVA,PGN002,SPONTANEOUS VAGINAL DELIVERY,560,VAGINAL DELIVERY,14,"PREGNANCY, CHILDBIRTH AND THE PUERPERIUM",1,Minor,Minor,Medical,Blue Cross/Blue Shield,,,,,false,24966.1,9661.36
New York City,Manhattan,7002053,001463,NYU Langone Hospitals,30 to 49,111,F,Other Race,Unknown,3,Elective,Home or Self Care,2019,PRG024,"MALPOSITION, DISPROPORTION OR OTHER LABOR COMPLICATIONS",PGN002,SPONTANEOUS VAGINAL DELIVERY,560,VAGINAL DELIVERY,14,"PREGNANCY, CHILDBIRTH AND THE PUERPERIUM",1,Minor,Minor,Medical,Private Health Insurance,,,,,false,30719.03,12698.84
New York City,Manhattan,7002053,001463,NYU Langone Hospitals,30 to 49,112,F,White,Not Span/Hispanic,2,Elective,Home or Self Care,2019,PRG022,PROLONGED PREGNANCY,PGN002,SPONTANEOUS VAGINAL DELIVERY,560,VAGINAL DELIVERY,14,"PREGNANCY, CHILDBIRTH AND THE PUERPERIUM",1,Minor,Minor,Medical,Private Health Insurance,,,,,false,24470.76,9842.01
New York City,Manhattan,7002053,001463,NYU Langone Hospitals,18 to 29,112,F,White,Not Span/Hispanic,3,Elective,Home or Self Care,2019,PRG011,EARLY OR THREATENED LABOR,PGN002,SPONTANEOUS VAGINAL DELIVERY,560,VAGINAL DELIVERY,14,"PREGNANCY, CHILDBIRTH AND THE PUERPERIUM",2,Moderate,Minor,Medical,Medicaid,,,,,false,29712.32,12577.91
New York City,Manhattan,7002053,001463,NYU Langone Hospitals,30 to 49,112,F,Other Race,Not Span/Hispanic,2,Elective,Home or Self Care,2019,PRG023,COMPLICATIONS SPECIFIED DURING CHILDBIRTH,PGN002,SPONTANEOUS VAGINAL DELIVERY,560,VAGINAL DELIVERY,14,"PREGNANCY, CHILDBIRTH AND THE PUERPERIUM",1,Minor,Minor,Medical,Medicaid,,,,,false,26143.7,9654.01
New York City,Manhattan,7002053,001463,NYU Langone Hospitals,30 to 49,,F,White,Not Span/Hispanic,2,Elective,Home or Self Care,2019,PRG022,PROLONGED PREGNANCY,PGN002,SPONTANEOUS VAGINAL DELIVERY,560,VAGINAL DELIVERY,14,"PREGNANCY, CHILDBIRTH AND THE PUERPERIUM",1,Minor,Minor,Medical,Private Health Insurance,,,,,false,23215.6,9343.29
New York City,Manhattan,7002053,001463,NYU Langone Hospitals,30 to 49,100,F,White,Not Span/Hispanic,2,Elective,Home or Self Care,2019,PRG013,MATERNAL CARE RELATED TO FETAL CONDITIONS,FRS006,VULVAR LACERATION REPAIR,560,VAGINAL DELIVERY,14,"PREGNANCY, CHILDBIRTH AND THE PUERPERIUM",2,Moderate,Minor,Medical,Private Health Insurance,,,,,false,26852.93,10120.47
New York City,Manhattan,7002053,001463,NYU Langone Hospitals,30 to 49,100,F,Other Race,Not Span/Hispanic,2,Elective,Home or Self Care,2019,PRG023,COMPLICATIONS SPECIFIED DURING CHILDBIRTH,PGN002,SPONTANEOUS VAGINAL DELIVERY,560,VAGINAL DELIVERY,14,"PREGNANCY, CHILDBIRTH AND THE PUERPERIUM",1,Minor,Minor,Medical,Medicaid,,,,,false,22907.26,9334.97
New York City,Manhattan,7002053,001463,NYU Langone Hospitals,30 to 49,112,F,White,Not Span/Hispanic,3,Elective,Home or Self Care,2019,PRG022,PROLONGED PREGNANCY,PGN002,SPONTANEOUS VAGINAL DELIVERY,560,VAGINAL DELIVERY,14,"PREGNANCY, CHILDBIRTH AND THE PUERPERIUM",2,Moderate,Minor,Medical,Private Health Insurance,,,,,false,34418.25,13284.63
New York City,Manhattan,7002053,001463,NYU Langone Hospitals,30 to 49,112,F,White,Not Span/Hispanic,3,Elective,Home or Self Care,2019,PRG020,HYPERTENSION AND HYPERTENSIVE-RELATED CONDITIONS COMPLICATING PREGNANCY; CHILDBIRTH; AND THE PUERPERIUM,MST021,PERINEAL MUSCLE LACERATION REPAIR (2ND DEGREE OBSTETRICAL AND OTHER),560,VAGINAL DELIVERY,14,"PREGNANCY, CHILDBIRTH AND THE PUERPERIUM",1,Minor,Minor,Medical,Blue Cross/Blue Shield,,,,,false,37282.1,13378.89
New York City,Manhattan,7002053,001463,NYU Langone Hospitals,18 to 29,112,F,White,Not Span/Hispanic,1,Elective,Home or Self Care,2019,PRG022,PROLONGED PREGNANCY,PGN002,SPONTANEOUS VAGINAL DELIVERY,560,VAGINAL DELIVERY,14,"PREGNANCY, CHILDBIRTH AND THE PUERPERIUM",1,Minor,Minor,Medical,Blue Cross/Blue Shield,,,,,false,37946.21,13109.58
New York City,Manhattan,7002053,001463,NYU Langone Hospitals,30 to 49,100,F,White,Not Span/Hispanic,1,Elective,Home or Self Care,2019,PRG023,COMPLICATIONS SPECIFIED DURING CHILDBIRTH,PGN002,SPONTANEOUS VAGINAL DELIVERY,560,VAGINAL DELIVERY,14,"PREGNANCY, CHILDBIRTH AND THE PUERPERIUM",1,Minor,Minor,Medical,Private Health Insurance,,,,,false,29234.36,10117.59
New York City,Manhattan,7002053,001463,NYU Langone Hospitals,30 to 49,OOS,F,White,Not Span/Hispanic,1,Elective,Home or Self Care,2019,PRG017,MATERNAL CARE FOR ABNORMALITY OF PELVIC ORGANS,PGN002,SPONTANEOUS VAGINAL DELIVERY,560,VAGINAL DELIVERY,14,"PREGNANCY, CHILDBIRTH AND THE PUERPERIUM",1,Minor,Minor,Medical,Private Health Insurance,,,,,false,17148.01,6566.37
New York City,Manhattan,7002053,001463,NYU Langone Hospitals,18 to 29,112,F,Black/African American,Not Span/Hispanic,3,Elective,Home or Self Care,2019,PRG023,COMPLICATIONS SPECIFIED DURING CHILDBIRTH,PGN002,SPONTANEOUS VAGINAL DELIVERY,560,VAGINAL DELIVERY,14,"PREGNANCY, CHILDBIRTH AND THE PUERPERIUM",1,Minor,Minor,Medical,Private Health Insurance,,,,,false,33191.77,12779.27
New York City,Manhattan,7002053,001463,NYU Langone Hospitals,30 to 49,112,F,Other Race,Unknown,3,Elective,Home or Self Care,2019,PRG022,PROLONGED PREGNANCY,PGN002,SPONTANEOUS VAGINAL DELIVERY,560,VAGINAL DELIVERY,14,"PREGNANCY, CHILDBIRTH AND THE PUERPERIUM",2,Moderate,Minor,Medical,Private Health Insurance,,,,,false,55261.32,19146.78
New York City,Manhattan,7002053,001463,NYU Langone Hospitals,30 to 49,100,F,Other Race,Not Span/Hispanic,2,Elective,Home or Self Care,2019,PRG029,"UNCOMPLICATED PREGNANCY, DELIVERY OR PUERPERIUM",MST021,PERINEAL MUSCLE LACERATION REPAIR (2ND DEGREE OBSTETRICAL AND OTHER),560,VAGINAL DELIVERY,14,"PREGNANCY, CHILDBIRTH AND THE PUERPERIUM",1,Minor,Minor,Medical,Blue Cross/Blue Shield,,,,,false,26049.16,9690.61
New York City,Manhattan,7002053,001463,NYU Langone Hospitals,18 to 29,112,F,White,Not Span/Hispanic,2,Elective,Home or Self Care,2019,PRG026,OB-RELATED TRAUMA TO PERINEUM AND VULVA,PGN002,SPONTANEOUS VAGINAL DELIVERY,560,VAGINAL DELIVERY,14,"PREGNANCY, CHILDBIRTH AND THE PUERPERIUM",2,Moderate,Minor,Medical,Private Health Insurance,,,,,false,23028.38,9427.52
New York City,Manhattan,7002053,001463,NYU Langone Hospitals,18 to 29,OOS,F,White,Not Span/Hispanic,2,Elective,Home or Self Care,2019,PRG023,COMPLICATIONS SPECIFIED DURING CHILDBIRTH,PGN002,SPONTANEOUS VAGINAL DELIVERY,560,VAGINAL DELIVERY,14,"PREGNANCY, CHILDBIRTH AND THE PUERPERIUM",1,Minor,Minor,Medical,Private Health Insurance,,,,,false,31933.35,12566
New York City,Manhattan,7002053,001463,NYU Langone Hospitals,30 to 49,100,F,Other Race,Not Span/Hispanic,3,Elective,Home or Self Care,2019,PRG020,HYPERTENSION AND HYPERTENSIVE-RELATED CONDITIONS COMPLICATING PREGNANCY; CHILDBIRTH; AND THE PUERPERIUM,PGN002,SPONTANEOUS VAGINAL DELIVERY,560,VAGINAL DELIVERY,14,"PREGNANCY, CHILDBIRTH AND THE PUERPERIUM",1,Minor,Minor,Medical,Private Health Insurance,,,,,false,32147.96,12803.2
New York City,Manhattan,7002053,001463,NYU Langone Hospitals,30 to 49,100,F,Other Race,Not Span/Hispanic,3,Elective,Home or Self Care,2019,PRG029,"UNCOMPLICATED PREGNANCY, DELIVERY OR PUERPERIUM",PGN002,SPONTANEOUS VAGINAL DELIVERY,560,VAGINAL DELIVERY,14,"PREGNANCY, CHILDBIRTH AND THE PUERPERIUM",1,Minor,Minor,Medical,Private Health Insurance,,,,,false,32400.98,12744.27
New York City,Manhattan,7002053,001463,NYU Langone Hospitals,30 to 49,112,F,White,Not Span/Hispanic,3,Elective,Home or Self Care,2019,PRG022,PROLONGED PREGNANCY,PGN002,SPONTANEOUS VAGINAL DELIVERY,560,VAGINAL DELIVERY,14,"PREGNANCY, CHILDBIRTH AND THE PUERPERIUM",1,Minor,Minor,Medical,Blue Cross/Blue Shield,,,,,false,32570.36,12748.84
New York City,Manhattan,7002053,001463,NYU Langone Hospitals,30 to 49,100,F,White,Not Span/Hispanic,2,Elective,Home or Self Care,2019,PRG013,MATERNAL CARE RELATED TO FETAL CONDITIONS,PGN002,SPONTANEOUS VAGINAL DELIVERY,560,VAGINAL DELIVERY,14,"PREGNANCY, CHILDBIRTH AND THE PUERPERIUM",2,Moderate,Minor,Medical,Private Health Insurance,,,,,false,25114.73,9614.88
New York City,Manhattan,7002053,001463,NYU Langone Hospitals,30 to 49,100,F,Other Race,Not Span/Hispanic,2,Elective,Home or Self Care,2019,PRG026,OB-RELATED TRAUMA TO PERINEUM AND VULVA,PGN004,ASSISTED VAGINAL DELIVERY,560,VAGINAL DELIVERY,14,"PREGNANCY, CHILDBIRTH AND THE PUERPERIUM",1,Minor,Minor,Medical,Blue Cross/Blue Shield,,,,,false,25598.89,9975.7
New York City,Manhattan,7002053,001463,NYU Langone Hospitals,18 to 29,100,F,White,Spanish/Hispanic,2,Elective,Home or Self Care,2019,PRG024,"MALPOSITION, DISPROPORTION OR OTHER LABOR COMPLICATIONS",PGN002,SPONTANEOUS VAGINAL DELIVERY,560,VAGINAL DELIVERY,14,"PREGNANCY, CHILDBIRTH AND THE PUERPERIUM",1,Minor,Minor,Medical,Private Health Insurance,Medicaid,,,,false,30752.95,10652.75
New York City,Manhattan,7002053,001463,NYU Langone Hospitals,30 to 49,112,F,White,Not Span/Hispanic,3,Elective,Home or Self Care,2019,PRG023,COMPLICATIONS SPECIFIED DURING CHILDBIRTH,PGN002,SPONTANEOUS VAGINAL DELIVERY,560,VAGINAL DELIVERY,14,"PREGNANCY, CHILDBIRTH AND THE PUERPERIUM",2,Moderate,Minor,Medical,Private Health Insurance,,,,,false,31218.47,12698.92
New York City,Manhattan,7002053,001463,NYU Langone Hospitals,30 to 49,112,F,White,Not Span/Hispanic,2,Elective,Home or Self Care,2019,PRG023,COMPLICATIONS SPECIFIED DURING CHILDBIRTH,PGN002,SPONTANEOUS VAGINAL DELIVERY,560,VAGINAL DELIVERY,14,"PREGNANCY, CHILDBIRTH AND THE PUERPERIUM",1,Minor,Minor,Medical,Private Health Insurance,,,,,false,33321.42,13205.18
New York City,Manhattan,7002053,001463,NYU Langone Hospitals,30 to 49,OOS,F,White,Not Span/Hispanic,2,Elective,Home or Self Care,2019,PRG024,"MALPOSITION, DISPROPORTION OR OTHER LABOR COMPLICATIONS",PGN001,FETAL HEART RATE MONITORING,560,VAGINAL DELIVERY,14,"PREGNANCY, CHILDBIRTH AND THE PUERPERIUM",2,Moderate,Minor,Medical,Blue Cross/Blue Shield,,,,,false,32448.18,12874.73
New York City,Manhattan,7002053,001463,NYU Langone Hospitals,30 to 49,OOS,F,Other Race,Not Span/Hispanic,3,Elective,Home or Self Care,2019,PRG029,"UNCOMPLICATED PREGNANCY, DELIVERY OR PUERPERIUM",PGN004,ASSISTED VAGINAL DELIVERY,560,VAGINAL DELIVERY,14,"PREGNANCY, CHILDBIRTH AND THE PUERPERIUM",3,Major,Moderate,Medical,Private Health Insurance,,,,,false,34498.9,13079.07
New York City,Manhattan,7002053,001463,NYU Langone Hospitals,30 to 49,112,F,Other Race,Unknown,2,Elective,Home or Self Care,2019,PRG023,COMPLICATIONS SPECIFIED DURING CHILDBIRTH,PGN002,SPONTANEOUS VAGINAL DELIVERY,560,VAGINAL DELIVERY,14,"PREGNANCY, CHILDBIRTH AND THE PUERPERIUM",1,Minor,Minor,Medical,Private Health Insurance,,,,,false,23115.3,9576.15
New York City,Manhattan,7002053,001463,NYU Langone Hospitals,30 to 49,112,F,White,Not Span/Hispanic,4,Elective,Home or Self Care,2019,PRG029,"UNCOMPLICATED PREGNANCY, DELIVERY OR PUERPERIUM",MST021,PERINEAL MUSCLE LACERATION REPAIR (2ND DEGREE OBSTETRICAL AND OTHER),560,VAGINAL DELIVERY,14,"PREGNANCY, CHILDBIRTH AND THE PUERPERIUM",1,Minor,Minor,Medical,Private Health Insurance,,,,,false,39163.66,15889.66
New York City,Manhattan,7002053,001463,NYU Langone Hospitals,30 to 49,112,F,White,Not Span/Hispanic,2,Elective,Home or Self Care,2019,PRG023,COMPLICATIONS SPECIFIED DURING CHILDBIRTH,PGN002,SPONTANEOUS VAGINAL DELIVERY,560,VAGINAL DELIVERY,14,"PREGNANCY, CHILDBIRTH AND THE PUERPERIUM",1,Minor,Minor,Medical,Private Health Insurance,,,,,false,24819.82,9541.67
New York City,Manhattan,7002053,001463,NYU Langone Hospitals,30 to 49,100,F,Other Race,Not Span/Hispanic,4,Elective,Home or Self Care,2019,PRG019,DIABETES OR ABNORMAL GLUCOSE TOLERANCE COMPLICATING PREGNANCY; CHILDBIRTH; OR THE PUERPERIUM,PGN001,FETAL HEART RATE MONITORING,560,VAGINAL DELIVERY,14,"PREGNANCY, CHILDBIRTH AND THE PUERPERIUM",2,Moderate,Minor,Medical,Private Health Insurance,,,,,false,42503.34,16148.77
New York City,Manhattan,7002053,001463,NYU Langone Hospitals,30 to 49,112,F,White,Not Span/Hispanic,3,Elective,Home or Self Care,2019,PRG014,POLYHYDRAMNIOS AND OTHER PROBLEMS OF AMNIOTIC CAVITY,PGN002,SPONTANEOUS VAGINAL DELIVERY,560,VAGINAL DELIVERY,14,"PREGNANCY, CHILDBIRTH AND THE PUERPERIUM",2,Moderate,Minor,Medical,Private Health Insurance,,,,,false,31309.14,12473.36
New York City,Manhattan,7002053,001463,NYU Langone Hospitals,30 to 49,112,F,White,Not Span/Hispanic,2,Elective,Home or Self Care,2019,PRG023,COMPLICATIONS SPECIFIED DURING CHILDBIRTH,PGN002,SPONTANEOUS VAGINAL DELIVERY,560,VAGINAL DELIVERY,14,"PREGNANCY, CHILDBIRTH AND THE PUERPERIUM",2,Moderate,Minor,Medical,Private Health Insurance,,,,,false,25906.49,9613.03
New York City,Manhattan,7002053,001463,NYU Langone Hospitals,30 to 49,103,F,White,Not Span/Hispanic,2,Elective,Home or Self Care,2019,PRG022,PROLONGED PREGNANCY,PGN002,SPONTANEOUS VAGINAL DELIVERY,560,VAGINAL DELIVERY,14,"PREGNANCY, CHILDBIRTH AND THE PUERPERIUM",2,Moderate,Minor,Medical,Medicaid,,,,,false,35178.69,9963.77
New York City,Manhattan,7002053,001463,NYU Langone Hospitals,30 to 49,113,F,White,Not Span/Hispanic,2,Elective,Home or Self Care,2019,PRG026,OB-RELATED TRAUMA TO PERINEUM AND VULVA,PGN002,SPONTANEOUS VAGINAL DELIVERY,560,VAGINAL DELIVERY,14,"PREGNANCY, CHILDBIRTH AND THE PUERPERIUM",1,Minor,Minor,Medical,Private Health Insurance,,,,,false,23370.3,9436.75
New York City,Manhattan,7002053,001463,NYU Langone Hospitals,30 to 49,100,F,White,Not Span/Hispanic,1,Elective,Home or Self Care,2019,PRG029,"UNCOMPLICATED PREGNANCY, DELIVERY OR PUERPERIUM",PGN002,SPONTANEOUS VAGINAL DELIVERY,560,VAGINAL DELIVERY,14,"PREGNANCY, CHILDBIRTH AND THE PUERPERIUM",1,Minor,Minor,Medical,Blue Cross/Blue Shield,,,,,false,18167.27,6498.06
New York City,Manhattan,7002053,001463,NYU Langone Hospitals,30 to 49,101,F,White,Not Span/Hispanic,2,Elective,Home or Self Care,2019,PRG029,"UNCOMPLICATED PREGNANCY, DELIVERY OR PUERPERIUM",PGN002,SPONTANEOUS VAGINAL DELIVERY,560,VAGINAL DELIVERY,14,"PREGNANCY, CHILDBIRTH AND THE PUERPERIUM",1,Minor,Minor,Medical,Private Health Insurance,,,,,false,24513.86,9649.14
New York City,Manhattan,7002053,001463,NYU Langone Hospitals,30 to 49,112,F,White,Not Span/Hispanic,4,Elective,Home or Self Care,2019,PRG028,OTHER SPECIFIED COMPLICATIONS IN PREGNANCY,PGN002,SPONTANEOUS VAGINAL DELIVERY,560,VAGINAL DELIVERY,14,"PREGNANCY, CHILDBIRTH AND THE PUERPERIUM",1,Minor,Minor,Medical,Private Health Insurance,,,,,false,43446.51,16953.29
New York City,Manhattan,7002053,001463,NYU Langone Hospitals,30 to 49,112,F,White,Not Span/Hispanic,1,Elective,Home or Self Care,2019,PRG020,HYPERTENSION AND HYPERTENSIVE-RELATED CONDITIONS COMPLICATING PREGNANCY; CHILDBIRTH; AND THE PUERPERIUM,PGN002,SPONTANEOUS VAGINAL DELIVERY,560,VAGINAL DELIVERY,14,"PREGNANCY, CHILDBIRTH AND THE PUERPERIUM",1,Minor,Minor,Medical,Private Health Insurance,,,,,false,19565.6,6807.16
New York City,Manhattan,7002053,001463,NYU Langone Hospitals,18 to 29,112,F,White,Not Span/Hispanic,2,Elective,Home or Self Care,2019,PRG016,PREVIOUS C-SECTION,PGN004,ASSISTED VAGINAL DELIVERY,560,VAGINAL DELIVERY,14,"PREGNANCY, CHILDBIRTH AND THE PUERPERIUM",2,Moderate,Minor,Medical,Medicaid,,,,,false,23807.56,9448.56
New York City,Manhattan,7002053,001463,NYU Langone Hospitals,30 to 49,112,F,White,Not Span/Hispanic,1,Elective,Home or Self Care,2019,PRG023,COMPLICATIONS SPECIFIED DURING CHILDBIRTH,PGN002,SPONTANEOUS VAGINAL DELIVERY,560,VAGINAL DELIVERY,14,"PREGNANCY, CHILDBIRTH AND THE PUERPERIUM",1,Minor,Minor,Medical,Private Health Insurance,,,,,false,16151.66,6354.35
New York City,Manhattan,7002053,001463,NYU Langone Hospitals,30 to 49,100,F,White,Not Span/Hispanic,2,Elective,Home or Self Care,2019,PRG022,PROLONGED PREGNANCY,PGN002,SPONTANEOUS VAGINAL DELIVERY,560,VAGINAL DELIVERY,14,"PREGNANCY, CHILDBIRTH AND THE PUERPERIUM",2,Moderate,Minor,Medical,Private Health Insurance,,,,,false,23248.67,9370.43
New York City,Manhattan,7002053,001463,NYU Langone Hospitals,30 to 49,112,F,White,Not Span/Hispanic,2,Elective,Home or Self Care,2019,PRG016,PREVIOUS C-SECTION,PGN002,SPONTANEOUS VAGINAL DELIVERY,560,VAGINAL DELIVERY,14,"PREGNANCY, CHILDBIRTH AND THE PUERPERIUM",1,Minor,Minor,Medical,Private Health Insurance,Medicaid,,,,false,23917.92,9362.26
New York City,Manhattan,7002053,001463,NYU Langone Hospitals,30 to 49,112,F,White,Not Span/Hispanic,2,Elective,Home or Self Care,2019,PRG023,COMPLICATIONS SPECIFIED DURING CHILDBIRTH,PGN002,SPONTANEOUS VAGINAL DELIVERY,560,VAGINAL DELIVERY,14,"PREGNANCY, CHILDBIRTH AND THE PUERPERIUM",1,Minor,Minor,Medical,Private Health Insurance,,,,,false,24652.15,9928.44
New York City,Manhattan,7002053,001463,NYU Langone Hospitals,30 to 49,100,F,White,Not Span/Hispanic,2,Elective,Home or Self Care,2019,PRG010,HEMORRHAGE AFTER FIRST TRIMESTER,PGN001,FETAL HEART RATE MONITORING,560,VAGINAL DELIVERY,14,"PREGNANCY, CHILDBIRTH AND THE PUERPERIUM",2,Moderate,Minor,Medical,Private Health Insurance,,,,,false,24106.79,9651.05
New York City,Manhattan,7002053,001463,NYU Langone Hospitals,30 to 49,112,F,Other Race,Not Span/Hispanic,3,Elective,Home or Self Care,2019,PRG020,HYPERTENSION AND HYPERTENSIVE-RELATED CONDITIONS COMPLICATING PREGNANCY; CHILDBIRTH; AND THE PUERPERIUM,PGN002,SPONTANEOUS VAGINAL DELIVERY,560,VAGINAL DELIVERY,14,"PREGNANCY, CHILDBIRTH AND THE PUERPERIUM",2,Moderate,Minor,Medical,Medicaid,,,,,false,34419.71,13024.39
New York City,Manhattan,7002053,001463,NYU Langone Hospitals,30 to 49,113,F,Other Race,Not Span/Hispanic,2,Elective,Home or Self Care,2019,PRG023,COMPLICATIONS SPECIFIED DURING CHILDBIRTH,MST021,PERINEAL MUSCLE LACERATION REPAIR (2ND DEGREE OBSTETRICAL AND OTHER),560,VAGINAL DELIVERY,14,"PREGNANCY, CHILDBIRTH AND THE PUERPERIUM",1,Minor,Minor,Medical,Private Health Insurance,,,,,false,25203.38,9668.08
New York City,Manhattan,7002053,001463,NYU Langone Hospitals,30 to 49,103,F,White,Not Span/Hispanic,2,Elective,Home or Self Care,2019,PRG023,COMPLICATIONS SPECIFIED DURING CHILDBIRTH,PGN002,SPONTANEOUS VAGINAL DELIVERY,560,VAGINAL DELIVERY,14,"PREGNANCY, CHILDBIRTH AND THE PUERPERIUM",1,Minor,Minor,Medical,Blue Cross/Blue Shield,,,,,false,23637.42,9354.68