Hospital Service Area,Hospital County,Operating Certificate Number,Permanent Facility Id,Facility Name,Age Group,Zip Code - 3 digits,Gender,Race,Ethnicity,Length of Stay,Type of Admission,Patient Disposition,Discharge Year,CCS Diagnosis Code,CCS Diagnosis Description,CCS Procedure Code,CCS Procedure Description,APR DRG Code,APR DRG Description,APR MDC Code,APR MDC Description,APR Severity of Illness Code,APR Severity of Illness Description,APR Risk of Mortality,APR Medical Surgical Description,Payment Typology 1,Payment Typology 2,Payment Typology 3,Birth Weight,Abortion Edit Indicator,Emergency Department Indicator,Total Charges,Total Costs
Long Island,Nassau,2908000,000511,NYU Langone Hospital-Long Island,18 to 29,115,F,White,Spanish/Hispanic,3,Urgent,Home or Self Care,2019,PRG011,EARLY OR THREATENED LABOR,PGN001,FETAL HEART RATE MONITORING,565,FALSE LABOR,14,"PREGNANCY, CHILDBIRTH AND THE PUERPERIUM",1,Minor,Minor,Medical,Medicaid,Medicaid,,,,false,46227.43,8344.94
Long Island,Nassau,2908000,000511,NYU Langone Hospital-Long Island,30 to 49,117,F,Black/African American,Not Span/Hispanic,4,Urgent,Home or Self Care,2019,PRG011,EARLY OR THREATENED LABOR,PGN001,FETAL HEART RATE MONITORING,565,FALSE LABOR,14,"PREGNANCY, CHILDBIRTH AND THE PUERPERIUM",3,Major,Minor,Medical,Private Health Insurance,Medicaid,Medicaid,,,false,60383.08,10921.81
Long Island,Nassau,2908000,000511,NYU Langone Hospital-Long Island,18 to 29,113,F,White,Not Span/Hispanic,3,Urgent,Home or Self Care,2019,PRG011,EARLY OR THREATENED LABOR,PGN001,FETAL HEART RATE MONITORING,565,FALSE LABOR,14,"PREGNANCY, CHILDBIRTH AND THE PUERPERIUM",2,Moderate,Minor,Medical,Blue Cross/Blue Shield,,,,,false,60052.53,11314.16
Long Island,Nassau,2908000,000511,NYU Langone Hospital-Long Island,18 to 29,117,F,Other Race,Spanish/Hispanic,1,Urgent,Home or Self Care,2019,PRG011,EARLY OR THREATENED LABOR,PGN001,FETAL HEART RATE MONITORING,565,FALSE LABOR,14,"PREGNANCY, CHILDBIRTH AND THE PUERPERIUM",1,Minor,Minor,Medical,Medicaid,Medicaid,,,,false,20984.44,3308.07
Long Island,Nassau,2908000,000511,NYU Langone Hospital-Long Island,30 to 49,117,F,White,Not Span/Hispanic,2,Urgent,Home or Self Care,2019,PRG011,EARLY OR THREATENED LABOR,PGN001,FETAL HEART RATE MONITORING,565,FALSE LABOR,14,"PREGNANCY, CHILDBIRTH AND THE PUERPERIUM",3,Major,Minor,Medical,Blue Cross/Blue Shield,,,,,false,50772.18,8535.11
Long Island,Nassau,2908000,000511,NYU Langone Hospital-Long Island,18 to 29,115,F,Black/African American,Not Span/Hispanic,1,Urgent,Home or Self Care,2019,PRG011,EARLY OR THREATENED LABOR,PGN001,FETAL HEART RATE MONITORING,565,FALSE LABOR,14,"PREGNANCY, CHILDBIRTH AND THE PUERPERIUM",1,Minor,Minor,Medical,Private Health Insurance,Medicaid,Medicaid,,,false,12640.01,2318.26
Long Island,Nassau,2908000,000511,NYU Langone Hospital-Long Island,18 to 29,115,F,White,Spanish/Hispanic,1,Urgent,Home or Self Care,2019,PRG011,EARLY OR THREATENED LABOR,PGN001,FETAL HEART RATE MONITORING,565,FALSE LABOR,14,"PREGNANCY, CHILDBIRTH AND THE PUERPERIUM",1,Minor,Minor,Medical,Medicaid,Medicaid,,,,false,25128.64,4302.08
Long Island,Nassau,2908000,000511,NYU Langone Hospital-Long Island,0 to 17,115,F,Black/African American,Spanish/Hispanic,1,Urgent,Home or Self Care,2019,PRG011,EARLY OR THREATENED LABOR,PGN001,FETAL HEART RATE MONITORING,565,FALSE LABOR,14,"PREGNANCY, CHILDBIRTH AND THE PUERPERIUM",2,Moderate,Minor,Medical,Medicaid,Medicaid,,,,false,46494.77,7230.39
Long Island,Nassau,2908000,000511,NYU Langone Hospital-Long Island,30 to 49,115,F,White,Not Span/Hispanic,1,Elective,Home or Self Care,2019,PRG011,EARLY OR THREATENED LABOR,,,565,FALSE LABOR,14,"PREGNANCY, CHILDBIRTH AND THE PUERPERIUM",2,Moderate,Minor,Medical,Private Health Insurance,,,,,false,24159.12,3832.11
Long Island,Nassau,2908000,000511,NYU Langone Hospital-Long Island,30 to 49,112,F,White,Not Span/Hispanic,1,Elective,Home or Self Care,2019,PRG011,EARLY OR THREATENED LABOR,PGN001,FETAL HEART RATE MONITORING,565,FALSE LABOR,14,"PREGNANCY, CHILDBIRTH AND THE PUERPERIUM",1,Minor,Minor,Medical,Medicaid,,,,,false,14449.78,2474.65
