Hospital Service Area,Hospital County,Operating Certificate Number,Permanent Facility Id,Facility Name,Age Group,Zip Code - 3 digits,Gender,Race,Ethnicity,Length of Stay,Type of Admission,Patient Disposition,Discharge Year,CCS Diagnosis Code,CCS Diagnosis Description,CCS Procedure Code,CCS Procedure Description,APR DRG Code,APR DRG Description,APR MDC Code,APR MDC Description,APR Severity of Illness Code,APR Severity of Illness Description,APR Risk of Mortality,APR Medical Surgical Description,Payment Typology 1,Payment Typology 2,Payment Typology 3,Birth Weight,Abortion Edit Indicator,Emergency Department Indicator,Total Charges,Total Costs
New York City,Manhattan,7002001,001438,Bellevue Hospital Center,30 to 49,100,M,Other Race,Not Span/Hispanic,1,Emergency,Home or Self Care,2017,228,Skull and face fractures,177,COMP AXIAL TOMOGR (CT),057,"Concussion, closed skull Fx nos,uncomplicated intracranial injury, coma < 1 hr or no coma",01,Diseases and Disorders of the Nervous System,2,Moderate,Minor,Medical,Miscellaneous/Other,Private Health Insurance,,,N,Y,19967.40,12873.94
New York City,Manhattan,7002001,001438,Bellevue Hospital Center,0 to 17,112,M,White,Not Span/Hispanic,1,Emergency,Home or Self Care,2017,233,Intracranial injury,177,COMP AXIAL TOMOGR (CT),057,"Concussion, closed skull Fx nos,uncomplicated intracranial injury, coma < 1 hr or no coma",01,Diseases and Disorders of the Nervous System,1,Minor,Minor,Medical,Miscellaneous/Other,,,,N,Y,11922.21,7686.82
New York City,Manhattan,7002001,001438,Bellevue Hospital Center,18 to 29,100,M,Black/African American,Not Span/Hispanic,2,Emergency,Home or Self Care,2017,233,Intracranial injury,177,COMP AXIAL TOMOGR (CT),057,"Concussion, closed skull Fx nos,uncomplicated intracranial injury, coma < 1 hr or no coma",01,Diseases and Disorders of the Nervous System,3,Major,Moderate,Medical,Miscellaneous/Other,,,,N,Y,26439.35,17046.72
New York City,Manhattan,7002001,001438,Bellevue Hospital Center,18 to 29,112,M,Other Race,Not Span/Hispanic,1,Emergency,Home or Self Care,2017,233,Intracranial injury,177,COMP AXIAL TOMOGR (CT),057,"Concussion, closed skull Fx nos,uncomplicated intracranial injury, coma < 1 hr or no coma",01,Diseases and Disorders of the Nervous System,1,Minor,Minor,Medical,Medicaid,Medicaid,,,N,Y,9442.97,6088.34
New York City,Manhattan,7002001,001438,Bellevue Hospital Center,18 to 29,100,M,Black/African American,Not Span/Hispanic,2,Emergency,Home or Self Care,2017,233,Intracranial injury,177,COMP AXIAL TOMOGR (CT),057,"Concussion, closed skull Fx nos,uncomplicated intracranial injury, coma < 1 hr or no coma",01,Diseases and Disorders of the Nervous System,1,Minor,Minor,Medical,Medicaid,,,,N,Y,16821.86,10845.86
New York City,Manhattan,7002001,001438,Bellevue Hospital Center,0 to 17,100,F,Black/African American,Not Span/Hispanic,1,Emergency,Home or Self Care,2017,233,Intracranial injury,000,NO PROC,057,"Concussion, closed skull Fx nos,uncomplicated intracranial injury, coma < 1 hr or no coma",01,Diseases and Disorders of the Nervous System,1,Minor,Minor,Medical,Private Health Insurance,,,,N,Y,9843.25,6346.42
New York City,Manhattan,7002001,001438,Bellevue Hospital Center,18 to 29,100,M,White,Not Span/Hispanic,3,Emergency,Home or Self Care,2017,233,Intracranial injury,000,NO PROC,057,"Concussion, closed skull Fx nos,uncomplicated intracranial injury, coma < 1 hr or no coma",01,Diseases and Disorders of the Nervous System,2,Moderate,Minor,Medical,Private Health Insurance,,,,N,N,18504.47,11930.72
New York City,Manhattan,7002001,001438,Bellevue Hospital Center,30 to 49,113,M,Other Race,Not Span/Hispanic,1,Emergency,Home or Self Care,2017,233,Intracranial injury,000,NO PROC,057,"Concussion, closed skull Fx nos,uncomplicated intracranial injury, coma < 1 hr or no coma",01,Diseases and Disorders of the Nervous System,1,Minor,Minor,Medical,Medicaid,Medicaid,,,N,Y,10109.45,6518.05
New York City,Manhattan,7002001,001438,Bellevue Hospital Center,50 to 69,100,M,Other Race,Spanish/Hispanic,2,Emergency,Home or Self Care,2017,228,Skull and face fractures,219,ALCO/DRUG REHAB/DETOX,057,"Concussion, closed skull Fx nos,uncomplicated intracranial injury, coma < 1 hr or no coma",01,Diseases and Disorders of the Nervous System,3,Major,Moderate,Medical,Medicaid,,,,N,Y,24895.45,16051.29
New York City,Manhattan,7002001,001438,Bellevue Hospital Center,18 to 29,100,M,Other Race,Spanish/Hispanic,1,Emergency,Home or Self Care,2017,228,Skull and face fractures,177,COMP AXIAL TOMOGR (CT),057,"Concussion, closed skull Fx nos,uncomplicated intracranial injury, coma < 1 hr or no coma",01,Diseases and Disorders of the Nervous System,1,Minor,Minor,Medical,Medicaid,,,,N,N,11955.48,7708.27
New York City,Manhattan,7002001,001438,Bellevue Hospital Center,70 or Older,112,M,Other Race,Spanish/Hispanic,23,Emergency,Skilled Nursing Home,2017,233,Intracranial injury,008,OT NON-OR THER NERV SYS,057,"Concussion, closed skull Fx nos,uncomplicated intracranial injury, coma < 1 hr or no coma",01,Diseases and Disorders of the Nervous System,4,Extreme,Extreme,Medical,Medicare,Medicare,,,N,N,147469.34,95080.56
New York City,Manhattan,7002001,001438,Bellevue Hospital Center,70 or Older,100,F,White,Not Span/Hispanic,1,Emergency,Home or Self Care,2017,233,Intracranial injury,177,COMP AXIAL TOMOGR (CT),057,"Concussion, closed skull Fx nos,uncomplicated intracranial injury, coma < 1 hr or no coma",01,Diseases and Disorders of the Nervous System,1,Minor,Minor,Medical,Medicare,Private Health Insurance,,,N,Y,11958.92,7710.49
New York City,Manhattan,7002001,001438,Bellevue Hospital Center,50 to 69,100,M,Other Race,Spanish/Hispanic,5,Emergency,Home or Self Care,2017,228,Skull and face fractures,177,COMP AXIAL TOMOGR (CT),057,"Concussion, closed skull Fx nos,uncomplicated intracranial injury, coma < 1 hr or no coma",01,Diseases and Disorders of the Nervous System,2,Moderate,Minor,Medical,Medicaid,Medicaid,,,N,Y,41912.46,27022.97
New York City,Manhattan,7002001,001438,Bellevue Hospital Center,30 to 49,112,F,Black/African American,Not Span/Hispanic,1,Emergency,Home or Self Care,2017,233,Intracranial injury,177,COMP AXIAL TOMOGR (CT),057,"Concussion, closed skull Fx nos,uncomplicated intracranial injury, coma < 1 hr or no coma",01,Diseases and Disorders of the Nervous System,2,Moderate,Minor,Medical,Medicaid,Medicaid,,,N,Y,11871.96,7654.42
New York City,Manhattan,7002001,001438,Bellevue Hospital Center,18 to 29,114,M,Other Race,Not Span/Hispanic,1,Emergency,Home or Self Care,2017,228,Skull and face fractures,177,COMP AXIAL TOMOGR (CT),057,"Concussion, closed skull Fx nos,uncomplicated intracranial injury, coma < 1 hr or no coma",01,Diseases and Disorders of the Nervous System,1,Minor,Minor,Medical,Self-Pay,,,,N,Y,10868.66,7007.55
New York City,Manhattan,7002001,001438,Bellevue Hospital Center,50 to 69,100,F,Other Race,Not Span/Hispanic,5,Emergency,Skilled Nursing Home,2017,233,Intracranial injury,171,SUTURE SKIN/SUBCUT TISS,057,"Concussion, closed skull Fx nos,uncomplicated intracranial injury, coma < 1 hr or no coma",01,Diseases and Disorders of the Nervous System,1,Minor,Minor,Medical,Medicare,Medicare,Medicaid,,N,Y,30369.26,19580.52
New York City,Manhattan,7002001,001438,Bellevue Hospital Center,50 to 69,100,M,Black/African American,Not Span/Hispanic,1,Emergency,Home or Self Care,2017,233,Intracranial injury,177,COMP AXIAL TOMOGR (CT),057,"Concussion, closed skull Fx nos,uncomplicated intracranial injury, coma < 1 hr or no coma",01,Diseases and Disorders of the Nervous System,2,Moderate,Minor,Medical,Medicaid,Medicaid,,,N,N,11157.41,7193.72
New York City,Manhattan,7002001,001438,Bellevue Hospital Center,50 to 69,100,F,Other Race,Not Span/Hispanic,1,Emergency,Home w/ Home Health Services,2017,233,Intracranial injury,177,COMP AXIAL TOMOGR (CT),057,"Concussion, closed skull Fx nos,uncomplicated intracranial injury, coma < 1 hr or no coma",01,Diseases and Disorders of the Nervous System,2,Moderate,Minor,Medical,Medicare,Medicare,Medicaid,,N,Y,13821.06,8911.10
New York City,Manhattan,7002001,001438,Bellevue Hospital Center,30 to 49,OOS,M,Other Race,Not Span/Hispanic,1,Emergency,Home or Self Care,2017,233,Intracranial injury,222,BLOOD TRANSFUSION,057,"Concussion, closed skull Fx nos,uncomplicated intracranial injury, coma < 1 hr or no coma",01,Diseases and Disorders of the Nervous System,1,Minor,Minor,Medical,Self-Pay,,,,N,Y,12627.89,8141.81
New York City,Manhattan,7002001,001438,Bellevue Hospital Center,18 to 29,113,M,Other Race,Not Span/Hispanic,1,Emergency,Home or Self Care,2017,233,Intracranial injury,231,OTHER THERAPEUTIC PRCS,057,"Concussion, closed skull Fx nos,uncomplicated intracranial injury, coma < 1 hr or no coma",01,Diseases and Disorders of the Nervous System,2,Moderate,Moderate,Medical,Private Health Insurance,,,,N,Y,8545.85,5509.92
New York City,Manhattan,7002001,001438,Bellevue Hospital Center,50 to 69,112,F,Black/African American,Not Span/Hispanic,4,Emergency,Home w/ Home Health Services,2017,233,Intracranial injury,000,NO PROC,057,"Concussion, closed skull Fx nos,uncomplicated intracranial injury, coma < 1 hr or no coma",01,Diseases and Disorders of the Nervous System,2,Moderate,Minor,Medical,Medicaid,,,,N,N,31746.99,20468.81
New York City,Manhattan,7002001,001438,Bellevue Hospital Center,30 to 49,114,M,Other Race,Not Span/Hispanic,1,Emergency,Home or Self Care,2017,233,Intracranial injury,177,COMP AXIAL TOMOGR (CT),057,"Concussion, closed skull Fx nos,uncomplicated intracranial injury, coma < 1 hr or no coma",01,Diseases and Disorders of the Nervous System,1,Minor,Minor,Medical,Private Health Insurance,,,,N,Y,18600.46,11992.61
New York City,Manhattan,7002001,001438,Bellevue Hospital Center,30 to 49,112,M,Black/African American,Not Span/Hispanic,2,Emergency,Home or Self Care,2017,233,Intracranial injury,177,COMP AXIAL TOMOGR (CT),057,"Concussion, closed skull Fx nos,uncomplicated intracranial injury, coma < 1 hr or no coma",01,Diseases and Disorders of the Nervous System,1,Minor,Minor,Medical,Medicaid,Medicaid,,,N,N,13476.20,8688.75
New York City,Manhattan,7002001,001438,Bellevue Hospital Center,50 to 69,OOS,M,Other Race,Not Span/Hispanic,13,Emergency,Inpatient Rehabilitation Facility,2017,233,Intracranial injury,177,COMP AXIAL TOMOGR (CT),057,"Concussion, closed skull Fx nos,uncomplicated intracranial injury, coma < 1 hr or no coma",01,Diseases and Disorders of the Nervous System,1,Minor,Minor,Medical,Blue Cross/Blue Shield,,,,N,Y,89422.89,57655.23
New York City,Manhattan,7002001,001438,Bellevue Hospital Center,30 to 49,113,M,Other Race,Spanish/Hispanic,2,Emergency,Home or Self Care,2017,233,Intracranial injury,000,NO PROC,057,"Concussion, closed skull Fx nos,uncomplicated intracranial injury, coma < 1 hr or no coma",01,Diseases and Disorders of the Nervous System,2,Moderate,Minor,Medical,Self-Pay,,,,N,N,14856.17,9578.49
New York City,Manhattan,7002001,001438,Bellevue Hospital Center,0 to 17,104,M,Other Race,Spanish/Hispanic,1,Emergency,Home or Self Care,2017,228,Skull and face fractures,177,COMP AXIAL TOMOGR (CT),057,"Concussion, closed skull Fx nos,uncomplicated intracranial injury, coma < 1 hr or no coma",01,Diseases and Disorders of the Nervous System,1,Minor,Minor,Medical,Medicaid,Medicaid,,,N,Y,7816.47,5039.65
New York City,Manhattan,7002001,001438,Bellevue Hospital Center,30 to 49,112,F,Other Race,Not Span/Hispanic,1,Emergency,Home or Self Care,2017,233,Intracranial injury,180,OTHER CT SCAN,057,"Concussion, closed skull Fx nos,uncomplicated intracranial injury, coma < 1 hr or no coma",01,Diseases and Disorders of the Nervous System,1,Minor,Minor,Medical,Private Health Insurance,,,,N,N,9636.90,6213.37
New York City,Manhattan,7002001,001438,Bellevue Hospital Center,70 or Older,100,M,White,Not Span/Hispanic,1,Emergency,Left Against Medical Advice,2017,228,Skull and face fractures,231,OTHER THERAPEUTIC PRCS,057,"Concussion, closed skull Fx nos,uncomplicated intracranial injury, coma < 1 hr or no coma",01,Diseases and Disorders of the Nervous System,1,Minor,Moderate,Medical,Medicare,Medicare,,,N,Y,13864.17,8938.90
New York City,Manhattan,7002001,001438,Bellevue Hospital Center,30 to 49,104,M,Other Race,Not Span/Hispanic,1,Emergency,Home or Self Care,2017,233,Intracranial injury,216,RESP INTUB/MECH VENTIL,057,"Concussion, closed skull Fx nos,uncomplicated intracranial injury, coma < 1 hr or no coma",01,Diseases and Disorders of the Nervous System,3,Major,Extreme,Medical,Miscellaneous/Other,,,,N,Y,17071.28,11006.67
New York City,Manhattan,7002001,001438,Bellevue Hospital Center,30 to 49,112,M,Other Race,Not Span/Hispanic,1,Emergency,Home or Self Care,2017,233,Intracranial injury,177,COMP AXIAL TOMOGR (CT),057,"Concussion, closed skull Fx nos,uncomplicated intracranial injury, coma < 1 hr or no coma",01,Diseases and Disorders of the Nervous System,1,Minor,Minor,Medical,Self-Pay,,,,N,Y,18397.74,11861.91
New York City,Manhattan,7002001,001438,Bellevue Hospital Center,50 to 69,113,M,White,Not Span/Hispanic,9,Emergency,Home or Self Care,2017,233,Intracranial injury,039,INCISION OF PLEURA,057,"Concussion, closed skull Fx nos,uncomplicated intracranial injury, coma < 1 hr or no coma",01,Diseases and Disorders of the Nervous System,4,Extreme,Major,Medical,Medicaid,,,,N,N,51419.06,33152.34
New York City,Manhattan,7002001,001438,Bellevue Hospital Center,70 or Older,100,M,Other Race,Not Span/Hispanic,3,Emergency,Home or Self Care,2017,233,Intracranial injury,177,COMP AXIAL TOMOGR (CT),057,"Concussion, closed skull Fx nos,uncomplicated intracranial injury, coma < 1 hr or no coma",01,Diseases and Disorders of the Nervous System,2,Moderate,Major,Medical,Medicare,Medicare,Medicaid,,N,Y,27017.40,17419.41
