Hospital Service Area,Hospital County,Operating Certificate Number,Permanent Facility Id,Facility Name,Age Group,Zip Code - 3 digits,Gender,Race,Ethnicity,Length of Stay,Type of Admission,Patient Disposition,Discharge Year,CCS Diagnosis Code,CCS Diagnosis Description,CCS Procedure Code,CCS Procedure Description,APR DRG Code,APR DRG Description,APR MDC Code,APR MDC Description,APR Severity of Illness Code,APR Severity of Illness Description,APR Risk of Mortality,APR Medical Surgical Description,Payment Typology 1,Payment Typology 2,Payment Typology 3,Birth Weight,Abortion Edit Indicator,Emergency Department Indicator,Total Charges,Total Costs
Long Island,Suffolk,5123000,000885,Brookhaven Memorial Hospital Medical Center Inc,70 or Older,119,F,White,Not Span/Hispanic,2,Emergency,Home or Self Care,2017,233,Intracranial injury,000,NO PROC,057,"Concussion, closed skull Fx nos,uncomplicated intracranial injury, coma < 1 hr or no coma",01,Diseases and Disorders of the Nervous System,2,Moderate,Moderate,Medical,Medicare,Medicare,Private Health Insurance,,N,Y,29471.02,3527.48
Long Island,Suffolk,5123000,000885,Brookhaven Memorial Hospital Medical Center Inc,50 to 69,119,M,White,Not Span/Hispanic,11,Emergency,Home w/ Home Health Services,2017,233,Intracranial injury,219,ALCO/DRUG REHAB/DETOX,057,"Concussion, closed skull Fx nos,uncomplicated intracranial injury, coma < 1 hr or no coma",01,Diseases and Disorders of the Nervous System,4,Extreme,Extreme,Medical,Medicare,Medicare,Medicaid,,N,Y,113505.83,20131.16
Long Island,Suffolk,5123000,000885,Brookhaven Memorial Hospital Medical Center Inc,50 to 69,117,F,White,Not Span/Hispanic,3,Emergency,Skilled Nursing Home,2017,233,Intracranial injury,000,NO PROC,057,"Concussion, closed skull Fx nos,uncomplicated intracranial injury, coma < 1 hr or no coma",01,Diseases and Disorders of the Nervous System,3,Major,Moderate,Medical,Medicare,Medicare,Medicaid,,N,Y,38374.43,6023.10
Long Island,Suffolk,5123000,000885,Brookhaven Memorial Hospital Medical Center Inc,18 to 29,117,M,Black/African American,Not Span/Hispanic,3,Emergency,Left Against Medical Advice,2017,228,Skull and face fractures,216,RESP INTUB/MECH VENTIL,057,"Concussion, closed skull Fx nos,uncomplicated intracranial injury, coma < 1 hr or no coma",01,Diseases and Disorders of the Nervous System,2,Moderate,Extreme,Medical,Private Health Insurance,Private Health Insurance,,,N,Y,111144.53,10317.28
Long Island,Suffolk,5123000,000885,Brookhaven Memorial Hospital Medical Center Inc,18 to 29,119,F,White,Not Span/Hispanic,4,Emergency,Home or Self Care,2017,233,Intracranial injury,000,NO PROC,057,"Concussion, closed skull Fx nos,uncomplicated intracranial injury, coma < 1 hr or no coma",01,Diseases and Disorders of the Nervous System,2,Moderate,Minor,Medical,Private Health Insurance,,,,N,Y,59282.80,6850.72
Long Island,Suffolk,5123000,000885,Brookhaven Memorial Hospital Medical Center Inc,18 to 29,119,M,Black/African American,Not Span/Hispanic,1,Emergency,Left Against Medical Advice,2017,233,Intracranial injury,219,ALCO/DRUG REHAB/DETOX,057,"Concussion, closed skull Fx nos,uncomplicated intracranial injury, coma < 1 hr or no coma",01,Diseases and Disorders of the Nervous System,1,Minor,Minor,Medical,Private Health Insurance,Private Health Insurance,,,N,Y,40781.48,2552.49
Long Island,Suffolk,5123000,000885,Brookhaven Memorial Hospital Medical Center Inc,30 to 49,117,F,White,Not Span/Hispanic,4,Emergency,Home or Self Care,2017,233,Intracranial injury,199,ELECTROENCEPHALOGRAM,057,"Concussion, closed skull Fx nos,uncomplicated intracranial injury, coma < 1 hr or no coma",01,Diseases and Disorders of the Nervous System,2,Moderate,Minor,Medical,Blue Cross/Blue Shield,,,,N,Y,51780.84,6873.75
Long Island,Suffolk,5123000,000885,Brookhaven Memorial Hospital Medical Center Inc,70 or Older,119,M,White,Not Span/Hispanic,3,Emergency,Home or Self Care,2017,233,Intracranial injury,000,NO PROC,057,"Concussion, closed skull Fx nos,uncomplicated intracranial injury, coma < 1 hr or no coma",01,Diseases and Disorders of the Nervous System,2,Moderate,Minor,Medical,Private Health Insurance,Medicare,,,N,Y,83332.92,8957.47
Long Island,Suffolk,5123000,000885,Brookhaven Memorial Hospital Medical Center Inc,18 to 29,117,F,White,Not Span/Hispanic,1,Emergency,Short-term Hospital,2017,233,Intracranial injury,216,RESP INTUB/MECH VENTIL,057,"Concussion, closed skull Fx nos,uncomplicated intracranial injury, coma < 1 hr or no coma",01,Diseases and Disorders of the Nervous System,4,Extreme,Extreme,Medical,Private Health Insurance,,,,N,Y,44730.29,4277.73
Long Island,Suffolk,5123000,000885,Brookhaven Memorial Hospital Medical Center Inc,50 to 69,119,F,Black/African American,Not Span/Hispanic,5,Emergency,Home or Self Care,2017,233,Intracranial injury,000,NO PROC,057,"Concussion, closed skull Fx nos,uncomplicated intracranial injury, coma < 1 hr or no coma",01,Diseases and Disorders of the Nervous System,2,Moderate,Minor,Medical,Private Health Insurance,Private Health Insurance,,,N,Y,60200.15,7773.05
Long Island,Suffolk,5123000,000885,Brookhaven Memorial Hospital Medical Center Inc,18 to 29,119,M,White,Not Span/Hispanic,6,Emergency,Home or Self Care,2017,233,Intracranial injury,198,MAG RESONANCE IMAGING,057,"Concussion, closed skull Fx nos,uncomplicated intracranial injury, coma < 1 hr or no coma",01,Diseases and Disorders of the Nervous System,1,Minor,Minor,Medical,Private Health Insurance,Private Health Insurance,,,N,N,65960.27,9888.84
Long Island,Suffolk,5123000,000885,Brookhaven Memorial Hospital Medical Center Inc,30 to 49,117,F,White,Not Span/Hispanic,2,Emergency,Left Against Medical Advice,2017,233,Intracranial injury,219,ALCO/DRUG REHAB/DETOX,057,"Concussion, closed skull Fx nos,uncomplicated intracranial injury, coma < 1 hr or no coma",01,Diseases and Disorders of the Nervous System,3,Major,Moderate,Medical,Medicaid,,,,N,Y,56069.28,4357.28
Long Island,Suffolk,5123000,000885,Brookhaven Memorial Hospital Medical Center Inc,30 to 49,117,M,Black/African American,Not Span/Hispanic,3,Emergency,Home or Self Care,2017,233,Intracranial injury,000,NO PROC,057,"Concussion, closed skull Fx nos,uncomplicated intracranial injury, coma < 1 hr or no coma",01,Diseases and Disorders of the Nervous System,1,Minor,Minor,Medical,Private Health Insurance,,,,N,Y,86217.48,6809.25
Long Island,Suffolk,5123000,000885,Brookhaven Memorial Hospital Medical Center Inc,70 or Older,117,M,White,Not Span/Hispanic,4,Emergency,Skilled Nursing Home,2017,233,Intracranial injury,000,NO PROC,057,"Concussion, closed skull Fx nos,uncomplicated intracranial injury, coma < 1 hr or no coma",01,Diseases and Disorders of the Nervous System,2,Moderate,Moderate,Medical,Medicare,Medicare,Blue Cross/Blue Shield,,N,Y,72189.37,8492.36
