Hospital Service Area,Hospital County,Operating Certificate Number,Permanent Facility Id,Facility Name,Age Group,Zip Code - 3 digits,Gender,Race,Ethnicity,Length of Stay,Type of Admission,Patient Disposition,Discharge Year,CCS Diagnosis Code,CCS Diagnosis Description,CCS Procedure Code,CCS Procedure Description,APR DRG Code,APR DRG Description,APR MDC Code,APR MDC Description,APR Severity of Illness Code,APR Severity of Illness Description,APR Risk of Mortality,APR Medical Surgical Description,Payment Typology 1,Payment Typology 2,Payment Typology 3,Birth Weight,Abortion Edit Indicator,Emergency Department Indicator,Total Charges,Total Costs
Long Island,Suffolk,5123000,000885,Brookhaven Memorial Hospital Medical Center Inc,70 or Older,117,F,White,Not Span/Hispanic,5,Emergency,Skilled Nursing Home,2017,095,Other nervous system disorders,000,NO PROC,058,Other disorders of nervous system,01,Diseases and Disorders of the Nervous System,1,Minor,Moderate,Medical,Medicare,Medicare,Medicaid,,N,Y,36491.07,6809.53
Long Island,Suffolk,5123000,000885,Brookhaven Memorial Hospital Medical Center Inc,70 or Older,117,M,Black/African American,Not Span/Hispanic,5,Emergency,Skilled Nursing Home,2017,095,Other nervous system disorders,000,NO PROC,058,Other disorders of nervous system,01,Diseases and Disorders of the Nervous System,3,Major,Moderate,Medical,Medicare,Medicare,Medicaid,,N,Y,37784.81,6865.96
Long Island,Suffolk,5123000,000885,Brookhaven Memorial Hospital Medical Center Inc,50 to 69,119,F,White,Not Span/Hispanic,3,Emergency,Home or Self Care,2017,095,Other nervous system disorders,000,NO PROC,058,Other disorders of nervous system,01,Diseases and Disorders of the Nervous System,1,Minor,Minor,Medical,Medicare,Medicare,Blue Cross/Blue Shield,,N,Y,26851.29,4829.22
Long Island,Suffolk,5123000,000885,Brookhaven Memorial Hospital Medical Center Inc,50 to 69,117,M,White,Not Span/Hispanic,2,Emergency,Home or Self Care,2017,238,Complications of surgical procedures or medical care,000,NO PROC,058,Other disorders of nervous system,01,Diseases and Disorders of the Nervous System,2,Moderate,Minor,Medical,Private Health Insurance,Blue Cross/Blue Shield,,,N,Y,30201.32,4020.42
Long Island,Suffolk,5123000,000885,Brookhaven Memorial Hospital Medical Center Inc,50 to 69,119,F,White,Not Span/Hispanic,1,Emergency,Short-term Hospital,2017,095,Other nervous system disorders,216,RESP INTUB/MECH VENTIL,058,Other disorders of nervous system,01,Diseases and Disorders of the Nervous System,3,Major,Extreme,Medical,Private Health Insurance,,,,N,Y,20492.62,2799.80
Long Island,Suffolk,5123000,000885,Brookhaven Memorial Hospital Medical Center Inc,70 or Older,117,M,White,Not Span/Hispanic,2,Emergency,Skilled Nursing Home,2017,113,Late effects of cerebrovascular disease,000,NO PROC,058,Other disorders of nervous system,01,Diseases and Disorders of the Nervous System,1,Minor,Moderate,Medical,Medicare,Medicare,Private Health Insurance,,N,Y,18526.68,3063.37
Long Island,Suffolk,5123000,000885,Brookhaven Memorial Hospital Medical Center Inc,70 or Older,117,F,Other Race,Not Span/Hispanic,3,Emergency,Skilled Nursing Home,2017,211,Other connective tissue disease,000,NO PROC,058,Other disorders of nervous system,01,Diseases and Disorders of the Nervous System,2,Moderate,Major,Medical,Medicare,,,,N,Y,25147.02,4465.40
Long Island,Suffolk,5123000,000885,Brookhaven Memorial Hospital Medical Center Inc,50 to 69,119,M,White,Not Span/Hispanic,6,Emergency,Skilled Nursing Home,2017,095,Other nervous system disorders,216,RESP INTUB/MECH VENTIL,058,Other disorders of nervous system,01,Diseases and Disorders of the Nervous System,1,Minor,Minor,Medical,Medicare,Medicare,,,N,Y,38840.82,7819.99
Long Island,Suffolk,5123000,000885,Brookhaven Memorial Hospital Medical Center Inc,70 or Older,119,M,White,Not Span/Hispanic,9,Emergency,Expired,2017,095,Other nervous system disorders,216,RESP INTUB/MECH VENTIL,058,Other disorders of nervous system,01,Diseases and Disorders of the Nervous System,2,Moderate,Major,Medical,Medicare,Medicare,Medicaid,,N,Y,73808.75,13270.11
Long Island,Suffolk,5123000,000885,Brookhaven Memorial Hospital Medical Center Inc,70 or Older,119,F,White,Not Span/Hispanic,10,Emergency,Skilled Nursing Home,2017,095,Other nervous system disorders,108,INDWELLING CATHETER,058,Other disorders of nervous system,01,Diseases and Disorders of the Nervous System,1,Minor,Major,Medical,Medicare,,,,N,Y,81324.35,13021.66
Long Island,Suffolk,5123000,000885,Brookhaven Memorial Hospital Medical Center Inc,70 or Older,119,M,White,Not Span/Hispanic,4,Emergency,Hospice - Home,2017,211,Other connective tissue disease,000,NO PROC,058,Other disorders of nervous system,01,Diseases and Disorders of the Nervous System,2,Moderate,Major,Medical,Self-Pay,,,,N,Y,27826.75,5094.12
Long Island,Suffolk,5123000,000885,Brookhaven Memorial Hospital Medical Center Inc,70 or Older,119,M,White,Not Span/Hispanic,4,Emergency,Skilled Nursing Home,2017,211,Other connective tissue disease,000,NO PROC,058,Other disorders of nervous system,01,Diseases and Disorders of the Nervous System,1,Minor,Moderate,Medical,Medicare,Blue Cross/Blue Shield,,,N,Y,49251.84,6257.44
Long Island,Suffolk,5123000,000885,Brookhaven Memorial Hospital Medical Center Inc,50 to 69,OOS,M,White,Not Span/Hispanic,1,Emergency,Left Against Medical Advice,2017,095,Other nervous system disorders,222,BLOOD TRANSFUSION,058,Other disorders of nervous system,01,Diseases and Disorders of the Nervous System,3,Major,Moderate,Medical,Self-Pay,,,,N,Y,51956.89,6134.27
Long Island,Suffolk,5123000,000885,Brookhaven Memorial Hospital Medical Center Inc,70 or Older,119,F,White,Not Span/Hispanic,7,Emergency,Skilled Nursing Home,2017,095,Other nervous system disorders,000,NO PROC,058,Other disorders of nervous system,01,Diseases and Disorders of the Nervous System,1,Minor,Moderate,Medical,Medicare,Medicare,,,N,Y,63656.67,9358.79
Long Island,Suffolk,5123000,000885,Brookhaven Memorial Hospital Medical Center Inc,70 or Older,117,M,Black/African American,Not Span/Hispanic,4,Emergency,Skilled Nursing Home,2017,095,Other nervous system disorders,000,NO PROC,058,Other disorders of nervous system,01,Diseases and Disorders of the Nervous System,1,Minor,Major,Medical,Medicare,Medicare,,,N,Y,28223.77,5276.27
Long Island,Suffolk,5123000,000885,Brookhaven Memorial Hospital Medical Center Inc,70 or Older,117,M,White,Not Span/Hispanic,2,Emergency,Skilled Nursing Home,2017,095,Other nervous system disorders,000,NO PROC,058,Other disorders of nervous system,01,Diseases and Disorders of the Nervous System,2,Moderate,Major,Medical,Medicare,Medicare,,,N,Y,23205.67,3225.51
Long Island,Suffolk,5123000,000885,Brookhaven Memorial Hospital Medical Center Inc,70 or Older,117,M,White,Not Span/Hispanic,5,Emergency,Skilled Nursing Home,2017,095,Other nervous system disorders,000,NO PROC,058,Other disorders of nervous system,01,Diseases and Disorders of the Nervous System,1,Minor,Moderate,Medical,Medicare,Medicare,Private Health Insurance,,N,Y,41876.56,7073.33
Long Island,Suffolk,5123000,000885,Brookhaven Memorial Hospital Medical Center Inc,70 or Older,117,F,White,Not Span/Hispanic,4,Emergency,Skilled Nursing Home,2017,095,Other nervous system disorders,199,ELECTROENCEPHALOGRAM,058,Other disorders of nervous system,01,Diseases and Disorders of the Nervous System,2,Moderate,Moderate,Medical,Medicare,,,,N,Y,63661.72,8765.17
Long Island,Suffolk,5123000,000885,Brookhaven Memorial Hospital Medical Center Inc,50 to 69,119,M,Other Race,Not Span/Hispanic,1,Emergency,Home or Self Care,2017,082,Paralysis,000,NO PROC,058,Other disorders of nervous system,01,Diseases and Disorders of the Nervous System,2,Moderate,Minor,Medical,Blue Cross/Blue Shield,,,,N,Y,34467.13,4031.16
Long Island,Suffolk,5123000,000885,Brookhaven Memorial Hospital Medical Center Inc,70 or Older,119,F,White,Not Span/Hispanic,3,Emergency,Home or Self Care,2017,095,Other nervous system disorders,148,OT FRACTURE/DISLOC PRC,058,Other disorders of nervous system,01,Diseases and Disorders of the Nervous System,3,Major,Moderate,Medical,Medicare,Private Health Insurance,,,N,Y,36639.72,5077.38
Long Island,Suffolk,5123000,000885,Brookhaven Memorial Hospital Medical Center Inc,70 or Older,119,F,White,Not Span/Hispanic,2,Emergency,Home w/ Home Health Services,2017,095,Other nervous system disorders,000,NO PROC,058,Other disorders of nervous system,01,Diseases and Disorders of the Nervous System,3,Major,Major,Medical,Medicare,Medicare,Blue Cross/Blue Shield,,N,Y,26147.59,3565.69
Long Island,Suffolk,5123000,000885,Brookhaven Memorial Hospital Medical Center Inc,30 to 49,119,M,Black/African American,Not Span/Hispanic,76,Emergency,Home w/ Home Health Services,2017,095,Other nervous system disorders,000,NO PROC,058,Other disorders of nervous system,01,Diseases and Disorders of the Nervous System,3,Major,Major,Medical,Private Health Insurance,,,,N,Y,435335.20,89779.06
Long Island,Suffolk,5123000,000885,Brookhaven Memorial Hospital Medical Center Inc,50 to 69,119,F,White,Not Span/Hispanic,39,Emergency,Skilled Nursing Home,2017,095,Other nervous system disorders,000,NO PROC,058,Other disorders of nervous system,01,Diseases and Disorders of the Nervous System,2,Moderate,Moderate,Medical,Private Health Insurance,,,,N,Y,176683.67,43327.07
Long Island,Suffolk,5123000,000885,Brookhaven Memorial Hospital Medical Center Inc,30 to 49,119,F,Other Race,Not Span/Hispanic,7,Emergency,Skilled Nursing Home,2017,082,Paralysis,199,ELECTROENCEPHALOGRAM,058,Other disorders of nervous system,01,Diseases and Disorders of the Nervous System,2,Moderate,Minor,Medical,Private Health Insurance,,,,N,Y,57347.88,10258.04
Long Island,Suffolk,5123000,000885,Brookhaven Memorial Hospital Medical Center Inc,70 or Older,117,F,White,Not Span/Hispanic,5,Emergency,Home w/ Home Health Services,2017,211,Other connective tissue disease,000,NO PROC,058,Other disorders of nervous system,01,Diseases and Disorders of the Nervous System,2,Moderate,Moderate,Medical,Medicare,Medicare,Private Health Insurance,,N,Y,57688.35,8517.82
Long Island,Suffolk,5123000,000885,Brookhaven Memorial Hospital Medical Center Inc,70 or Older,117,M,White,Not Span/Hispanic,2,Emergency,Skilled Nursing Home,2017,095,Other nervous system disorders,000,NO PROC,058,Other disorders of nervous system,01,Diseases and Disorders of the Nervous System,1,Minor,Major,Medical,Medicare,,,,N,Y,21162.85,3073.93
Long Island,Suffolk,5123000,000885,Brookhaven Memorial Hospital Medical Center Inc,70 or Older,117,M,Black/African American,Not Span/Hispanic,4,Emergency,Skilled Nursing Home,2017,081,Other hereditary and degenerative nervous system conditions,199,ELECTROENCEPHALOGRAM,058,Other disorders of nervous system,01,Diseases and Disorders of the Nervous System,3,Major,Major,Medical,Medicare,Medicare,Blue Cross/Blue Shield,,N,Y,44010.08,6715.86
Long Island,Suffolk,5123000,000885,Brookhaven Memorial Hospital Medical Center Inc,70 or Older,119,M,White,Not Span/Hispanic,3,Emergency,Skilled Nursing Home,2017,095,Other nervous system disorders,000,NO PROC,058,Other disorders of nervous system,01,Diseases and Disorders of the Nervous System,1,Minor,Moderate,Medical,Medicare,Medicare,Medicaid,,N,Y,24086.44,4251.81
Long Island,Suffolk,5123000,000885,Brookhaven Memorial Hospital Medical Center Inc,50 to 69,117,F,White,Not Span/Hispanic,3,Emergency,Skilled Nursing Home,2017,095,Other nervous system disorders,000,NO PROC,058,Other disorders of nervous system,01,Diseases and Disorders of the Nervous System,1,Minor,Minor,Medical,Medicare,Medicare,Blue Cross/Blue Shield,,N,Y,24489.83,4328.82
Long Island,Suffolk,5123000,000885,Brookhaven Memorial Hospital Medical Center Inc,70 or Older,117,F,White,Not Span/Hispanic,5,Emergency,Skilled Nursing Home,2017,095,Other nervous system disorders,000,NO PROC,058,Other disorders of nervous system,01,Diseases and Disorders of the Nervous System,1,Minor,Moderate,Medical,Medicare,Medicare,Private Health Insurance,,N,Y,30731.09,6724.72
Long Island,Suffolk,5123000,000885,Brookhaven Memorial Hospital Medical Center Inc,70 or Older,119,F,White,Not Span/Hispanic,4,Emergency,Home w/ Home Health Services,2017,044,Neoplasms of unspecified nature or uncertain behavior,000,NO PROC,058,Other disorders of nervous system,01,Diseases and Disorders of the Nervous System,3,Major,Major,Medical,Medicare,,,,N,Y,67690.92,7762.93
Long Island,Suffolk,5123000,000885,Brookhaven Memorial Hospital Medical Center Inc,70 or Older,119,M,Other Race,Not Span/Hispanic,2,Emergency,Home w/ Home Health Services,2017,095,Other nervous system disorders,000,NO PROC,058,Other disorders of nervous system,01,Diseases and Disorders of the Nervous System,2,Moderate,Major,Medical,Medicare,Medicare,Blue Cross/Blue Shield,,N,Y,46438.71,5495.52
Long Island,Suffolk,5123000,000885,Brookhaven Memorial Hospital Medical Center Inc,70 or Older,117,M,White,Not Span/Hispanic,9,Emergency,Skilled Nursing Home,2017,095,Other nervous system disorders,000,NO PROC,058,Other disorders of nervous system,01,Diseases and Disorders of the Nervous System,1,Minor,Moderate,Medical,Medicare,Medicare,Blue Cross/Blue Shield,,N,Y,53707.74,10681.22
Long Island,Suffolk,5123000,000885,Brookhaven Memorial Hospital Medical Center Inc,70 or Older,117,F,White,Not Span/Hispanic,7,Emergency,Skilled Nursing Home,2017,095,Other nervous system disorders,000,NO PROC,058,Other disorders of nervous system,01,Diseases and Disorders of the Nervous System,2,Moderate,Major,Medical,Medicare,Medicare,Medicaid,,N,Y,37854.39,8466.89
Long Island,Suffolk,5123000,000885,Brookhaven Memorial Hospital Medical Center Inc,30 to 49,117,F,White,Not Span/Hispanic,3,Emergency,Home or Self Care,2017,259,Residual codes; unclassified,004,DIAGNOSTIC SPINAL TAP,058,Other disorders of nervous system,01,Diseases and Disorders of the Nervous System,2,Moderate,Moderate,Medical,Private Health Insurance,,,,N,Y,40314.78,5527.31
Long Island,Suffolk,5123000,000885,Brookhaven Memorial Hospital Medical Center Inc,70 or Older,119,M,White,Not Span/Hispanic,4,Emergency,Home or Self Care,2017,095,Other nervous system disorders,000,NO PROC,058,Other disorders of nervous system,01,Diseases and Disorders of the Nervous System,1,Minor,Moderate,Medical,Medicare,,,,N,Y,65795.34,7940.85
Long Island,Suffolk,5123000,000885,Brookhaven Memorial Hospital Medical Center Inc,70 or Older,119,M,White,Not Span/Hispanic,6,Emergency,Skilled Nursing Home,2017,095,Other nervous system disorders,000,NO PROC,058,Other disorders of nervous system,01,Diseases and Disorders of the Nervous System,2,Moderate,Major,Medical,Private Health Insurance,,,,N,Y,34069.51,7281.78
Long Island,Suffolk,5123000,000885,Brookhaven Memorial Hospital Medical Center Inc,70 or Older,117,F,White,Not Span/Hispanic,7,Emergency,Skilled Nursing Home,2017,095,Other nervous system disorders,171,SUTURE SKIN/SUBCUT TISS,058,Other disorders of nervous system,01,Diseases and Disorders of the Nervous System,2,Moderate,Moderate,Medical,Medicare,Medicare,Private Health Insurance,,N,Y,49998.32,8995.87
Long Island,Suffolk,5123000,000885,Brookhaven Memorial Hospital Medical Center Inc,70 or Older,117,M,White,Not Span/Hispanic,2,Emergency,Home w/ Home Health Services,2017,095,Other nervous system disorders,000,NO PROC,058,Other disorders of nervous system,01,Diseases and Disorders of the Nervous System,3,Major,Moderate,Medical,Medicare,Medicare,Private Health Insurance,,N,Y,42734.44,3833.79
Long Island,Suffolk,5123000,000885,Brookhaven Memorial Hospital Medical Center Inc,50 to 69,119,F,White,Not Span/Hispanic,3,Emergency,Home or Self Care,2017,095,Other nervous system disorders,199,ELECTROENCEPHALOGRAM,058,Other disorders of nervous system,01,Diseases and Disorders of the Nervous System,1,Minor,Minor,Medical,Private Health Insurance,,,,N,Y,63010.14,6910.10
Long Island,Suffolk,5123000,000885,Brookhaven Memorial Hospital Medical Center Inc,30 to 49,117,M,White,Not Span/Hispanic,4,Emergency,Skilled Nursing Home,2017,095,Other nervous system disorders,000,NO PROC,058,Other disorders of nervous system,01,Diseases and Disorders of the Nervous System,1,Minor,Minor,Medical,Medicare,Medicare,Medicaid,,N,Y,47083.54,5756.46
Long Island,Suffolk,5123000,000885,Brookhaven Memorial Hospital Medical Center Inc,70 or Older,119,F,White,Not Span/Hispanic,3,Emergency,Home w/ Home Health Services,2017,095,Other nervous system disorders,000,NO PROC,058,Other disorders of nervous system,01,Diseases and Disorders of the Nervous System,1,Minor,Moderate,Medical,Medicare,Medicaid,,,N,Y,36617.51,4748.39
Long Island,Suffolk,5123000,000885,Brookhaven Memorial Hospital Medical Center Inc,50 to 69,117,M,White,Not Span/Hispanic,5,Emergency,Skilled Nursing Home,2017,082,Paralysis,000,NO PROC,058,Other disorders of nervous system,01,Diseases and Disorders of the Nervous System,1,Minor,Minor,Medical,Private Health Insurance,,,,N,Y,27926.25,6102.32
Long Island,Suffolk,5123000,000885,Brookhaven Memorial Hospital Medical Center Inc,50 to 69,117,M,White,Not Span/Hispanic,12,Emergency,Home w/ Home Health Services,2017,095,Other nervous system disorders,004,DIAGNOSTIC SPINAL TAP,058,Other disorders of nervous system,01,Diseases and Disorders of the Nervous System,1,Minor,Moderate,Medical,Medicare,Medicare,Blue Cross/Blue Shield,,N,Y,128882.73,24359.35
Long Island,Suffolk,5123000,000885,Brookhaven Memorial Hospital Medical Center Inc,70 or Older,117,F,White,Not Span/Hispanic,7,Emergency,Skilled Nursing Home,2017,095,Other nervous system disorders,004,DIAGNOSTIC SPINAL TAP,058,Other disorders of nervous system,01,Diseases and Disorders of the Nervous System,3,Major,Major,Medical,Medicare,Medicare,Blue Cross/Blue Shield,,N,Y,68446.89,10430.18
Long Island,Suffolk,5123000,000885,Brookhaven Memorial Hospital Medical Center Inc,50 to 69,117,F,Black/African American,Not Span/Hispanic,13,Emergency,Home or Self Care,2017,095,Other nervous system disorders,216,RESP INTUB/MECH VENTIL,058,Other disorders of nervous system,01,Diseases and Disorders of the Nervous System,2,Moderate,Extreme,Medical,Medicare,Medicare,Medicaid,,N,N,144484.45,21888.28
Long Island,Suffolk,5123000,000885,Brookhaven Memorial Hospital Medical Center Inc,70 or Older,117,F,White,Not Span/Hispanic,3,Emergency,Home w/ Home Health Services,2017,095,Other nervous system disorders,171,SUTURE SKIN/SUBCUT TISS,058,Other disorders of nervous system,01,Diseases and Disorders of the Nervous System,2,Moderate,Moderate,Medical,Medicare,,,,N,Y,77056.36,7994.44
Long Island,Suffolk,5123000,000885,Brookhaven Memorial Hospital Medical Center Inc,70 or Older,117,F,White,Not Span/Hispanic,5,Emergency,Skilled Nursing Home,2017,095,Other nervous system disorders,171,SUTURE SKIN/SUBCUT TISS,058,Other disorders of nervous system,01,Diseases and Disorders of the Nervous System,3,Major,Major,Medical,Medicare,Medicare,Private Health Insurance,,N,Y,52960.80,7192.69
Long Island,Suffolk,5123000,000885,Brookhaven Memorial Hospital Medical Center Inc,70 or Older,117,F,White,Not Span/Hispanic,3,Emergency,Skilled Nursing Home,2017,095,Other nervous system disorders,000,NO PROC,058,Other disorders of nervous system,01,Diseases and Disorders of the Nervous System,1,Minor,Minor,Medical,Medicare,Medicare,Private Health Insurance,,N,Y,58798.81,6818.67
Long Island,Suffolk,5123000,000885,Brookhaven Memorial Hospital Medical Center Inc,70 or Older,117,F,White,Not Span/Hispanic,2,Emergency,Skilled Nursing Home,2017,095,Other nervous system disorders,000,NO PROC,058,Other disorders of nervous system,01,Diseases and Disorders of the Nervous System,2,Moderate,Moderate,Medical,Medicare,Medicare,Blue Cross/Blue Shield,,N,Y,14464.12,3065.49
Long Island,Suffolk,5123000,000885,Brookhaven Memorial Hospital Medical Center Inc,70 or Older,119,M,Black/African American,Not Span/Hispanic,4,Emergency,Skilled Nursing Home,2017,113,Late effects of cerebrovascular disease,071,GASTROSTOMY; TEMP/PERM,058,Other disorders of nervous system,01,Diseases and Disorders of the Nervous System,3,Major,Major,Medical,Medicare,Medicare,Medicaid,,N,Y,36876.72,8095.92
Long Island,Suffolk,5123000,000885,Brookhaven Memorial Hospital Medical Center Inc,50 to 69,119,M,White,Not Span/Hispanic,7,Emergency,Skilled Nursing Home,2017,095,Other nervous system disorders,219,ALCO/DRUG REHAB/DETOX,058,Other disorders of nervous system,01,Diseases and Disorders of the Nervous System,2,Moderate,Major,Medical,Private Health Insurance,,,,N,Y,58153.95,10654.91
Long Island,Suffolk,5123000,000885,Brookhaven Memorial Hospital Medical Center Inc,70 or Older,117,F,White,Not Span/Hispanic,3,Emergency,Skilled Nursing Home,2017,095,Other nervous system disorders,000,NO PROC,058,Other disorders of nervous system,01,Diseases and Disorders of the Nervous System,1,Minor,Moderate,Medical,Medicare,Medicare,Private Health Insurance,,N,Y,32120.75,4457.09
Long Island,Suffolk,5123000,000885,Brookhaven Memorial Hospital Medical Center Inc,70 or Older,117,M,White,Not Span/Hispanic,3,Emergency,Home w/ Home Health Services,2017,095,Other nervous system disorders,000,NO PROC,058,Other disorders of nervous system,01,Diseases and Disorders of the Nervous System,2,Moderate,Moderate,Medical,Medicare,Medicaid,,,N,Y,25526.63,4342.71
Long Island,Suffolk,5123000,000885,Brookhaven Memorial Hospital Medical Center Inc,18 to 29,119,M,White,Not Span/Hispanic,10,Urgent,Psychiatric Hospital or Unit of Hosp,2017,095,Other nervous system disorders,199,ELECTROENCEPHALOGRAM,058,Other disorders of nervous system,01,Diseases and Disorders of the Nervous System,3,Major,Extreme,Medical,Private Health Insurance,,,,N,N,72421.37,14706.83
Long Island,Suffolk,5123000,000885,Brookhaven Memorial Hospital Medical Center Inc,70 or Older,117,M,White,Not Span/Hispanic,4,Emergency,Short-term Hospital,2017,044,Neoplasms of unspecified nature or uncertain behavior,216,RESP INTUB/MECH VENTIL,058,Other disorders of nervous system,01,Diseases and Disorders of the Nervous System,4,Extreme,Extreme,Medical,Medicare,,,,N,Y,83355.50,11260.24
Long Island,Suffolk,5123000,000885,Brookhaven Memorial Hospital Medical Center Inc,50 to 69,117,F,White,Not Span/Hispanic,7,Emergency,Home w/ Home Health Services,2017,095,Other nervous system disorders,000,NO PROC,058,Other disorders of nervous system,01,Diseases and Disorders of the Nervous System,3,Major,Minor,Medical,Medicare,Medicare,Medicaid,,N,Y,64843.56,10833.58
Long Island,Suffolk,5123000,000885,Brookhaven Memorial Hospital Medical Center Inc,50 to 69,117,F,White,Not Span/Hispanic,4,Emergency,Home w/ Home Health Services,2017,047,Other and unspecified benign neoplasm,000,NO PROC,058,Other disorders of nervous system,01,Diseases and Disorders of the Nervous System,2,Moderate,Minor,Medical,Medicare,Medicare,Private Health Insurance,,N,Y,89144.64,9775.77
Long Island,Suffolk,5123000,000885,Brookhaven Memorial Hospital Medical Center Inc,70 or Older,117,F,White,Not Span/Hispanic,2,Emergency,Home w/ Home Health Services,2017,095,Other nervous system disorders,000,NO PROC,058,Other disorders of nervous system,01,Diseases and Disorders of the Nervous System,1,Minor,Minor,Medical,Medicare,Medicare,Private Health Insurance,,N,Y,34786.87,3594.43
Long Island,Suffolk,5123000,000885,Brookhaven Memorial Hospital Medical Center Inc,70 or Older,117,F,Other Race,Not Span/Hispanic,3,Emergency,Skilled Nursing Home,2017,095,Other nervous system disorders,000,NO PROC,058,Other disorders of nervous system,01,Diseases and Disorders of the Nervous System,1,Minor,Minor,Medical,Medicare,Medicare,Medicaid,,N,Y,36215.86,5198.40
Long Island,Suffolk,5123000,000885,Brookhaven Memorial Hospital Medical Center Inc,50 to 69,117,F,White,Not Span/Hispanic,2,Emergency,Home w/ Home Health Services,2017,082,Paralysis,000,NO PROC,058,Other disorders of nervous system,01,Diseases and Disorders of the Nervous System,2,Moderate,Moderate,Medical,Medicare,Medicare,,,N,Y,76247.03,6142.05