Hospital Service Area,Hospital County,Operating Certificate Number,Permanent Facility Id,Facility Name,Age Group,Zip Code - 3 digits,Gender,Race,Ethnicity,Length of Stay,Type of Admission,Patient Disposition,Discharge Year,CCS Diagnosis Code,CCS Diagnosis Description,CCS Procedure Code,CCS Procedure Description,APR DRG Code,APR DRG Description,APR MDC Code,APR MDC Description,APR Severity of Illness Code,APR Severity of Illness Description,APR Risk of Mortality,APR Medical Surgical Description,Payment Typology 1,Payment Typology 2,Payment Typology 3,Birth Weight,Abortion Edit Indicator,Emergency Department Indicator,Total Charges,Total Costs
New York City,Kings,7002053,001304,NYU Langone Hospital-Brooklyn,70 or Older,112,F,Other Race,Spanish/Hispanic,1,Emergency,Home or Self Care,2019,SYM010,NERVOUS SYSTEM SIGNS AND SYMPTOMS,IMG005,MAGNETIC RESONANCE IMAGING (MRI),058,OTHER DISORDERS OF NERVOUS SYSTEM,01,DISEASES AND DISORDERS OF THE NERVOUS SYSTEM,1,Minor,Minor,Medical,Medicare,,,,,true,55404.79,15825.62
New York City,Kings,7002053,001304,NYU Langone Hospital-Brooklyn,70 or Older,112,M,Other Race,Spanish/Hispanic,15,Elective,Home w/ Home Health Services,2019,CIR025,SEQUELA OF CEREBRAL INFARCTION AND OTHER CEREBROVASCULAR DISEASE,RHB002,"PHYSICAL, OCCUPATIONAL, AND RESPIRATORY THERAPY TREATMENT",058,OTHER DISORDERS OF NERVOUS SYSTEM,01,DISEASES AND DISORDERS OF THE NERVOUS SYSTEM,2,Moderate,Major,Medical,Medicare,Blue Cross/Blue Shield,,,,false,145927.91,46652.36
New York City,Kings,7002053,001304,NYU Langone Hospital-Brooklyn,50 to 69,112,M,Other Race,Spanish/Hispanic,14,Elective,Home w/ Home Health Services,2019,CIR022,SEQUELA OF HEMORRHAGIC CEREBROVASCULAR DISEASE,RHB002,"PHYSICAL, OCCUPATIONAL, AND RESPIRATORY THERAPY TREATMENT",058,OTHER DISORDERS OF NERVOUS SYSTEM,01,DISEASES AND DISORDERS OF THE NERVOUS SYSTEM,2,Moderate,Moderate,Medical,Medicare,,,,,false,160246.98,43975.25
New York City,Kings,7002053,001304,NYU Langone Hospital-Brooklyn,70 or Older,112,M,White,Not Span/Hispanic,12,Elective,Home w/ Home Health Services,2019,CIR025,SEQUELA OF CEREBRAL INFARCTION AND OTHER CEREBROVASCULAR DISEASE,RHB002,"PHYSICAL, OCCUPATIONAL, AND RESPIRATORY THERAPY TREATMENT",058,OTHER DISORDERS OF NERVOUS SYSTEM,01,DISEASES AND DISORDERS OF THE NERVOUS SYSTEM,2,Moderate,Moderate,Medical,Medicare,Medicaid,,,,false,109338.57,36419.74
New York City,Kings,7002053,001304,NYU Langone Hospital-Brooklyn,70 or Older,112,F,Other Race,Unknown,6,Elective,Home w/ Home Health Services,2019,CIR025,SEQUELA OF CEREBRAL INFARCTION AND OTHER CEREBROVASCULAR DISEASE,RHB002,"PHYSICAL, OCCUPATIONAL, AND RESPIRATORY THERAPY TREATMENT",058,OTHER DISORDERS OF NERVOUS SYSTEM,01,DISEASES AND DISORDERS OF THE NERVOUS SYSTEM,2,Moderate,Moderate,Medical,Medicaid,,,,,false,50908.26,17646.37
New York City,Kings,7002053,001304,NYU Langone Hospital-Brooklyn,50 to 69,112,M,White,Spanish/Hispanic,9,Elective,Home w/ Home Health Services,2019,CIR025,SEQUELA OF CEREBRAL INFARCTION AND OTHER CEREBROVASCULAR DISEASE,RHB002,"PHYSICAL, OCCUPATIONAL, AND RESPIRATORY THERAPY TREATMENT",058,OTHER DISORDERS OF NERVOUS SYSTEM,01,DISEASES AND DISORDERS OF THE NERVOUS SYSTEM,2,Moderate,Minor,Medical,Medicaid,,,,,false,76699.28,26510.82
New York City,Kings,7002053,001304,NYU Langone Hospital-Brooklyn,70 or Older,112,M,White,Not Span/Hispanic,5,Emergency,Skilled Nursing Home,2019,CIR025,SEQUELA OF CEREBRAL INFARCTION AND OTHER CEREBROVASCULAR DISEASE,IMG008,ULTRASONOGRAPHY,058,OTHER DISORDERS OF NERVOUS SYSTEM,01,DISEASES AND DISORDERS OF THE NERVOUS SYSTEM,3,Major,Major,Medical,Medicare,Medicaid,,,,true,75169.55,20596.15
New York City,Kings,7002053,001304,NYU Langone Hospital-Brooklyn,70 or Older,112,F,Other Race,Not Span/Hispanic,9,Elective,Home w/ Home Health Services,2019,CIR025,SEQUELA OF CEREBRAL INFARCTION AND OTHER CEREBROVASCULAR DISEASE,RHB002,"PHYSICAL, OCCUPATIONAL, AND RESPIRATORY THERAPY TREATMENT",058,OTHER DISORDERS OF NERVOUS SYSTEM,01,DISEASES AND DISORDERS OF THE NERVOUS SYSTEM,2,Moderate,Moderate,Medical,Medicare,Medicaid,,,,false,71096.79,26164.71
New York City,Kings,7002053,001304,NYU Langone Hospital-Brooklyn,50 to 69,112,M,Other Race,Not Span/Hispanic,7,Elective,Home or Self Care,2019,CIR025,SEQUELA OF CEREBRAL INFARCTION AND OTHER CEREBROVASCULAR DISEASE,RHB002,"PHYSICAL, OCCUPATIONAL, AND RESPIRATORY THERAPY TREATMENT",058,OTHER DISORDERS OF NERVOUS SYSTEM,01,DISEASES AND DISORDERS OF THE NERVOUS SYSTEM,3,Major,Moderate,Medical,Blue Cross/Blue Shield,,,,,false,64732.06,20984.84
New York City,Kings,7002053,001304,NYU Langone Hospital-Brooklyn,70 or Older,112,M,White,Not Span/Hispanic,13,Elective,Home w/ Home Health Services,2019,CIR025,SEQUELA OF CEREBRAL INFARCTION AND OTHER CEREBROVASCULAR DISEASE,RHB002,"PHYSICAL, OCCUPATIONAL, AND RESPIRATORY THERAPY TREATMENT",058,OTHER DISORDERS OF NERVOUS SYSTEM,01,DISEASES AND DISORDERS OF THE NERVOUS SYSTEM,3,Major,Moderate,Medical,Medicaid,,,,,false,131272,40132.37
New York City,Kings,7002053,001304,NYU Langone Hospital-Brooklyn,70 or Older,112,M,White,Not Span/Hispanic,21,Elective,Skilled Nursing Home,2019,CIR025,SEQUELA OF CEREBRAL INFARCTION AND OTHER CEREBROVASCULAR DISEASE,RHB002,"PHYSICAL, OCCUPATIONAL, AND RESPIRATORY THERAPY TREATMENT",058,OTHER DISORDERS OF NERVOUS SYSTEM,01,DISEASES AND DISORDERS OF THE NERVOUS SYSTEM,3,Major,Moderate,Medical,Medicare,Medicaid,,,,false,183047.85,63578.07
New York City,Kings,7002053,001304,NYU Langone Hospital-Brooklyn,70 or Older,112,F,White,Not Span/Hispanic,8,Elective,Home w/ Home Health Services,2019,CIR025,SEQUELA OF CEREBRAL INFARCTION AND OTHER CEREBROVASCULAR DISEASE,RHB002,"PHYSICAL, OCCUPATIONAL, AND RESPIRATORY THERAPY TREATMENT",058,OTHER DISORDERS OF NERVOUS SYSTEM,01,DISEASES AND DISORDERS OF THE NERVOUS SYSTEM,3,Major,Moderate,Medical,Medicare,Medicaid,,,,false,74653,23840.83
New York City,Kings,7002053,001304,NYU Langone Hospital-Brooklyn,30 to 49,104,M,Black/African American,Not Span/Hispanic,3,Emergency,Home or Self Care,2019,NVS006,OTHER SPECIFIED HEREDITARY AND DEGENERATIVE NERVOUS SYSTEM CONDITIONS,,,058,OTHER DISORDERS OF NERVOUS SYSTEM,01,DISEASES AND DISORDERS OF THE NERVOUS SYSTEM,2,Moderate,Minor,Medical,Self-Pay,,,,,true,32693.28,11431.63
New York City,Kings,7002053,001304,NYU Langone Hospital-Brooklyn,30 to 49,112,F,Black/African American,Not Span/Hispanic,26,Elective,Home w/ Home Health Services,2019,CIR022,SEQUELA OF HEMORRHAGIC CEREBROVASCULAR DISEASE,RHB002,"PHYSICAL, OCCUPATIONAL, AND RESPIRATORY THERAPY TREATMENT",058,OTHER DISORDERS OF NERVOUS SYSTEM,01,DISEASES AND DISORDERS OF THE NERVOUS SYSTEM,2,Moderate,Minor,Medical,Blue Cross/Blue Shield,,,,,false,255289.92,80268.32
New York City,Kings,7002053,001304,NYU Langone Hospital-Brooklyn,70 or Older,113,F,White,Not Span/Hispanic,27,Elective,Home w/ Home Health Services,2019,CIR025,SEQUELA OF CEREBRAL INFARCTION AND OTHER CEREBROVASCULAR DISEASE,RHB002,"PHYSICAL, OCCUPATIONAL, AND RESPIRATORY THERAPY TREATMENT",058,OTHER DISORDERS OF NERVOUS SYSTEM,01,DISEASES AND DISORDERS OF THE NERVOUS SYSTEM,2,Moderate,Moderate,Medical,Medicare,Medicare,,,,false,231943.68,81384.65
New York City,Kings,7002053,001304,NYU Langone Hospital-Brooklyn,50 to 69,112,M,White,Not Span/Hispanic,15,Elective,Home or Self Care,2019,CIR025,SEQUELA OF CEREBRAL INFARCTION AND OTHER CEREBROVASCULAR DISEASE,RHB002,"PHYSICAL, OCCUPATIONAL, AND RESPIRATORY THERAPY TREATMENT",058,OTHER DISORDERS OF NERVOUS SYSTEM,01,DISEASES AND DISORDERS OF THE NERVOUS SYSTEM,2,Moderate,Minor,Medical,Blue Cross/Blue Shield,,,,,false,131961.36,45257.89
New York City,Kings,7002053,001304,NYU Langone Hospital-Brooklyn,70 or Older,100,M,White,Unknown,1,Emergency,Home or Self Care,2019,CIR025,SEQUELA OF CEREBRAL INFARCTION AND OTHER CEREBROVASCULAR DISEASE,ADM020,"ADMINISTRATION OF DIAGNOSTIC SUBSTANCES, NEC",058,OTHER DISORDERS OF NERVOUS SYSTEM,01,DISEASES AND DISORDERS OF THE NERVOUS SYSTEM,2,Moderate,Moderate,Medical,Medicare,Blue Cross/Blue Shield,,,,true,18456.46,5113.77
New York City,Kings,7002053,001304,NYU Langone Hospital-Brooklyn,70 or Older,112,M,Other Race,Spanish/Hispanic,8,Emergency,Home w/ Home Health Services,2019,CIR025,SEQUELA OF CEREBRAL INFARCTION AND OTHER CEREBROVASCULAR DISEASE,MAM011,ELECTROENCEPHALOGRAM (EEG),058,OTHER DISORDERS OF NERVOUS SYSTEM,01,DISEASES AND DISORDERS OF THE NERVOUS SYSTEM,3,Major,Major,Medical,Blue Cross/Blue Shield,Medicaid,,,,true,73899.75,28255.98
New York City,Kings,7002053,001304,NYU Langone Hospital-Brooklyn,50 to 69,112,M,Other Race,Not Span/Hispanic,18,Elective,Skilled Nursing Home,2019,CIR025,SEQUELA OF CEREBRAL INFARCTION AND OTHER CEREBROVASCULAR DISEASE,RHB002,"PHYSICAL, OCCUPATIONAL, AND RESPIRATORY THERAPY TREATMENT",058,OTHER DISORDERS OF NERVOUS SYSTEM,01,DISEASES AND DISORDERS OF THE NERVOUS SYSTEM,2,Moderate,Moderate,Medical,Medicare,Blue Cross/Blue Shield,,,,false,164537.62,55485.83
New York City,Kings,7002053,001304,NYU Langone Hospital-Brooklyn,50 to 69,112,F,Black/African American,Not Span/Hispanic,17,Elective,Home w/ Home Health Services,2019,CIR025,SEQUELA OF CEREBRAL INFARCTION AND OTHER CEREBROVASCULAR DISEASE,RHB002,"PHYSICAL, OCCUPATIONAL, AND RESPIRATORY THERAPY TREATMENT",058,OTHER DISORDERS OF NERVOUS SYSTEM,01,DISEASES AND DISORDERS OF THE NERVOUS SYSTEM,1,Minor,Minor,Medical,Medicare,,,,,false,155285.58,51247.26
New York City,Kings,7002053,001304,NYU Langone Hospital-Brooklyn,50 to 69,112,F,White,Not Span/Hispanic,23,Elective,Skilled Nursing Home,2019,CIR025,SEQUELA OF CEREBRAL INFARCTION AND OTHER CEREBROVASCULAR DISEASE,RHB002,"PHYSICAL, OCCUPATIONAL, AND RESPIRATORY THERAPY TREATMENT",058,OTHER DISORDERS OF NERVOUS SYSTEM,01,DISEASES AND DISORDERS OF THE NERVOUS SYSTEM,3,Major,Minor,Medical,Medicaid,,,,,false,287043.78,72978.63
New York City,Kings,7002053,001304,NYU Langone Hospital-Brooklyn,30 to 49,112,M,White,Not Span/Hispanic,3,Emergency,Home or Self Care,2019,NVS020,OTHER SPECIFIED NERVOUS SYSTEM DISORDERS,CNS002,LUMBAR PUNCTURE,058,OTHER DISORDERS OF NERVOUS SYSTEM,01,DISEASES AND DISORDERS OF THE NERVOUS SYSTEM,2,Moderate,Moderate,Medical,Blue Cross/Blue Shield,,,,,true,92095.43,19120.6
New York City,Kings,7002053,001304,NYU Langone Hospital-Brooklyn,0 to 17,112,F,White,Not Span/Hispanic,1,Elective,Home or Self Care,2019,SYM010,NERVOUS SYSTEM SIGNS AND SYMPTOMS,MAM011,ELECTROENCEPHALOGRAM (EEG),058,OTHER DISORDERS OF NERVOUS SYSTEM,01,DISEASES AND DISORDERS OF THE NERVOUS SYSTEM,1,Minor,Minor,Medical,Medicaid,,,,,false,5951.35,2514.41
New York City,Kings,7002053,001304,NYU Langone Hospital-Brooklyn,50 to 69,112,M,Other Race,Not Span/Hispanic,1,Emergency,Home or Self Care,2019,MAL001,CARDIAC AND CIRCULATORY CONGENITAL ANOMALIES,IMG002,FLUOROSCOPIC ANGIOGRAPHY (EXCLUDING CORONARY),058,OTHER DISORDERS OF NERVOUS SYSTEM,01,DISEASES AND DISORDERS OF THE NERVOUS SYSTEM,2,Moderate,Minor,Medical,Medicaid,,,,,true,95994.74,22325.71
New York City,Kings,7002053,001304,NYU Langone Hospital-Brooklyn,70 or Older,112,M,White,Not Span/Hispanic,1,Emergency,Home w/ Home Health Services,2019,SYM010,NERVOUS SYSTEM SIGNS AND SYMPTOMS,,,058,OTHER DISORDERS OF NERVOUS SYSTEM,01,DISEASES AND DISORDERS OF THE NERVOUS SYSTEM,1,Minor,Minor,Medical,Medicare,Medicare,,,,true,28466.2,6432.91
New York City,Kings,7002053,001304,NYU Langone Hospital-Brooklyn,50 to 69,112,F,Other Race,Not Span/Hispanic,21,Elective,Skilled Nursing Home,2019,CIR022,SEQUELA OF HEMORRHAGIC CEREBROVASCULAR DISEASE,RHB002,"PHYSICAL, OCCUPATIONAL, AND RESPIRATORY THERAPY TREATMENT",058,OTHER DISORDERS OF NERVOUS SYSTEM,01,DISEASES AND DISORDERS OF THE NERVOUS SYSTEM,2,Moderate,Major,Medical,Medicare,Blue Cross/Blue Shield,,,,false,191673.06,63833.48
New York City,Kings,7002053,001304,NYU Langone Hospital-Brooklyn,70 or Older,112,F,White,Not Span/Hispanic,15,Elective,Home or Self Care,2019,CIR025,SEQUELA OF CEREBRAL INFARCTION AND OTHER CEREBROVASCULAR DISEASE,RHB002,"PHYSICAL, OCCUPATIONAL, AND RESPIRATORY THERAPY TREATMENT",058,OTHER DISORDERS OF NERVOUS SYSTEM,01,DISEASES AND DISORDERS OF THE NERVOUS SYSTEM,3,Major,Moderate,Medical,Medicare,Medicare,,,,false,131604.04,45749.55
New York City,Kings,7002053,001304,NYU Langone Hospital-Brooklyn,50 to 69,112,F,Black/African American,Not Span/Hispanic,13,Elective,Home w/ Home Health Services,2019,CIR025,SEQUELA OF CEREBRAL INFARCTION AND OTHER CEREBROVASCULAR DISEASE,RHB002,"PHYSICAL, OCCUPATIONAL, AND RESPIRATORY THERAPY TREATMENT",058,OTHER DISORDERS OF NERVOUS SYSTEM,01,DISEASES AND DISORDERS OF THE NERVOUS SYSTEM,2,Moderate,Minor,Medical,Medicare,Medicaid,,,,false,137743.25,39990.13
New York City,Kings,7002053,001304,NYU Langone Hospital-Brooklyn,18 to 29,,F,Black/African American,Not Span/Hispanic,21,Elective,Skilled Nursing Home,2019,CIR025,SEQUELA OF CEREBRAL INFARCTION AND OTHER CEREBROVASCULAR DISEASE,RHB002,"PHYSICAL, OCCUPATIONAL, AND RESPIRATORY THERAPY TREATMENT",058,OTHER DISORDERS OF NERVOUS SYSTEM,01,DISEASES AND DISORDERS OF THE NERVOUS SYSTEM,3,Major,Major,Medical,Medicaid,,,,,false,199690.14,66303.52
New York City,Kings,7002053,001304,NYU Langone Hospital-Brooklyn,50 to 69,112,M,Black/African American,Not Span/Hispanic,2,Elective,Home or Self Care,2019,SYM010,NERVOUS SYSTEM SIGNS AND SYMPTOMS,MAM011,ELECTROENCEPHALOGRAM (EEG),058,OTHER DISORDERS OF NERVOUS SYSTEM,01,DISEASES AND DISORDERS OF THE NERVOUS SYSTEM,1,Minor,Minor,Medical,Private Health Insurance,,,,,false,68902.48,13671.63
New York City,Kings,7002053,001304,NYU Langone Hospital-Brooklyn,18 to 29,112,F,White,Not Span/Hispanic,1,Emergency,Home or Self Care,2019,SYM014,SKIN/SUBCUTANEOUS SIGNS AND SYMPTOMS,,,058,OTHER DISORDERS OF NERVOUS SYSTEM,01,DISEASES AND DISORDERS OF THE NERVOUS SYSTEM,1,Minor,Minor,Medical,Medicaid,,,,,true,25629.39,5070.64
New York City,Kings,7002053,001304,NYU Langone Hospital-Brooklyn,0 to 17,112,F,Other Race,Spanish/Hispanic,2,Elective,Home or Self Care,2019,SYM010,NERVOUS SYSTEM SIGNS AND SYMPTOMS,MAM011,ELECTROENCEPHALOGRAM (EEG),058,OTHER DISORDERS OF NERVOUS SYSTEM,01,DISEASES AND DISORDERS OF THE NERVOUS SYSTEM,1,Minor,Minor,Medical,Private Health Insurance,,,,,false,12409.63,5152.4
New York City,Kings,7002053,001304,NYU Langone Hospital-Brooklyn,30 to 49,112,F,White,Spanish/Hispanic,2,Elective,Home or Self Care,2019,SYM014,SKIN/SUBCUTANEOUS SIGNS AND SYMPTOMS,MAM011,ELECTROENCEPHALOGRAM (EEG),058,OTHER DISORDERS OF NERVOUS SYSTEM,01,DISEASES AND DISORDERS OF THE NERVOUS SYSTEM,1,Minor,Minor,Medical,Medicaid,,,,,false,115291.69,14887.6
New York City,Kings,7002053,001304,NYU Langone Hospital-Brooklyn,70 or Older,112,F,White,Not Span/Hispanic,3,Emergency,Home or Self Care,2019,NEO072,NEOPLASMS OF UNSPECIFIED NATURE OR UNCERTAIN BEHAVIOR,CNS002,LUMBAR PUNCTURE,058,OTHER DISORDERS OF NERVOUS SYSTEM,01,DISEASES AND DISORDERS OF THE NERVOUS SYSTEM,4,Extreme,Major,Medical,Medicare,Blue Cross/Blue Shield,,,,true,83559.78,16795.8
New York City,Kings,7002053,001304,NYU Langone Hospital-Brooklyn,70 or Older,112,F,Other Race,Not Span/Hispanic,13,Elective,Home w/ Home Health Services,2019,CIR025,SEQUELA OF CEREBRAL INFARCTION AND OTHER CEREBROVASCULAR DISEASE,RHB002,"PHYSICAL, OCCUPATIONAL, AND RESPIRATORY THERAPY TREATMENT",058,OTHER DISORDERS OF NERVOUS SYSTEM,01,DISEASES AND DISORDERS OF THE NERVOUS SYSTEM,3,Major,Major,Medical,Medicare,Medicaid,,,,false,137813.53,40071.75
New York City,Kings,7002053,001304,NYU Langone Hospital-Brooklyn,70 or Older,112,F,Other Race,Not Span/Hispanic,13,Elective,Skilled Nursing Home,2019,CIR022,SEQUELA OF HEMORRHAGIC CEREBROVASCULAR DISEASE,RHB002,"PHYSICAL, OCCUPATIONAL, AND RESPIRATORY THERAPY TREATMENT",058,OTHER DISORDERS OF NERVOUS SYSTEM,01,DISEASES AND DISORDERS OF THE NERVOUS SYSTEM,3,Major,Major,Medical,Medicare,Medicaid,,,,false,113848.61,38746.83
New York City,Kings,7002053,001304,NYU Langone Hospital-Brooklyn,50 to 69,112,M,White,Not Span/Hispanic,6,Elective,Home or Self Care,2019,CIR025,SEQUELA OF CEREBRAL INFARCTION AND OTHER CEREBROVASCULAR DISEASE,RHB002,"PHYSICAL, OCCUPATIONAL, AND RESPIRATORY THERAPY TREATMENT",058,OTHER DISORDERS OF NERVOUS SYSTEM,01,DISEASES AND DISORDERS OF THE NERVOUS SYSTEM,2,Moderate,Minor,Medical,Private Health Insurance,,,,,false,51317.56,17737.58
New York City,Kings,7002053,001304,NYU Langone Hospital-Brooklyn,30 to 49,112,F,Other Race,Spanish/Hispanic,2,Emergency,Home or Self Care,2019,NVS020,OTHER SPECIFIED NERVOUS SYSTEM DISORDERS,,,058,OTHER DISORDERS OF NERVOUS SYSTEM,01,DISEASES AND DISORDERS OF THE NERVOUS SYSTEM,1,Minor,Minor,Medical,Private Health Insurance,,,,,true,42775.64,8921.81
New York City,Kings,7002053,001304,NYU Langone Hospital-Brooklyn,70 or Older,112,F,White,Not Span/Hispanic,19,Elective,Short-term Hospital,2019,CIR025,SEQUELA OF CEREBRAL INFARCTION AND OTHER CEREBROVASCULAR DISEASE,RHB002,"PHYSICAL, OCCUPATIONAL, AND RESPIRATORY THERAPY TREATMENT",058,OTHER DISORDERS OF NERVOUS SYSTEM,01,DISEASES AND DISORDERS OF THE NERVOUS SYSTEM,3,Major,Major,Medical,Medicare,Blue Cross/Blue Shield,,,,false,165302.42,57352.9
New York City,Kings,7002053,001304,NYU Langone Hospital-Brooklyn,50 to 69,112,M,White,Not Span/Hispanic,11,Elective,Home w/ Home Health Services,2019,CIR025,SEQUELA OF CEREBRAL INFARCTION AND OTHER CEREBROVASCULAR DISEASE,RHB002,"PHYSICAL, OCCUPATIONAL, AND RESPIRATORY THERAPY TREATMENT",058,OTHER DISORDERS OF NERVOUS SYSTEM,01,DISEASES AND DISORDERS OF THE NERVOUS SYSTEM,3,Major,Minor,Medical,Private Health Insurance,,,,,false,121611.12,34272.16
New York City,Kings,7002053,001304,NYU Langone Hospital-Brooklyn,50 to 69,112,F,White,Not Span/Hispanic,13,Elective,Home w/ Home Health Services,2019,CIR025,SEQUELA OF CEREBRAL INFARCTION AND OTHER CEREBROVASCULAR DISEASE,RHB002,"PHYSICAL, OCCUPATIONAL, AND RESPIRATORY THERAPY TREATMENT",058,OTHER DISORDERS OF NERVOUS SYSTEM,01,DISEASES AND DISORDERS OF THE NERVOUS SYSTEM,3,Major,Moderate,Medical,Medicare,Blue Cross/Blue Shield,,,,false,108041.26,37971.78
New York City,Kings,7002053,001304,NYU Langone Hospital-Brooklyn,30 to 49,112,M,White,Not Span/Hispanic,1,Emergency,Home or Self Care,2019,SYM010,NERVOUS SYSTEM SIGNS AND SYMPTOMS,,,058,OTHER DISORDERS OF NERVOUS SYSTEM,01,DISEASES AND DISORDERS OF THE NERVOUS SYSTEM,1,Minor,Minor,Medical,Private Health Insurance,,,,,true,38626.15,5564.45
New York City,Kings,7002053,001304,NYU Langone Hospital-Brooklyn,50 to 69,112,F,Black/African American,Not Span/Hispanic,11,Elective,Home or Self Care,2019,CIR025,SEQUELA OF CEREBRAL INFARCTION AND OTHER CEREBROVASCULAR DISEASE,RHB002,"PHYSICAL, OCCUPATIONAL, AND RESPIRATORY THERAPY TREATMENT",058,OTHER DISORDERS OF NERVOUS SYSTEM,01,DISEASES AND DISORDERS OF THE NERVOUS SYSTEM,3,Major,Minor,Medical,Private Health Insurance,,,,,false,121493.61,36903.21
New York City,Kings,7002053,001304,NYU Langone Hospital-Brooklyn,50 to 69,112,M,White,Not Span/Hispanic,6,Elective,Home or Self Care,2019,CIR025,SEQUELA OF CEREBRAL INFARCTION AND OTHER CEREBROVASCULAR DISEASE,RHB002,"PHYSICAL, OCCUPATIONAL, AND RESPIRATORY THERAPY TREATMENT",058,OTHER DISORDERS OF NERVOUS SYSTEM,01,DISEASES AND DISORDERS OF THE NERVOUS SYSTEM,3,Major,Moderate,Medical,Private Health Insurance,,,,,false,56402.93,18431.31
New York City,Kings,7002053,001304,NYU Langone Hospital-Brooklyn,70 or Older,112,F,White,Not Span/Hispanic,9,Elective,Home w/ Home Health Services,2019,SYM010,NERVOUS SYSTEM SIGNS AND SYMPTOMS,RHB002,"PHYSICAL, OCCUPATIONAL, AND RESPIRATORY THERAPY TREATMENT",058,OTHER DISORDERS OF NERVOUS SYSTEM,01,DISEASES AND DISORDERS OF THE NERVOUS SYSTEM,1,Minor,Minor,Medical,Medicare,Medicare,,,,false,91206.99,27890.7
New York City,Kings,7002053,001304,NYU Langone Hospital-Brooklyn,0 to 17,112,F,White,Spanish/Hispanic,1,Emergency,Home or Self Care,2019,SYM010,NERVOUS SYSTEM SIGNS AND SYMPTOMS,MAM011,ELECTROENCEPHALOGRAM (EEG),058,OTHER DISORDERS OF NERVOUS SYSTEM,01,DISEASES AND DISORDERS OF THE NERVOUS SYSTEM,1,Minor,Minor,Medical,Medicaid,,,,,true,22990.63,4112.59
New York City,Kings,7002053,001304,NYU Langone Hospital-Brooklyn,50 to 69,112,M,Other Race,Not Span/Hispanic,24,Elective,Home w/ Home Health Services,2019,CIR025,SEQUELA OF CEREBRAL INFARCTION AND OTHER CEREBROVASCULAR DISEASE,RHB002,"PHYSICAL, OCCUPATIONAL, AND RESPIRATORY THERAPY TREATMENT",058,OTHER DISORDERS OF NERVOUS SYSTEM,01,DISEASES AND DISORDERS OF THE NERVOUS SYSTEM,2,Moderate,Moderate,Medical,Medicare,Medicaid,,,,false,248923.71,73556.1
New York City,Kings,7002053,001304,NYU Langone Hospital-Brooklyn,70 or Older,112,F,White,Not Span/Hispanic,14,Elective,Skilled Nursing Home,2019,CIR025,SEQUELA OF CEREBRAL INFARCTION AND OTHER CEREBROVASCULAR DISEASE,RHB002,"PHYSICAL, OCCUPATIONAL, AND RESPIRATORY THERAPY TREATMENT",058,OTHER DISORDERS OF NERVOUS SYSTEM,01,DISEASES AND DISORDERS OF THE NERVOUS SYSTEM,3,Major,Extreme,Medical,Medicare,Private Health Insurance,,,,false,123458.61,41898.82
New York City,Kings,7002053,001304,NYU Langone Hospital-Brooklyn,50 to 69,112,M,White,Not Span/Hispanic,13,Elective,Home or Self Care,2019,CIR025,SEQUELA OF CEREBRAL INFARCTION AND OTHER CEREBROVASCULAR DISEASE,RHB002,"PHYSICAL, OCCUPATIONAL, AND RESPIRATORY THERAPY TREATMENT",058,OTHER DISORDERS OF NERVOUS SYSTEM,01,DISEASES AND DISORDERS OF THE NERVOUS SYSTEM,2,Moderate,Moderate,Medical,Medicaid,,,,,false,169647.46,41347.8
New York City,Kings,7002053,001304,NYU Langone Hospital-Brooklyn,50 to 69,112,M,White,Unknown,21,Elective,Home w/ Home Health Services,2019,CIR025,SEQUELA OF CEREBRAL INFARCTION AND OTHER CEREBROVASCULAR DISEASE,RHB002,"PHYSICAL, OCCUPATIONAL, AND RESPIRATORY THERAPY TREATMENT",058,OTHER DISORDERS OF NERVOUS SYSTEM,01,DISEASES AND DISORDERS OF THE NERVOUS SYSTEM,2,Moderate,Minor,Medical,Medicaid,,,,,false,201689.72,66355.45
New York City,Kings,7002053,001304,NYU Langone Hospital-Brooklyn,50 to 69,112,M,Other Race,Not Span/Hispanic,15,Elective,Home w/ Home Health Services,2019,CIR025,SEQUELA OF CEREBRAL INFARCTION AND OTHER CEREBROVASCULAR DISEASE,RHB002,"PHYSICAL, OCCUPATIONAL, AND RESPIRATORY THERAPY TREATMENT",058,OTHER DISORDERS OF NERVOUS SYSTEM,01,DISEASES AND DISORDERS OF THE NERVOUS SYSTEM,3,Major,Major,Medical,Medicare,Medicaid,,,,false,131246.86,45760.27
New York City,Kings,7002053,001304,NYU Langone Hospital-Brooklyn,70 or Older,112,F,White,Not Span/Hispanic,20,Elective,Home w/ Home Health Services,2019,CIR025,SEQUELA OF CEREBRAL INFARCTION AND OTHER CEREBROVASCULAR DISEASE,RHB002,"PHYSICAL, OCCUPATIONAL, AND RESPIRATORY THERAPY TREATMENT",058,OTHER DISORDERS OF NERVOUS SYSTEM,01,DISEASES AND DISORDERS OF THE NERVOUS SYSTEM,2,Moderate,Moderate,Medical,Medicare,,,,,false,164553.25,59104.8
New York City,Kings,7002053,001304,NYU Langone Hospital-Brooklyn,30 to 49,112,F,White,Not Span/Hispanic,10,Elective,Home w/ Home Health Services,2019,CIR025,SEQUELA OF CEREBRAL INFARCTION AND OTHER CEREBROVASCULAR DISEASE,RHB002,"PHYSICAL, OCCUPATIONAL, AND RESPIRATORY THERAPY TREATMENT",058,OTHER DISORDERS OF NERVOUS SYSTEM,01,DISEASES AND DISORDERS OF THE NERVOUS SYSTEM,2,Moderate,Minor,Medical,Medicaid,,,,,false,118203.55,31716.17
New York City,Kings,7002053,001304,NYU Langone Hospital-Brooklyn,50 to 69,112,M,White,Not Span/Hispanic,26,Elective,Skilled Nursing Home,2019,CIR025,SEQUELA OF CEREBRAL INFARCTION AND OTHER CEREBROVASCULAR DISEASE,RHB002,"PHYSICAL, OCCUPATIONAL, AND RESPIRATORY THERAPY TREATMENT",058,OTHER DISORDERS OF NERVOUS SYSTEM,01,DISEASES AND DISORDERS OF THE NERVOUS SYSTEM,3,Major,Minor,Medical,Medicaid,,,,,false,309672.93,85275.06
New York City,Kings,7002053,001304,NYU Langone Hospital-Brooklyn,50 to 69,112,M,Other Race,Not Span/Hispanic,22,Elective,Home or Self Care,2019,CIR025,SEQUELA OF CEREBRAL INFARCTION AND OTHER CEREBROVASCULAR DISEASE,RHB002,"PHYSICAL, OCCUPATIONAL, AND RESPIRATORY THERAPY TREATMENT",058,OTHER DISORDERS OF NERVOUS SYSTEM,01,DISEASES AND DISORDERS OF THE NERVOUS SYSTEM,1,Minor,Minor,Medical,Private Health Insurance,,,,,false,196194.32,65925.22