Hospital Service Area,Hospital County,Operating Certificate Number,Permanent Facility Id,Facility Name,Age Group,Zip Code - 3 digits,Gender,Race,Ethnicity,Length of Stay,Type of Admission,Patient Disposition,Discharge Year,CCS Diagnosis Code,CCS Diagnosis Description,CCS Procedure Code,CCS Procedure Description,APR DRG Code,APR DRG Description,APR MDC Code,APR MDC Description,APR Severity of Illness Code,APR Severity of Illness Description,APR Risk of Mortality,APR Medical Surgical Description,Payment Typology 1,Payment Typology 2,Payment Typology 3,Birth Weight,Abortion Edit Indicator,Emergency Department Indicator,Total Charges,Total Costs
Long Island,Nassau,2908000,000511,NYU Langone Hospital-Long Island,30 to 49,111,F,White,Not Span/Hispanic,1,Emergency,Home or Self Care,2019,SYM014,SKIN/SUBCUTANEOUS SIGNS AND SYMPTOMS,,,058,OTHER DISORDERS OF NERVOUS SYSTEM,01,DISEASES AND DISORDERS OF THE NERVOUS SYSTEM,1,Minor,Minor,Medical,Federal/State/Local/VA,,,,,true,76059.09,4813.65
Long Island,Nassau,2908000,000511,NYU Langone Hospital-Long Island,70 or Older,115,M,White,Not Span/Hispanic,3,Trauma,Skilled Nursing Home,2019,CIR025,SEQUELA OF CEREBRAL INFARCTION AND OTHER CEREBROVASCULAR DISEASE,RES007,AIRWAY INTUBATION,058,OTHER DISORDERS OF NERVOUS SYSTEM,01,DISEASES AND DISORDERS OF THE NERVOUS SYSTEM,4,Extreme,Extreme,Medical,Medicare,Medicare,Medicaid,,,true,177314.91,15951.38
Long Island,Nassau,2908000,000511,NYU Langone Hospital-Long Island,70 or Older,115,M,White,Not Span/Hispanic,4,Emergency,Home or Self Care,2019,NVS020,OTHER SPECIFIED NERVOUS SYSTEM DISORDERS,,,058,OTHER DISORDERS OF NERVOUS SYSTEM,01,DISEASES AND DISORDERS OF THE NERVOUS SYSTEM,2,Moderate,Moderate,Medical,Medicare,Medicare,,,,true,71222.79,9255.21
Long Island,Nassau,2908000,000511,NYU Langone Hospital-Long Island,70 or Older,115,M,White,Not Span/Hispanic,3,Emergency,Skilled Nursing Home,2019,SYM010,NERVOUS SYSTEM SIGNS AND SYMPTOMS,,,058,OTHER DISORDERS OF NERVOUS SYSTEM,01,DISEASES AND DISORDERS OF THE NERVOUS SYSTEM,2,Moderate,Moderate,Medical,Medicare,Medicare,Private Health Insurance,,,true,41408.57,7241.69
Long Island,Nassau,2908000,000511,NYU Langone Hospital-Long Island,30 to 49,OOS,F,White,Not Span/Hispanic,3,Emergency,Home or Self Care,2019,NVS020,OTHER SPECIFIED NERVOUS SYSTEM DISORDERS,IMG002,FLUOROSCOPIC ANGIOGRAPHY (EXCLUDING CORONARY),058,OTHER DISORDERS OF NERVOUS SYSTEM,01,DISEASES AND DISORDERS OF THE NERVOUS SYSTEM,3,Major,Minor,Medical,Private Health Insurance,,,,,true,89345.32,14318.09
Long Island,Nassau,2908000,000511,NYU Langone Hospital-Long Island,50 to 69,117,M,White,Not Span/Hispanic,1,Emergency,Home or Self Care,2019,SYM010,NERVOUS SYSTEM SIGNS AND SYMPTOMS,MAM011,ELECTROENCEPHALOGRAM (EEG),058,OTHER DISORDERS OF NERVOUS SYSTEM,01,DISEASES AND DISORDERS OF THE NERVOUS SYSTEM,2,Moderate,Extreme,Medical,Private Health Insurance,,,,,true,45621.83,4270.64
Long Island,Nassau,2908000,000511,NYU Langone Hospital-Long Island,50 to 69,117,M,White,Not Span/Hispanic,1,Emergency,Home or Self Care,2019,EYE006,NEURO-OPHTHALMOLOGY,CNS002,LUMBAR PUNCTURE,058,OTHER DISORDERS OF NERVOUS SYSTEM,01,DISEASES AND DISORDERS OF THE NERVOUS SYSTEM,1,Minor,Minor,Medical,Blue Cross/Blue Shield,,,,,true,42960.88,4782.13
Long Island,Nassau,2908000,000511,NYU Langone Hospital-Long Island,30 to 49,115,F,Other Race,Spanish/Hispanic,2,Emergency,Home or Self Care,2019,NVS008,PARALYSIS (OTHER THAN CEREBRAL PALSY),,,058,OTHER DISORDERS OF NERVOUS SYSTEM,01,DISEASES AND DISORDERS OF THE NERVOUS SYSTEM,2,Moderate,Minor,Medical,Medicare,Medicaid,,,,true,57786.78,5904.83
Long Island,Nassau,2908000,000511,NYU Langone Hospital-Long Island,50 to 69,110,F,White,Not Span/Hispanic,2,Emergency,Home w/ Home Health Services,2019,SYM014,SKIN/SUBCUTANEOUS SIGNS AND SYMPTOMS,,,058,OTHER DISORDERS OF NERVOUS SYSTEM,01,DISEASES AND DISORDERS OF THE NERVOUS SYSTEM,3,Major,Major,Medical,Medicare,Medicare,Private Health Insurance,,,true,78511.86,8294.59
Long Island,Nassau,2908000,000511,NYU Langone Hospital-Long Island,50 to 69,115,M,White,Not Span/Hispanic,2,Emergency,Inpatient Rehabilitation Facility,2019,SYM010,NERVOUS SYSTEM SIGNS AND SYMPTOMS,,,058,OTHER DISORDERS OF NERVOUS SYSTEM,01,DISEASES AND DISORDERS OF THE NERVOUS SYSTEM,1,Minor,Minor,Medical,Blue Cross/Blue Shield,Medicare,,,,true,24185.67,5141.53
Long Island,Nassau,2908000,000511,NYU Langone Hospital-Long Island,70 or Older,117,F,White,Not Span/Hispanic,2,Emergency,Home or Self Care,2019,SYM010,NERVOUS SYSTEM SIGNS AND SYMPTOMS,,,058,OTHER DISORDERS OF NERVOUS SYSTEM,01,DISEASES AND DISORDERS OF THE NERVOUS SYSTEM,1,Minor,Moderate,Medical,Medicare,Medicare,Blue Cross/Blue Shield,,,true,63095.33,7967.18
Long Island,Nassau,2908000,000511,NYU Langone Hospital-Long Island,50 to 69,116,F,Black/African American,Not Span/Hispanic,1,Elective,Home or Self Care,2019,CIR024,OTHER AND ILL-DEFINED CEREBROVASCULAR DISEASE,IMG002,FLUOROSCOPIC ANGIOGRAPHY (EXCLUDING CORONARY),058,OTHER DISORDERS OF NERVOUS SYSTEM,01,DISEASES AND DISORDERS OF THE NERVOUS SYSTEM,1,Minor,Minor,Medical,Private Health Insurance,,,,,false,39332.2,6510.45
Long Island,Nassau,2908000,000511,NYU Langone Hospital-Long Island,70 or Older,115,F,Black/African American,Not Span/Hispanic,9,Emergency,Skilled Nursing Home,2019,NEO072,NEOPLASMS OF UNSPECIFIED NATURE OR UNCERTAIN BEHAVIOR,CNS001,MINIMALLY INVASIVE CNS BIOPSY,058,OTHER DISORDERS OF NERVOUS SYSTEM,01,DISEASES AND DISORDERS OF THE NERVOUS SYSTEM,4,Extreme,Extreme,Medical,Medicare,Medicare,Blue Cross/Blue Shield,,,true,378662.88,43966.95
Long Island,Nassau,2908000,000511,NYU Langone Hospital-Long Island,50 to 69,115,F,Other Race,Spanish/Hispanic,1,Elective,Home or Self Care,2019,CIR024,OTHER AND ILL-DEFINED CEREBROVASCULAR DISEASE,IMG003,FLUOROSCOPIC GUIDANCE FOR CIRCULATORY SYSTEM PROCEDURES,058,OTHER DISORDERS OF NERVOUS SYSTEM,01,DISEASES AND DISORDERS OF THE NERVOUS SYSTEM,1,Minor,Minor,Medical,Medicare,Medicaid,Medicare,,,false,124189.18,19829.72
Long Island,Nassau,2908000,000511,NYU Langone Hospital-Long Island,50 to 69,115,F,White,Not Span/Hispanic,2,Emergency,Home or Self Care,2019,SYM014,SKIN/SUBCUTANEOUS SIGNS AND SYMPTOMS,,,058,OTHER DISORDERS OF NERVOUS SYSTEM,01,DISEASES AND DISORDERS OF THE NERVOUS SYSTEM,1,Minor,Moderate,Medical,Private Health Insurance,,,,,true,101541.18,12169.99
Long Island,Nassau,2908000,000511,NYU Langone Hospital-Long Island,50 to 69,117,F,Black/African American,Not Span/Hispanic,1,Elective,Home or Self Care,2019,CIR024,OTHER AND ILL-DEFINED CEREBROVASCULAR DISEASE,IMG002,FLUOROSCOPIC ANGIOGRAPHY (EXCLUDING CORONARY),058,OTHER DISORDERS OF NERVOUS SYSTEM,01,DISEASES AND DISORDERS OF THE NERVOUS SYSTEM,1,Minor,Minor,Medical,Private Health Insurance,,,,,false,27927.53,4876.25
Long Island,Nassau,2908000,000511,NYU Langone Hospital-Long Island,30 to 49,115,F,Other Race,Spanish/Hispanic,1,Elective,Home or Self Care,2019,CIR024,OTHER AND ILL-DEFINED CEREBROVASCULAR DISEASE,IMG002,FLUOROSCOPIC ANGIOGRAPHY (EXCLUDING CORONARY),058,OTHER DISORDERS OF NERVOUS SYSTEM,01,DISEASES AND DISORDERS OF THE NERVOUS SYSTEM,1,Minor,Minor,Medical,Medicaid,Medicaid,,,,false,57252.01,9350.39
Long Island,Nassau,2908000,000511,NYU Langone Hospital-Long Island,0 to 17,114,M,Black/African American,Not Span/Hispanic,2,Emergency,Home or Self Care,2019,NVS006,OTHER SPECIFIED HEREDITARY AND DEGENERATIVE NERVOUS SYSTEM CONDITIONS,,,058,OTHER DISORDERS OF NERVOUS SYSTEM,01,DISEASES AND DISORDERS OF THE NERVOUS SYSTEM,1,Minor,Minor,Medical,Medicaid,Medicaid,,,,true,53236.02,6029.99
Long Island,Nassau,2908000,000511,NYU Langone Hospital-Long Island,50 to 69,110,F,Other Race,Spanish/Hispanic,1,Emergency,Home or Self Care,2019,SYM010,NERVOUS SYSTEM SIGNS AND SYMPTOMS,,,058,OTHER DISORDERS OF NERVOUS SYSTEM,01,DISEASES AND DISORDERS OF THE NERVOUS SYSTEM,1,Minor,Minor,Medical,Federal/State/Local/VA,,,,,true,59734.97,4506.51
Long Island,Nassau,2908000,000511,NYU Langone Hospital-Long Island,50 to 69,115,M,White,Not Span/Hispanic,4,Emergency,Home w/ Home Health Services,2019,NVS021,POSTPROCEDURAL OR POSTOPERATIVE NERVOUS SYSTEM COMPLICATION,MAM011,ELECTROENCEPHALOGRAM (EEG),058,OTHER DISORDERS OF NERVOUS SYSTEM,01,DISEASES AND DISORDERS OF THE NERVOUS SYSTEM,3,Major,Extreme,Medical,Blue Cross/Blue Shield,Medicare,,,,true,101475.89,13570.47
Long Island,Nassau,2908000,000511,NYU Langone Hospital-Long Island,70 or Older,OOS,F,White,Not Span/Hispanic,5,Emergency,Skilled Nursing Home,2019,SYM010,NERVOUS SYSTEM SIGNS AND SYMPTOMS,,,058,OTHER DISORDERS OF NERVOUS SYSTEM,01,DISEASES AND DISORDERS OF THE NERVOUS SYSTEM,1,Minor,Moderate,Medical,Medicare,Medicare,Blue Cross/Blue Shield,,,true,79620.46,12004.25
Long Island,Nassau,2908000,000511,NYU Langone Hospital-Long Island,70 or Older,115,M,White,Not Span/Hispanic,4,Emergency,Skilled Nursing Home,2019,NVS020,OTHER SPECIFIED NERVOUS SYSTEM DISORDERS,CNS002,LUMBAR PUNCTURE,058,OTHER DISORDERS OF NERVOUS SYSTEM,01,DISEASES AND DISORDERS OF THE NERVOUS SYSTEM,2,Moderate,Moderate,Medical,Medicare,Medicare,,,,true,77545.14,11915.35
Long Island,Nassau,2908000,000511,NYU Langone Hospital-Long Island,50 to 69,115,F,White,Not Span/Hispanic,2,Elective,Home w/ Home Health Services,2019,FAC009,"IMPLANT, DEVICE OR GRAFT RELATED ENCOUNTER",MST028,"SUBCUTANEOUS TISSUE AND FASCIA PROCEDURES, NEC",058,OTHER DISORDERS OF NERVOUS SYSTEM,01,DISEASES AND DISORDERS OF THE NERVOUS SYSTEM,4,Extreme,Moderate,Medical,Medicare,Medicare,Private Health Insurance,,,false,169103.83,27470.62
Long Island,Nassau,2908000,000511,NYU Langone Hospital-Long Island,70 or Older,114,M,Other Race,Spanish/Hispanic,7,Emergency,Home or Self Care,2019,NVS008,PARALYSIS (OTHER THAN CEREBRAL PALSY),,,058,OTHER DISORDERS OF NERVOUS SYSTEM,01,DISEASES AND DISORDERS OF THE NERVOUS SYSTEM,2,Moderate,Minor,Medical,Medicare,Medicare,,,,true,119651.02,17065.22
Long Island,Nassau,2908000,000511,NYU Langone Hospital-Long Island,50 to 69,110,M,White,Not Span/Hispanic,1,Emergency,Home or Self Care,2019,SYM014,SKIN/SUBCUTANEOUS SIGNS AND SYMPTOMS,,,058,OTHER DISORDERS OF NERVOUS SYSTEM,01,DISEASES AND DISORDERS OF THE NERVOUS SYSTEM,1,Minor,Minor,Medical,Private Health Insurance,,,,,true,28102.08,3780.14
Long Island,Nassau,2908000,000511,NYU Langone Hospital-Long Island,70 or Older,115,M,White,Not Span/Hispanic,3,Emergency,Home w/ Home Health Services,2019,NVS020,OTHER SPECIFIED NERVOUS SYSTEM DISORDERS,,,058,OTHER DISORDERS OF NERVOUS SYSTEM,01,DISEASES AND DISORDERS OF THE NERVOUS SYSTEM,2,Moderate,Moderate,Medical,Medicare,Medicare,Medicaid,,,true,27802.07,6263.3
Long Island,Nassau,2908000,000511,NYU Langone Hospital-Long Island,70 or Older,115,F,White,Not Span/Hispanic,4,Emergency,Skilled Nursing Home,2019,SYM010,NERVOUS SYSTEM SIGNS AND SYMPTOMS,,,058,OTHER DISORDERS OF NERVOUS SYSTEM,01,DISEASES AND DISORDERS OF THE NERVOUS SYSTEM,1,Minor,Minor,Medical,Medicare,Medicare,,,,true,56276.53,9132.51
Long Island,Nassau,2908000,000511,NYU Langone Hospital-Long Island,70 or Older,115,M,White,Not Span/Hispanic,6,Emergency,Skilled Nursing Home,2019,SYM010,NERVOUS SYSTEM SIGNS AND SYMPTOMS,,,058,OTHER DISORDERS OF NERVOUS SYSTEM,01,DISEASES AND DISORDERS OF THE NERVOUS SYSTEM,3,Major,Major,Medical,Medicare,Medicare,Private Health Insurance,,,true,81043.69,13881.92
Long Island,Nassau,2908000,000511,NYU Langone Hospital-Long Island,70 or Older,115,M,White,Not Span/Hispanic,3,Emergency,Home or Self Care,2019,SYM014,SKIN/SUBCUTANEOUS SIGNS AND SYMPTOMS,,,058,OTHER DISORDERS OF NERVOUS SYSTEM,01,DISEASES AND DISORDERS OF THE NERVOUS SYSTEM,1,Minor,Moderate,Medical,Medicare,Medicare,Private Health Insurance,,,true,40641.48,6911.95
Long Island,Nassau,2908000,000511,NYU Langone Hospital-Long Island,50 to 69,115,M,White,Not Span/Hispanic,1,Elective,Home or Self Care,2019,CIR024,OTHER AND ILL-DEFINED CEREBROVASCULAR DISEASE,IMG006,COMPUTERIZED TOMOGRAPHY (CT) WITH CONTRAST,058,OTHER DISORDERS OF NERVOUS SYSTEM,01,DISEASES AND DISORDERS OF THE NERVOUS SYSTEM,1,Minor,Minor,Medical,Private Health Insurance,,,,,false,112251.32,18257.54
Long Island,Nassau,2908000,000511,NYU Langone Hospital-Long Island,70 or Older,OOS,M,White,Not Span/Hispanic,7,Emergency,Skilled Nursing Home,2019,NVS020,OTHER SPECIFIED NERVOUS SYSTEM DISORDERS,,,058,OTHER DISORDERS OF NERVOUS SYSTEM,01,DISEASES AND DISORDERS OF THE NERVOUS SYSTEM,2,Moderate,Moderate,Medical,Medicare,Medicare,,,,true,82386.18,15718.45
Long Island,Nassau,2908000,000511,NYU Langone Hospital-Long Island,50 to 69,115,M,Other Race,Not Span/Hispanic,3,Emergency,Home w/ Home Health Services,2019,NEO073,BENIGN NEOPLASMS,,,058,OTHER DISORDERS OF NERVOUS SYSTEM,01,DISEASES AND DISORDERS OF THE NERVOUS SYSTEM,2,Moderate,Minor,Medical,Medicare,Medicare,Medicaid,,,true,45645.45,7030.68
Long Island,Nassau,2908000,000511,NYU Langone Hospital-Long Island,30 to 49,117,F,White,Not Span/Hispanic,8,Emergency,Home w/ Home Health Services,2019,SYM014,SKIN/SUBCUTANEOUS SIGNS AND SYMPTOMS,ADM003,ADMINISTRATION OF ALBUMIN AND GLOBULIN,058,OTHER DISORDERS OF NERVOUS SYSTEM,01,DISEASES AND DISORDERS OF THE NERVOUS SYSTEM,1,Minor,Minor,Medical,Medicaid,Medicaid,,,,true,120662.73,18015.52
Long Island,Nassau,2908000,000511,NYU Langone Hospital-Long Island,30 to 49,115,F,Black/African American,Spanish/Hispanic,2,Emergency,Home or Self Care,2019,SYM014,SKIN/SUBCUTANEOUS SIGNS AND SYMPTOMS,,,058,OTHER DISORDERS OF NERVOUS SYSTEM,01,DISEASES AND DISORDERS OF THE NERVOUS SYSTEM,1,Minor,Minor,Medical,Medicaid,Medicaid,,,,true,63062.1,6428.82
Long Island,Nassau,2908000,000511,NYU Langone Hospital-Long Island,50 to 69,115,F,Other Race,Not Span/Hispanic,3,Emergency,Home w/ Home Health Services,2019,NEO073,BENIGN NEOPLASMS,,,058,OTHER DISORDERS OF NERVOUS SYSTEM,01,DISEASES AND DISORDERS OF THE NERVOUS SYSTEM,3,Major,Moderate,Medical,Medicare,Medicare,,,,true,60320.83,8437.78
Long Island,Nassau,2908000,000511,NYU Langone Hospital-Long Island,0 to 17,115,F,White,Not Span/Hispanic,6,Emergency,Home or Self Care,2019,NVS020,OTHER SPECIFIED NERVOUS SYSTEM DISORDERS,CNS002,LUMBAR PUNCTURE,058,OTHER DISORDERS OF NERVOUS SYSTEM,01,DISEASES AND DISORDERS OF THE NERVOUS SYSTEM,1,Minor,Minor,Medical,Blue Cross/Blue Shield,,,,,true,86251.18,14276.32
Long Island,Nassau,2908000,000511,NYU Langone Hospital-Long Island,50 to 69,117,F,White,Not Span/Hispanic,1,Emergency,Home or Self Care,2019,CIR025,SEQUELA OF CEREBRAL INFARCTION AND OTHER CEREBROVASCULAR DISEASE,,,058,OTHER DISORDERS OF NERVOUS SYSTEM,01,DISEASES AND DISORDERS OF THE NERVOUS SYSTEM,2,Moderate,Moderate,Medical,Private Health Insurance,,,,,true,47026.58,4330.99
Long Island,Nassau,2908000,000511,NYU Langone Hospital-Long Island,50 to 69,115,F,White,Spanish/Hispanic,1,Elective,Home or Self Care,2019,CIR024,OTHER AND ILL-DEFINED CEREBROVASCULAR DISEASE,IMG002,FLUOROSCOPIC ANGIOGRAPHY (EXCLUDING CORONARY),058,OTHER DISORDERS OF NERVOUS SYSTEM,01,DISEASES AND DISORDERS OF THE NERVOUS SYSTEM,1,Minor,Minor,Medical,Medicare,Medicare,,,,false,161883.55,26939.89
Long Island,Nassau,2908000,000511,NYU Langone Hospital-Long Island,70 or Older,115,F,White,Not Span/Hispanic,2,Emergency,Home or Self Care,2019,NVS006,OTHER SPECIFIED HEREDITARY AND DEGENERATIVE NERVOUS SYSTEM CONDITIONS,,,058,OTHER DISORDERS OF NERVOUS SYSTEM,01,DISEASES AND DISORDERS OF THE NERVOUS SYSTEM,1,Minor,Minor,Medical,Medicare,Medicare,,,,true,31621.62,5016.48
Long Island,Nassau,2908000,000511,NYU Langone Hospital-Long Island,50 to 69,115,F,White,Not Span/Hispanic,1,Emergency,Home or Self Care,2019,SYM010,NERVOUS SYSTEM SIGNS AND SYMPTOMS,,,058,OTHER DISORDERS OF NERVOUS SYSTEM,01,DISEASES AND DISORDERS OF THE NERVOUS SYSTEM,1,Minor,Minor,Medical,Blue Cross/Blue Shield,,,,,true,41039.37,4217.68
Long Island,Nassau,2908000,000511,NYU Langone Hospital-Long Island,70 or Older,115,F,Other Race,Spanish/Hispanic,16,Urgent,Inpatient Rehabilitation Facility,2019,NVS020,OTHER SPECIFIED NERVOUS SYSTEM DISORDERS,CNS001,MINIMALLY INVASIVE CNS BIOPSY,058,OTHER DISORDERS OF NERVOUS SYSTEM,01,DISEASES AND DISORDERS OF THE NERVOUS SYSTEM,3,Major,Major,Medical,Medicare,Medicare,Private Health Insurance,,,false,361023.42,49148.13
Long Island,Nassau,2908000,000511,NYU Langone Hospital-Long Island,18 to 29,OOS,F,White,Not Span/Hispanic,2,Elective,Home or Self Care,2019,NVS016,SLEEP WAKE DISORDERS,MAM011,ELECTROENCEPHALOGRAM (EEG),058,OTHER DISORDERS OF NERVOUS SYSTEM,01,DISEASES AND DISORDERS OF THE NERVOUS SYSTEM,1,Minor,Minor,Medical,Private Health Insurance,,,,,false,69350,5907.57
Long Island,Nassau,2908000,000511,NYU Langone Hospital-Long Island,0 to 17,115,F,White,Spanish/Hispanic,1,Emergency,Home or Self Care,2019,EYE006,NEURO-OPHTHALMOLOGY,,,058,OTHER DISORDERS OF NERVOUS SYSTEM,01,DISEASES AND DISORDERS OF THE NERVOUS SYSTEM,1,Minor,Minor,Medical,Medicaid,Medicaid,,,,true,29862.33,3076.98
Long Island,Nassau,2908000,000511,NYU Langone Hospital-Long Island,70 or Older,115,F,Black/African American,Not Span/Hispanic,3,Emergency,Home w/ Home Health Services,2019,SYM010,NERVOUS SYSTEM SIGNS AND SYMPTOMS,,,058,OTHER DISORDERS OF NERVOUS SYSTEM,01,DISEASES AND DISORDERS OF THE NERVOUS SYSTEM,2,Moderate,Moderate,Medical,Medicare,Medicare,Blue Cross/Blue Shield,,,true,62027.74,9063.81
Long Island,Nassau,2908000,000511,NYU Langone Hospital-Long Island,0 to 17,117,F,White,Not Span/Hispanic,2,Emergency,Home or Self Care,2019,NEO072,NEOPLASMS OF UNSPECIFIED NATURE OR UNCERTAIN BEHAVIOR,MAM011,ELECTROENCEPHALOGRAM (EEG),058,OTHER DISORDERS OF NERVOUS SYSTEM,01,DISEASES AND DISORDERS OF THE NERVOUS SYSTEM,2,Moderate,Moderate,Medical,Private Health Insurance,,,,,true,78034.18,8404.75
Long Island,Nassau,2908000,000511,NYU Langone Hospital-Long Island,50 to 69,115,M,Other Race,Not Span/Hispanic,2,Emergency,Home or Self Care,2019,NEO073,BENIGN NEOPLASMS,,,058,OTHER DISORDERS OF NERVOUS SYSTEM,01,DISEASES AND DISORDERS OF THE NERVOUS SYSTEM,3,Major,Major,Medical,Medicare,Medicare,Medicaid,,,true,41707.38,5522.37
Long Island,Nassau,2908000,000511,NYU Langone Hospital-Long Island,50 to 69,117,F,White,Not Span/Hispanic,1,Elective,Home or Self Care,2019,CIR024,OTHER AND ILL-DEFINED CEREBROVASCULAR DISEASE,IMG002,FLUOROSCOPIC ANGIOGRAPHY (EXCLUDING CORONARY),058,OTHER DISORDERS OF NERVOUS SYSTEM,01,DISEASES AND DISORDERS OF THE NERVOUS SYSTEM,1,Minor,Minor,Medical,Medicare,Medicare,,,,false,44533.35,7354.66
Long Island,Nassau,2908000,000511,NYU Langone Hospital-Long Island,30 to 49,115,M,Other Race,Spanish/Hispanic,2,Emergency,Home or Self Care,2019,NVS020,OTHER SPECIFIED NERVOUS SYSTEM DISORDERS,,,058,OTHER DISORDERS OF NERVOUS SYSTEM,01,DISEASES AND DISORDERS OF THE NERVOUS SYSTEM,1,Minor,Minor,Medical,Medicaid,,,,,true,53210.83,5583.59
Long Island,Nassau,2908000,000511,NYU Langone Hospital-Long Island,70 or Older,115,F,White,Not Span/Hispanic,15,Urgent,Skilled Nursing Home,2019,NVS021,POSTPROCEDURAL OR POSTOPERATIVE NERVOUS SYSTEM COMPLICATION,MST028,"SUBCUTANEOUS TISSUE AND FASCIA PROCEDURES, NEC",058,OTHER DISORDERS OF NERVOUS SYSTEM,01,DISEASES AND DISORDERS OF THE NERVOUS SYSTEM,3,Major,Major,Medical,Medicare,Medicare,Blue Cross/Blue Shield,,,false,364484.68,58686.09
Long Island,Nassau,2908000,000511,NYU Langone Hospital-Long Island,30 to 49,117,F,White,Not Span/Hispanic,1,Emergency,Home or Self Care,2019,SYM014,SKIN/SUBCUTANEOUS SIGNS AND SYMPTOMS,,,058,OTHER DISORDERS OF NERVOUS SYSTEM,01,DISEASES AND DISORDERS OF THE NERVOUS SYSTEM,1,Minor,Minor,Medical,Private Health Insurance,,,,,true,46908.96,4233.75
Long Island,Nassau,2908000,000511,NYU Langone Hospital-Long Island,50 to 69,110,M,White,Not Span/Hispanic,2,Emergency,Home or Self Care,2019,SYM014,SKIN/SUBCUTANEOUS SIGNS AND SYMPTOMS,MAM004,CARDIAC STRESS TESTS,058,OTHER DISORDERS OF NERVOUS SYSTEM,01,DISEASES AND DISORDERS OF THE NERVOUS SYSTEM,1,Minor,Minor,Medical,Private Health Insurance,,,,,true,46474.86,7951.66
Long Island,Nassau,2908000,000511,NYU Langone Hospital-Long Island,70 or Older,115,M,White,Not Span/Hispanic,2,Emergency,Home or Self Care,2019,CIR024,OTHER AND ILL-DEFINED CEREBROVASCULAR DISEASE,,,058,OTHER DISORDERS OF NERVOUS SYSTEM,01,DISEASES AND DISORDERS OF THE NERVOUS SYSTEM,4,Extreme,Major,Medical,Medicare,Medicare,Private Health Insurance,,,true,51237.99,5465.44
Long Island,Nassau,2908000,000511,NYU Langone Hospital-Long Island,30 to 49,115,M,White,Not Span/Hispanic,1,Emergency,Home or Self Care,2019,CIR025,SEQUELA OF CEREBRAL INFARCTION AND OTHER CEREBROVASCULAR DISEASE,,,058,OTHER DISORDERS OF NERVOUS SYSTEM,01,DISEASES AND DISORDERS OF THE NERVOUS SYSTEM,2,Moderate,Minor,Medical,Blue Cross/Blue Shield,,,,,true,60034.88,4851.44
Long Island,Nassau,2908000,000511,NYU Langone Hospital-Long Island,0 to 17,110,F,Other Race,Spanish/Hispanic,2,Emergency,Home or Self Care,2019,NVS020,OTHER SPECIFIED NERVOUS SYSTEM DISORDERS,IMG005,MAGNETIC RESONANCE IMAGING (MRI),058,OTHER DISORDERS OF NERVOUS SYSTEM,01,DISEASES AND DISORDERS OF THE NERVOUS SYSTEM,1,Minor,Minor,Medical,Medicaid,Medicaid,,,,true,34449.98,4971.34
Long Island,Nassau,2908000,000511,NYU Langone Hospital-Long Island,0 to 17,117,F,White,Spanish/Hispanic,2,Elective,Home or Self Care,2019,SYM017,ABNORMAL FINDINGS WITHOUT DIAGNOSIS,MAM011,ELECTROENCEPHALOGRAM (EEG),058,OTHER DISORDERS OF NERVOUS SYSTEM,01,DISEASES AND DISORDERS OF THE NERVOUS SYSTEM,1,Minor,Minor,Medical,Medicaid,Medicaid,,,,false,62152.82,5593.87
Long Island,Nassau,2908000,000511,NYU Langone Hospital-Long Island,50 to 69,115,F,White,Not Span/Hispanic,7,Emergency,Home w/ Home Health Services,2019,SYM010,NERVOUS SYSTEM SIGNS AND SYMPTOMS,,,058,OTHER DISORDERS OF NERVOUS SYSTEM,01,DISEASES AND DISORDERS OF THE NERVOUS SYSTEM,3,Major,Minor,Medical,Medicare,Medicare,Blue Cross/Blue Shield,,,true,85822.93,14937.27
Long Island,Nassau,2908000,000511,NYU Langone Hospital-Long Island,30 to 49,115,F,Black/African American,Not Span/Hispanic,1,Emergency,Home or Self Care,2019,SYM014,SKIN/SUBCUTANEOUS SIGNS AND SYMPTOMS,,,058,OTHER DISORDERS OF NERVOUS SYSTEM,01,DISEASES AND DISORDERS OF THE NERVOUS SYSTEM,1,Minor,Minor,Medical,Medicaid,,,,,true,44826.08,4123.78
Long Island,Nassau,2908000,000511,NYU Langone Hospital-Long Island,30 to 49,117,F,White,Not Span/Hispanic,2,Emergency,Home or Self Care,2019,MAL001,CARDIAC AND CIRCULATORY CONGENITAL ANOMALIES,IMG002,FLUOROSCOPIC ANGIOGRAPHY (EXCLUDING CORONARY),058,OTHER DISORDERS OF NERVOUS SYSTEM,01,DISEASES AND DISORDERS OF THE NERVOUS SYSTEM,2,Moderate,Minor,Medical,Private Health Insurance,,,,,true,82186.2,10112.04
Long Island,Nassau,2908000,000511,NYU Langone Hospital-Long Island,50 to 69,117,M,Black/African American,Not Span/Hispanic,10,Emergency,Home or Self Care,2019,CIR025,SEQUELA OF CEREBRAL INFARCTION AND OTHER CEREBROVASCULAR DISEASE,MAM004,CARDIAC STRESS TESTS,058,OTHER DISORDERS OF NERVOUS SYSTEM,01,DISEASES AND DISORDERS OF THE NERVOUS SYSTEM,3,Major,Moderate,Medical,Medicaid,Medicaid,,,,true,114900.3,22862.79
Long Island,Nassau,2908000,000511,NYU Langone Hospital-Long Island,50 to 69,115,F,Black/African American,Not Span/Hispanic,3,Emergency,Home w/ Home Health Services,2019,CIR025,SEQUELA OF CEREBRAL INFARCTION AND OTHER CEREBROVASCULAR DISEASE,MAM011,ELECTROENCEPHALOGRAM (EEG),058,OTHER DISORDERS OF NERVOUS SYSTEM,01,DISEASES AND DISORDERS OF THE NERVOUS SYSTEM,2,Moderate,Minor,Medical,Medicaid,Medicaid,,,,true,105647.7,9613.47
Long Island,Nassau,2908000,000511,NYU Langone Hospital-Long Island,70 or Older,117,F,White,Not Span/Hispanic,2,Emergency,Home or Self Care,2019,NEO072,NEOPLASMS OF UNSPECIFIED NATURE OR UNCERTAIN BEHAVIOR,CNS002,LUMBAR PUNCTURE,058,OTHER DISORDERS OF NERVOUS SYSTEM,01,DISEASES AND DISORDERS OF THE NERVOUS SYSTEM,2,Moderate,Minor,Medical,Medicare,Medicare,,,,true,90416.87,8649.58