Hospital Service Area,Hospital County,Operating Certificate Number,Permanent Facility Id,Facility Name,Age Group,Zip Code - 3 digits,Gender,Race,Ethnicity,Length of Stay,Type of Admission,Patient Disposition,Discharge Year,CCS Diagnosis Code,CCS Diagnosis Description,CCS Procedure Code,CCS Procedure Description,APR DRG Code,APR DRG Description,APR MDC Code,APR MDC Description,APR Severity of Illness Code,APR Severity of Illness Description,APR Risk of Mortality,APR Medical Surgical Description,Payment Typology 1,Payment Typology 2,Payment Typology 3,Birth Weight,Abortion Edit Indicator,Emergency Department Indicator,Total Charges,Total Costs
Long Island,Suffolk,5123000,000885,Long Island Community Hospital,70 or Older,119,M,White,Not Span/Hispanic,6,Emergency,Skilled Nursing Home,2019,SYM010,NERVOUS SYSTEM SIGNS AND SYMPTOMS,,,058,OTHER DISORDERS OF NERVOUS SYSTEM,01,DISEASES AND DISORDERS OF THE NERVOUS SYSTEM,1,Minor,Moderate,Medical,Medicare,Medicare,Private Health Insurance,,,true,67922.96,8460.46
Long Island,Suffolk,5123000,000885,Long Island Community Hospital,70 or Older,117,F,White,Not Span/Hispanic,6,Emergency,Skilled Nursing Home,2019,SYM016,OTHER GENERAL SIGNS AND SYMPTOMS,,,058,OTHER DISORDERS OF NERVOUS SYSTEM,01,DISEASES AND DISORDERS OF THE NERVOUS SYSTEM,1,Minor,Moderate,Medical,Medicare,,,,,true,64375.55,8208.04
Long Island,Suffolk,5123000,000885,Long Island Community Hospital,70 or Older,117,M,White,Not Span/Hispanic,15,Emergency,Expired,2019,SYM010,NERVOUS SYSTEM SIGNS AND SYMPTOMS,ESA004,NON-INVASIVE VENTILATION,058,OTHER DISORDERS OF NERVOUS SYSTEM,01,DISEASES AND DISORDERS OF THE NERVOUS SYSTEM,4,Extreme,Extreme,Medical,Medicare,Medicare,Private Health Insurance,,,true,145767.33,23308.57
Long Island,Suffolk,5123000,000885,Long Island Community Hospital,50 to 69,117,M,White,Not Span/Hispanic,4,Emergency,Home w/ Home Health Services,2019,SYM016,OTHER GENERAL SIGNS AND SYMPTOMS,,,058,OTHER DISORDERS OF NERVOUS SYSTEM,01,DISEASES AND DISORDERS OF THE NERVOUS SYSTEM,1,Minor,Moderate,Medical,Medicare,Medicare,Private Health Insurance,,,true,39841.95,6788.32
Long Island,Suffolk,5123000,000885,Long Island Community Hospital,70 or Older,119,F,White,Not Span/Hispanic,3,Emergency,Skilled Nursing Home,2019,SYM010,NERVOUS SYSTEM SIGNS AND SYMPTOMS,,,058,OTHER DISORDERS OF NERVOUS SYSTEM,01,DISEASES AND DISORDERS OF THE NERVOUS SYSTEM,1,Minor,Moderate,Medical,Medicare,Medicare,Blue Cross/Blue Shield,,,true,24658.66,4140.41
Long Island,Suffolk,5123000,000885,Long Island Community Hospital,30 to 49,117,M,Other Race,Not Span/Hispanic,4,Emergency,Home or Self Care,2019,MAL004,NERVOUS SYSTEM CONGENITAL ANOMALIES,,,058,OTHER DISORDERS OF NERVOUS SYSTEM,01,DISEASES AND DISORDERS OF THE NERVOUS SYSTEM,2,Moderate,Minor,Medical,Medicaid,,,,,true,46227.36,8461.1
Long Island,Suffolk,5123000,000885,Long Island Community Hospital,50 to 69,117,M,White,Not Span/Hispanic,3,Emergency,Home or Self Care,2019,SYM010,NERVOUS SYSTEM SIGNS AND SYMPTOMS,,,058,OTHER DISORDERS OF NERVOUS SYSTEM,01,DISEASES AND DISORDERS OF THE NERVOUS SYSTEM,1,Minor,Moderate,Medical,Medicare,Medicare,,,,true,60993.18,8291.32
Long Island,Suffolk,5123000,000885,Long Island Community Hospital,70 or Older,117,F,White,Not Span/Hispanic,6,Emergency,Home w/ Home Health Services,2019,SYM010,NERVOUS SYSTEM SIGNS AND SYMPTOMS,IMG004,FLUOROSCOPY OF NON-CIRCULATORY ORGANS,058,OTHER DISORDERS OF NERVOUS SYSTEM,01,DISEASES AND DISORDERS OF THE NERVOUS SYSTEM,2,Moderate,Moderate,Medical,Medicare,Medicare,,,,true,57371.8,11318.2
Long Island,Suffolk,5123000,000885,Long Island Community Hospital,70 or Older,117,F,White,Not Span/Hispanic,2,Emergency,Home w/ Home Health Services,2019,SYM010,NERVOUS SYSTEM SIGNS AND SYMPTOMS,,,058,OTHER DISORDERS OF NERVOUS SYSTEM,01,DISEASES AND DISORDERS OF THE NERVOUS SYSTEM,1,Minor,Moderate,Medical,Medicare,Medicare,Private Health Insurance,,,true,19707.92,3331.24
Long Island,Suffolk,5123000,000885,Long Island Community Hospital,70 or Older,117,F,White,Not Span/Hispanic,5,Emergency,Skilled Nursing Home,2019,SYM014,SKIN/SUBCUTANEOUS SIGNS AND SYMPTOMS,ESA001,HEMODIALYSIS,058,OTHER DISORDERS OF NERVOUS SYSTEM,01,DISEASES AND DISORDERS OF THE NERVOUS SYSTEM,3,Major,Moderate,Medical,Medicare,Medicare,Blue Cross/Blue Shield,,,true,78322.79,12818.22
Long Island,Suffolk,5123000,000885,Long Island Community Hospital,50 to 69,117,F,Other Race,Not Span/Hispanic,4,Emergency,Home or Self Care,2019,CIR024,OTHER AND ILL-DEFINED CEREBROVASCULAR DISEASE,SUD002,PHARMACOTHERAPY FOR SUBSTANCE USE,058,OTHER DISORDERS OF NERVOUS SYSTEM,01,DISEASES AND DISORDERS OF THE NERVOUS SYSTEM,2,Moderate,Moderate,Medical,Private Health Insurance,,,,,true,75381.99,9262.44
Long Island,Suffolk,5123000,000885,Long Island Community Hospital,70 or Older,117,F,White,Not Span/Hispanic,4,Emergency,Skilled Nursing Home,2019,SYM010,NERVOUS SYSTEM SIGNS AND SYMPTOMS,,,058,OTHER DISORDERS OF NERVOUS SYSTEM,01,DISEASES AND DISORDERS OF THE NERVOUS SYSTEM,1,Minor,Minor,Medical,Medicare,,,,,true,22970.24,5367.09
Long Island,Suffolk,5123000,000885,Long Island Community Hospital,70 or Older,117,M,White,Not Span/Hispanic,4,Emergency,Skilled Nursing Home,2019,SYM010,NERVOUS SYSTEM SIGNS AND SYMPTOMS,GIS017,GASTROSTOMY,058,OTHER DISORDERS OF NERVOUS SYSTEM,01,DISEASES AND DISORDERS OF THE NERVOUS SYSTEM,2,Moderate,Moderate,Medical,Medicare,Medicare,Private Health Insurance,,,true,33552.71,8098.42
Long Island,Suffolk,5123000,000885,Long Island Community Hospital,50 to 69,117,F,White,Not Span/Hispanic,5,Emergency,Skilled Nursing Home,2019,SYM010,NERVOUS SYSTEM SIGNS AND SYMPTOMS,,,058,OTHER DISORDERS OF NERVOUS SYSTEM,01,DISEASES AND DISORDERS OF THE NERVOUS SYSTEM,2,Moderate,Major,Medical,Medicare,Medicare,Blue Cross/Blue Shield,,,true,34823.88,6715.33
Long Island,Suffolk,5123000,000885,Long Island Community Hospital,50 to 69,119,F,White,Not Span/Hispanic,4,Emergency,Skilled Nursing Home,2019,SYM010,NERVOUS SYSTEM SIGNS AND SYMPTOMS,,,058,OTHER DISORDERS OF NERVOUS SYSTEM,01,DISEASES AND DISORDERS OF THE NERVOUS SYSTEM,1,Minor,Minor,Medical,Private Health Insurance,Medicare,Medicare,,,true,81199.88,9597.06
Long Island,Suffolk,5123000,000885,Long Island Community Hospital,50 to 69,112,M,Black/African American,Not Span/Hispanic,2,Emergency,Left Against Medical Advice,2019,NEO073,BENIGN NEOPLASMS,,,058,OTHER DISORDERS OF NERVOUS SYSTEM,01,DISEASES AND DISORDERS OF THE NERVOUS SYSTEM,4,Extreme,Major,Medical,Private Health Insurance,Medicaid,,,,true,35638.94,5830.78
Long Island,Suffolk,5123000,000885,Long Island Community Hospital,70 or Older,117,F,White,Not Span/Hispanic,9,Emergency,Skilled Nursing Home,2019,SYM010,NERVOUS SYSTEM SIGNS AND SYMPTOMS,,,058,OTHER DISORDERS OF NERVOUS SYSTEM,01,DISEASES AND DISORDERS OF THE NERVOUS SYSTEM,1,Minor,Minor,Medical,Medicare,Medicare,Medicaid,,,true,49174.5,11125.06
Long Island,Suffolk,5123000,000885,Long Island Community Hospital,70 or Older,117,M,White,Not Span/Hispanic,6,Emergency,Skilled Nursing Home,2019,SYM010,NERVOUS SYSTEM SIGNS AND SYMPTOMS,,,058,OTHER DISORDERS OF NERVOUS SYSTEM,01,DISEASES AND DISORDERS OF THE NERVOUS SYSTEM,1,Minor,Moderate,Medical,Medicare,Medicare,Blue Cross/Blue Shield,,,true,68851.28,9126.15
Long Island,Suffolk,5123000,000885,Long Island Community Hospital,70 or Older,117,F,Black/African American,Not Span/Hispanic,2,Emergency,Skilled Nursing Home,2019,SYM010,NERVOUS SYSTEM SIGNS AND SYMPTOMS,,,058,OTHER DISORDERS OF NERVOUS SYSTEM,01,DISEASES AND DISORDERS OF THE NERVOUS SYSTEM,2,Moderate,Major,Medical,Medicare,Medicaid,,,,true,18443.14,3075.51
Long Island,Suffolk,5123000,000885,Long Island Community Hospital,70 or Older,117,F,White,Not Span/Hispanic,3,Emergency,Skilled Nursing Home,2019,SYM010,NERVOUS SYSTEM SIGNS AND SYMPTOMS,,,058,OTHER DISORDERS OF NERVOUS SYSTEM,01,DISEASES AND DISORDERS OF THE NERVOUS SYSTEM,3,Major,Moderate,Medical,Medicare,Medicare,,,,true,46584.34,5350.33
Long Island,Suffolk,5123000,000885,Long Island Community Hospital,70 or Older,117,M,White,Not Span/Hispanic,7,Emergency,Home or Self Care,2019,CIR024,OTHER AND ILL-DEFINED CEREBROVASCULAR DISEASE,,,058,OTHER DISORDERS OF NERVOUS SYSTEM,01,DISEASES AND DISORDERS OF THE NERVOUS SYSTEM,4,Extreme,Major,Medical,Medicare,Medicare,Medicaid,,,true,85329.74,12631.63
Long Island,Suffolk,5123000,000885,Long Island Community Hospital,18 to 29,,M,Black/African American,Not Span/Hispanic,1,Emergency,Home or Self Care,2019,NEO072,NEOPLASMS OF UNSPECIFIED NATURE OR UNCERTAIN BEHAVIOR,,,058,OTHER DISORDERS OF NERVOUS SYSTEM,01,DISEASES AND DISORDERS OF THE NERVOUS SYSTEM,4,Extreme,Extreme,Medical,Medicaid,,,,,true,22874.15,3612.55
Long Island,Suffolk,5123000,000885,Long Island Community Hospital,30 to 49,117,M,White,Not Span/Hispanic,6,Emergency,Skilled Nursing Home,2019,SYM014,SKIN/SUBCUTANEOUS SIGNS AND SYMPTOMS,ADM017,ADMINISTRATION OF NUTRITIONAL AND ELECTROLYTIC SUBSTANCES,058,OTHER DISORDERS OF NERVOUS SYSTEM,01,DISEASES AND DISORDERS OF THE NERVOUS SYSTEM,1,Minor,Minor,Medical,Medicare,Medicare,Medicaid,,,true,74558.23,12354.58
Long Island,Suffolk,5123000,000885,Long Island Community Hospital,50 to 69,117,M,White,Not Span/Hispanic,8,Emergency,Skilled Nursing Home,2019,SYM010,NERVOUS SYSTEM SIGNS AND SYMPTOMS,,,058,OTHER DISORDERS OF NERVOUS SYSTEM,01,DISEASES AND DISORDERS OF THE NERVOUS SYSTEM,2,Moderate,Major,Medical,Medicare,Medicare,Medicaid,,,true,66872.76,12952.18
Long Island,Suffolk,5123000,000885,Long Island Community Hospital,70 or Older,117,F,White,Not Span/Hispanic,6,Emergency,Skilled Nursing Home,2019,SYM016,OTHER GENERAL SIGNS AND SYMPTOMS,,,058,OTHER DISORDERS OF NERVOUS SYSTEM,01,DISEASES AND DISORDERS OF THE NERVOUS SYSTEM,2,Moderate,Major,Medical,Medicare,Medicare,,,,true,45080.74,8160.01
Long Island,Suffolk,5123000,000885,Long Island Community Hospital,70 or Older,119,F,White,Not Span/Hispanic,4,Emergency,Skilled Nursing Home,2019,SYM010,NERVOUS SYSTEM SIGNS AND SYMPTOMS,,,058,OTHER DISORDERS OF NERVOUS SYSTEM,01,DISEASES AND DISORDERS OF THE NERVOUS SYSTEM,2,Moderate,Major,Medical,Medicare,Medicare,Private Health Insurance,,,true,36978.07,6137.72
Long Island,Suffolk,5123000,000885,Long Island Community Hospital,70 or Older,117,M,White,Not Span/Hispanic,4,Emergency,Home w/ Home Health Services,2019,SYM010,NERVOUS SYSTEM SIGNS AND SYMPTOMS,,,058,OTHER DISORDERS OF NERVOUS SYSTEM,01,DISEASES AND DISORDERS OF THE NERVOUS SYSTEM,2,Moderate,Moderate,Medical,Medicare,Medicare,Private Health Insurance,,,true,26156.73,5590.92
Long Island,Suffolk,5123000,000885,Long Island Community Hospital,50 to 69,117,F,White,Not Span/Hispanic,3,Emergency,Skilled Nursing Home,2019,SYM010,NERVOUS SYSTEM SIGNS AND SYMPTOMS,,,058,OTHER DISORDERS OF NERVOUS SYSTEM,01,DISEASES AND DISORDERS OF THE NERVOUS SYSTEM,1,Minor,Minor,Medical,Medicare,Medicare,Medicaid,,,true,31721.81,4972.76
Long Island,Suffolk,5123000,000885,Long Island Community Hospital,70 or Older,117,M,White,Not Span/Hispanic,9,Emergency,Home w/ Home Health Services,2019,SYM016,OTHER GENERAL SIGNS AND SYMPTOMS,ADM017,ADMINISTRATION OF NUTRITIONAL AND ELECTROLYTIC SUBSTANCES,058,OTHER DISORDERS OF NERVOUS SYSTEM,01,DISEASES AND DISORDERS OF THE NERVOUS SYSTEM,2,Moderate,Major,Medical,Medicare,Medicare,Blue Cross/Blue Shield,,,true,69830.02,11674.36
Long Island,Suffolk,5123000,000885,Long Island Community Hospital,50 to 69,117,M,White,Not Span/Hispanic,3,Emergency,Home w/ Home Health Services,2019,SYM010,NERVOUS SYSTEM SIGNS AND SYMPTOMS,,,058,OTHER DISORDERS OF NERVOUS SYSTEM,01,DISEASES AND DISORDERS OF THE NERVOUS SYSTEM,1,Minor,Moderate,Medical,Medicare,Medicare,Medicaid,,,true,28284.33,4509.4
Long Island,Suffolk,5123000,000885,Long Island Community Hospital,70 or Older,117,F,White,Not Span/Hispanic,6,Emergency,Skilled Nursing Home,2019,SYM016,OTHER GENERAL SIGNS AND SYMPTOMS,URN006,BLADDER CATHETERIZATION AND DRAINAGE,058,OTHER DISORDERS OF NERVOUS SYSTEM,01,DISEASES AND DISORDERS OF THE NERVOUS SYSTEM,1,Minor,Minor,Medical,Medicare,Medicare,Private Health Insurance,,,true,65515.74,8799.17
Long Island,Suffolk,5123000,000885,Long Island Community Hospital,50 to 69,117,F,White,Not Span/Hispanic,1,Emergency,Home or Self Care,2019,SYM016,OTHER GENERAL SIGNS AND SYMPTOMS,,,058,OTHER DISORDERS OF NERVOUS SYSTEM,01,DISEASES AND DISORDERS OF THE NERVOUS SYSTEM,3,Major,Major,Medical,Medicare,Medicare,Medicaid,,,true,28837.76,2077.25
Long Island,Suffolk,5123000,000885,Long Island Community Hospital,70 or Older,117,F,White,Not Span/Hispanic,4,Emergency,Short-term Hospital,2019,SYM010,NERVOUS SYSTEM SIGNS AND SYMPTOMS,,,058,OTHER DISORDERS OF NERVOUS SYSTEM,01,DISEASES AND DISORDERS OF THE NERVOUS SYSTEM,3,Major,Major,Medical,Medicare,Medicare,Private Health Insurance,,,true,45509.86,9096.17
Long Island,Suffolk,5123000,000885,Long Island Community Hospital,50 to 69,117,M,White,Not Span/Hispanic,37,Emergency,Home or Self Care,2019,SYM010,NERVOUS SYSTEM SIGNS AND SYMPTOMS,,,058,OTHER DISORDERS OF NERVOUS SYSTEM,01,DISEASES AND DISORDERS OF THE NERVOUS SYSTEM,3,Major,Major,Medical,Private Health Insurance,Medicaid,,,,true,220686.15,50763.62
Long Island,Suffolk,5123000,000885,Long Island Community Hospital,70 or Older,117,F,White,Not Span/Hispanic,3,Emergency,Skilled Nursing Home,2019,SYM010,NERVOUS SYSTEM SIGNS AND SYMPTOMS,,,058,OTHER DISORDERS OF NERVOUS SYSTEM,01,DISEASES AND DISORDERS OF THE NERVOUS SYSTEM,3,Major,Major,Medical,Medicare,Medicare,,,,true,37464.53,7257.61
Long Island,Suffolk,5123000,000885,Long Island Community Hospital,30 to 49,117,F,Black/African American,Not Span/Hispanic,1,Emergency,Short-term Hospital,2019,NVS020,OTHER SPECIFIED NERVOUS SYSTEM DISORDERS,,,058,OTHER DISORDERS OF NERVOUS SYSTEM,01,DISEASES AND DISORDERS OF THE NERVOUS SYSTEM,2,Moderate,Moderate,Medical,Private Health Insurance,Medicaid,,,,true,27653.28,4098.65
Long Island,Suffolk,5123000,000885,Long Island Community Hospital,70 or Older,117,F,White,Not Span/Hispanic,2,Urgent,Home w/ Home Health Services,2019,NVS020,OTHER SPECIFIED NERVOUS SYSTEM DISORDERS,CNS002,LUMBAR PUNCTURE,058,OTHER DISORDERS OF NERVOUS SYSTEM,01,DISEASES AND DISORDERS OF THE NERVOUS SYSTEM,1,Minor,Minor,Medical,Medicare,Medicare,Blue Cross/Blue Shield,,,false,39010.85,8824.22
Long Island,Suffolk,5123000,000885,Long Island Community Hospital,50 to 69,117,M,White,Not Span/Hispanic,9,Emergency,Skilled Nursing Home,2019,SYM010,NERVOUS SYSTEM SIGNS AND SYMPTOMS,,,058,OTHER DISORDERS OF NERVOUS SYSTEM,01,DISEASES AND DISORDERS OF THE NERVOUS SYSTEM,1,Minor,Minor,Medical,Blue Cross/Blue Shield,,,,,true,47661.34,11337.72
Long Island,Suffolk,5123000,000885,Long Island Community Hospital,50 to 69,117,F,White,Not Span/Hispanic,4,Emergency,Skilled Nursing Home,2019,SYM016,OTHER GENERAL SIGNS AND SYMPTOMS,,,058,OTHER DISORDERS OF NERVOUS SYSTEM,01,DISEASES AND DISORDERS OF THE NERVOUS SYSTEM,2,Moderate,Moderate,Medical,Medicare,Medicare,Medicaid,,,true,53989.21,7776.18
Long Island,Suffolk,5123000,000885,Long Island Community Hospital,70 or Older,OOS,M,White,Not Span/Hispanic,3,Emergency,Home or Self Care,2019,NVS020,OTHER SPECIFIED NERVOUS SYSTEM DISORDERS,,,058,OTHER DISORDERS OF NERVOUS SYSTEM,01,DISEASES AND DISORDERS OF THE NERVOUS SYSTEM,3,Major,Moderate,Medical,Medicare,Medicare,Private Health Insurance,,,true,53207.73,7111.13
Long Island,Suffolk,5123000,000885,Long Island Community Hospital,50 to 69,117,M,White,Not Span/Hispanic,4,Emergency,Skilled Nursing Home,2019,CIR025,SEQUELA OF CEREBRAL INFARCTION AND OTHER CEREBROVASCULAR DISEASE,,,058,OTHER DISORDERS OF NERVOUS SYSTEM,01,DISEASES AND DISORDERS OF THE NERVOUS SYSTEM,2,Moderate,Moderate,Medical,Medicare,Medicare,Blue Cross/Blue Shield,,,true,74051.99,7274.99
Long Island,Suffolk,5123000,000885,Long Island Community Hospital,50 to 69,119,M,White,Not Span/Hispanic,1,Emergency,Skilled Nursing Home,2019,SYM010,NERVOUS SYSTEM SIGNS AND SYMPTOMS,,,058,OTHER DISORDERS OF NERVOUS SYSTEM,01,DISEASES AND DISORDERS OF THE NERVOUS SYSTEM,1,Minor,Minor,Medical,Medicare,Medicare,,,,true,37277.82,2826.62
Long Island,Suffolk,5123000,000885,Long Island Community Hospital,70 or Older,119,F,White,Not Span/Hispanic,3,Emergency,Home w/ Home Health Services,2019,SYM010,NERVOUS SYSTEM SIGNS AND SYMPTOMS,,,058,OTHER DISORDERS OF NERVOUS SYSTEM,01,DISEASES AND DISORDERS OF THE NERVOUS SYSTEM,1,Minor,Moderate,Medical,Medicare,Medicaid,,,,true,43309.86,5444.8
Long Island,Suffolk,5123000,000885,Long Island Community Hospital,70 or Older,117,F,White,Not Span/Hispanic,3,Emergency,Skilled Nursing Home,2019,SYM010,NERVOUS SYSTEM SIGNS AND SYMPTOMS,,,058,OTHER DISORDERS OF NERVOUS SYSTEM,01,DISEASES AND DISORDERS OF THE NERVOUS SYSTEM,1,Minor,Moderate,Medical,Medicare,,,,,true,28330.12,4207.44
Long Island,Suffolk,5123000,000885,Long Island Community Hospital,70 or Older,119,F,White,Not Span/Hispanic,4,Emergency,Skilled Nursing Home,2019,SYM016,OTHER GENERAL SIGNS AND SYMPTOMS,,,058,OTHER DISORDERS OF NERVOUS SYSTEM,01,DISEASES AND DISORDERS OF THE NERVOUS SYSTEM,1,Minor,Moderate,Medical,Medicare,Medicare,Medicaid,,,true,49034.72,9284.88
Long Island,Suffolk,5123000,000885,Long Island Community Hospital,70 or Older,117,F,Other Race,Not Span/Hispanic,2,Emergency,Home or Self Care,2019,SYM010,NERVOUS SYSTEM SIGNS AND SYMPTOMS,,,058,OTHER DISORDERS OF NERVOUS SYSTEM,01,DISEASES AND DISORDERS OF THE NERVOUS SYSTEM,2,Moderate,Moderate,Medical,Medicare,Medicare,Medicaid,,,true,39655.62,3609.53
Long Island,Suffolk,5123000,000885,Long Island Community Hospital,50 to 69,117,M,White,Not Span/Hispanic,5,Emergency,Home w/ Home Health Services,2019,SYM016,OTHER GENERAL SIGNS AND SYMPTOMS,ADM013,PERITONEAL DIALYSIS,058,OTHER DISORDERS OF NERVOUS SYSTEM,01,DISEASES AND DISORDERS OF THE NERVOUS SYSTEM,3,Major,Moderate,Medical,Medicare,Medicaid,,,,true,56946.99,7280.14
Long Island,Suffolk,5123000,000885,Long Island Community Hospital,50 to 69,119,F,White,Not Span/Hispanic,7,Emergency,Home w/ Home Health Services,2019,SYM010,NERVOUS SYSTEM SIGNS AND SYMPTOMS,CNS002,LUMBAR PUNCTURE,058,OTHER DISORDERS OF NERVOUS SYSTEM,01,DISEASES AND DISORDERS OF THE NERVOUS SYSTEM,1,Minor,Minor,Medical,Blue Cross/Blue Shield,,,,,true,194071.5,31391.85
Long Island,Suffolk,5123000,000885,Long Island Community Hospital,70 or Older,119,F,White,Not Span/Hispanic,3,Emergency,Skilled Nursing Home,2019,SYM010,NERVOUS SYSTEM SIGNS AND SYMPTOMS,,,058,OTHER DISORDERS OF NERVOUS SYSTEM,01,DISEASES AND DISORDERS OF THE NERVOUS SYSTEM,1,Minor,Minor,Medical,Medicare,,,,,true,24677.68,4647.86
Long Island,Suffolk,5123000,000885,Long Island Community Hospital,50 to 69,117,M,White,Not Span/Hispanic,2,Emergency,Home or Self Care,2019,CIR025,SEQUELA OF CEREBRAL INFARCTION AND OTHER CEREBROVASCULAR DISEASE,IMG008,ULTRASONOGRAPHY,058,OTHER DISORDERS OF NERVOUS SYSTEM,01,DISEASES AND DISORDERS OF THE NERVOUS SYSTEM,1,Minor,Minor,Medical,Medicare,Medicare,,,,true,43455.86,5236.42
Long Island,Suffolk,5123000,000885,Long Island Community Hospital,70 or Older,117,F,White,Not Span/Hispanic,6,Emergency,Skilled Nursing Home,2019,SYM010,NERVOUS SYSTEM SIGNS AND SYMPTOMS,ESA004,NON-INVASIVE VENTILATION,058,OTHER DISORDERS OF NERVOUS SYSTEM,01,DISEASES AND DISORDERS OF THE NERVOUS SYSTEM,2,Moderate,Major,Medical,Medicare,Medicare,Private Health Insurance,,,true,92399.48,11460.7
Long Island,Suffolk,5123000,000885,Long Island Community Hospital,70 or Older,119,M,White,Not Span/Hispanic,7,Emergency,Skilled Nursing Home,2019,SYM016,OTHER GENERAL SIGNS AND SYMPTOMS,MAM006,PACEMAKER AND DEFIBRILLATOR INTERROGATION,058,OTHER DISORDERS OF NERVOUS SYSTEM,01,DISEASES AND DISORDERS OF THE NERVOUS SYSTEM,2,Moderate,Major,Medical,Medicare,,,,,true,47148.11,9325.86
Long Island,Suffolk,5123000,000885,Long Island Community Hospital,70 or Older,117,F,White,Not Span/Hispanic,10,Emergency,Skilled Nursing Home,2019,SYM010,NERVOUS SYSTEM SIGNS AND SYMPTOMS,ADM001,TRANSFUSION OF BLOOD AND BLOOD PRODUCTS,058,OTHER DISORDERS OF NERVOUS SYSTEM,01,DISEASES AND DISORDERS OF THE NERVOUS SYSTEM,3,Major,Major,Medical,Medicare,Medicare,Private Health Insurance,,,true,119024.82,17403.21
Long Island,Suffolk,5123000,000885,Long Island Community Hospital,70 or Older,119,M,White,Not Span/Hispanic,3,Emergency,Skilled Nursing Home,2019,SYM016,OTHER GENERAL SIGNS AND SYMPTOMS,ESA001,HEMODIALYSIS,058,OTHER DISORDERS OF NERVOUS SYSTEM,01,DISEASES AND DISORDERS OF THE NERVOUS SYSTEM,1,Minor,Moderate,Medical,Medicare,Medicare,Private Health Insurance,,,true,61033.59,5948.14
Long Island,Suffolk,5123000,000885,Long Island Community Hospital,70 or Older,117,M,White,Not Span/Hispanic,3,Emergency,Skilled Nursing Home,2019,SYM010,NERVOUS SYSTEM SIGNS AND SYMPTOMS,,,058,OTHER DISORDERS OF NERVOUS SYSTEM,01,DISEASES AND DISORDERS OF THE NERVOUS SYSTEM,1,Minor,Minor,Medical,Medicare,Medicare,Private Health Insurance,,,true,17695.57,4070.8
Long Island,Suffolk,5123000,000885,Long Island Community Hospital,70 or Older,117,F,White,Not Span/Hispanic,5,Emergency,Skilled Nursing Home,2019,SYM016,OTHER GENERAL SIGNS AND SYMPTOMS,MAM011,ELECTROENCEPHALOGRAM (EEG),058,OTHER DISORDERS OF NERVOUS SYSTEM,01,DISEASES AND DISORDERS OF THE NERVOUS SYSTEM,2,Moderate,Major,Medical,Medicare,Medicare,,,,true,43311.75,7492.83
Long Island,Suffolk,5123000,000885,Long Island Community Hospital,70 or Older,117,F,White,Not Span/Hispanic,5,Emergency,Skilled Nursing Home,2019,SYM016,OTHER GENERAL SIGNS AND SYMPTOMS,,,058,OTHER DISORDERS OF NERVOUS SYSTEM,01,DISEASES AND DISORDERS OF THE NERVOUS SYSTEM,1,Minor,Moderate,Medical,Medicare,Medicare,Private Health Insurance,,,true,73787.28,9569.8
Long Island,Suffolk,5123000,000885,Long Island Community Hospital,30 to 49,117,F,Black/African American,Not Span/Hispanic,1,Emergency,Home or Self Care,2019,NEO073,BENIGN NEOPLASMS,,,058,OTHER DISORDERS OF NERVOUS SYSTEM,01,DISEASES AND DISORDERS OF THE NERVOUS SYSTEM,2,Moderate,Minor,Medical,Blue Cross/Blue Shield,,,,,true,55497.78,4381.22
Long Island,Suffolk,5123000,000885,Long Island Community Hospital,50 to 69,117,F,White,Not Span/Hispanic,15,Emergency,Skilled Nursing Home,2019,SYM010,NERVOUS SYSTEM SIGNS AND SYMPTOMS,,,058,OTHER DISORDERS OF NERVOUS SYSTEM,01,DISEASES AND DISORDERS OF THE NERVOUS SYSTEM,1,Minor,Minor,Medical,Medicare,Medicare,Medicaid,,,true,78458.1,18404.48
Long Island,Suffolk,5123000,000885,Long Island Community Hospital,30 to 49,117,M,White,Not Span/Hispanic,7,Emergency,Home or Self Care,2019,SYM010,NERVOUS SYSTEM SIGNS AND SYMPTOMS,,,058,OTHER DISORDERS OF NERVOUS SYSTEM,01,DISEASES AND DISORDERS OF THE NERVOUS SYSTEM,2,Moderate,Minor,Medical,Private Health Insurance,Medicaid,,,,true,62211,10544.54
Long Island,Suffolk,5123000,000885,Long Island Community Hospital,70 or Older,117,F,Other Race,Not Span/Hispanic,5,Emergency,Skilled Nursing Home,2019,SYM010,NERVOUS SYSTEM SIGNS AND SYMPTOMS,,,058,OTHER DISORDERS OF NERVOUS SYSTEM,01,DISEASES AND DISORDERS OF THE NERVOUS SYSTEM,3,Major,Moderate,Medical,Medicare,Medicare,Private Health Insurance,,,true,59666.08,7995.7
Long Island,Suffolk,5123000,000885,Long Island Community Hospital,50 to 69,117,F,White,Not Span/Hispanic,4,Emergency,Psychiatric Hospital or Unit of Hosp,2019,SYM010,NERVOUS SYSTEM SIGNS AND SYMPTOMS,,,058,OTHER DISORDERS OF NERVOUS SYSTEM,01,DISEASES AND DISORDERS OF THE NERVOUS SYSTEM,2,Moderate,Moderate,Medical,Medicare,Medicare,Medicaid,,,true,25063.2,5608.86
Long Island,Suffolk,5123000,000885,Long Island Community Hospital,50 to 69,117,F,White,Not Span/Hispanic,1,Emergency,Left Against Medical Advice,2019,SYM010,NERVOUS SYSTEM SIGNS AND SYMPTOMS,,,058,OTHER DISORDERS OF NERVOUS SYSTEM,01,DISEASES AND DISORDERS OF THE NERVOUS SYSTEM,1,Minor,Minor,Medical,Medicare,Medicare,Medicaid,,,true,14256.42,1941.53