Hospital Service Area,Hospital County,Operating Certificate Number,Permanent Facility Id,Facility Name,Age Group,Zip Code - 3 digits,Gender,Race,Ethnicity,Length of Stay,Type of Admission,Patient Disposition,Discharge Year,CCS Diagnosis Code,CCS Diagnosis Description,CCS Procedure Code,CCS Procedure Description,APR DRG Code,APR DRG Description,APR MDC Code,APR MDC Description,APR Severity of Illness Code,APR Severity of Illness Description,APR Risk of Mortality,APR Medical Surgical Description,Payment Typology 1,Payment Typology 2,Payment Typology 3,Birth Weight,Abortion Edit Indicator,Emergency Department Indicator,Total Charges,Total Costs
New York City,Manhattan,7002053,001463,NYU Langone Hospitals,50 to 69,100,M,White,Not Span/Hispanic,3,Elective,Home or Self Care,2020,NVS020,OTHER SPECIFIED NERVOUS SYSTEM DISORDERS,CNS002,LUMBAR PUNCTURE,058,OTHER DISORDERS OF NERVOUS SYSTEM,01,DISEASES AND DISORDERS OF THE NERVOUS SYSTEM,1,Minor,Minor,Medical,Medicare,Medicare,,,,N,24507.56,10135.08
New York City,Manhattan,7002053,001463,NYU Langone Hospitals,30 to 49,112,F,White,Not Span/Hispanic,2,Emergency,Home or Self Care,2020,NVS016,SLEEP WAKE DISORDERS,MAM011,ELECTROENCEPHALOGRAM (EEG),058,OTHER DISORDERS OF NERVOUS SYSTEM,01,DISEASES AND DISORDERS OF THE NERVOUS SYSTEM,1,Minor,Minor,Medical,Private Health Insurance,,,,,Y,64220.86,11359.5
New York City,Manhattan,7002053,001463,NYU Langone Hospitals,0 to 17,107,M,Other Race,Not Span/Hispanic,1,Elective,Skilled Nursing Home,2020,NVS007,CEREBRAL PALSY,MST028,"SUBCUTANEOUS TISSUE AND FASCIA PROCEDURES, NEC",058,OTHER DISORDERS OF NERVOUS SYSTEM,01,DISEASES AND DISORDERS OF THE NERVOUS SYSTEM,2,Moderate,Minor,Medical,Medicaid,,,,,N,177843.89,27019.9
New York City,Manhattan,7002053,001463,NYU Langone Hospitals,50 to 69,OOS,M,White,Not Span/Hispanic,3,Emergency,Home or Self Care,2020,FAC009,"IMPLANT, DEVICE OR GRAFT RELATED ENCOUNTER",GIS017,GASTROSTOMY,058,OTHER DISORDERS OF NERVOUS SYSTEM,01,DISEASES AND DISORDERS OF THE NERVOUS SYSTEM,2,Moderate,Major,Medical,Medicare,Private Health Insurance,,,,Y,47350.51,14027.54
New York City,Manhattan,7002053,001463,NYU Langone Hospitals,30 to 49,112,M,White,Not Span/Hispanic,3,Emergency,Home or Self Care,2020,NVS020,OTHER SPECIFIED NERVOUS SYSTEM DISORDERS,CNS002,LUMBAR PUNCTURE,058,OTHER DISORDERS OF NERVOUS SYSTEM,01,DISEASES AND DISORDERS OF THE NERVOUS SYSTEM,2,Moderate,Minor,Medical,Private Health Insurance,,,,,Y,111555.79,17918.75
New York City,Manhattan,7002053,001463,NYU Langone Hospitals,18 to 29,112,F,Multi-racial,Not Span/Hispanic,1,Elective,Home or Self Care,2020,FAC009,"IMPLANT, DEVICE OR GRAFT RELATED ENCOUNTER",MST028,"SUBCUTANEOUS TISSUE AND FASCIA PROCEDURES, NEC",058,OTHER DISORDERS OF NERVOUS SYSTEM,01,DISEASES AND DISORDERS OF THE NERVOUS SYSTEM,2,Moderate,Minor,Medical,Medicaid,,,,,N,165225.21,23669.73
New York City,Manhattan,7002053,001463,NYU Langone Hospitals,70 or Older,OOS,M,White,Not Span/Hispanic,1,Elective,Home or Self Care,2020,INJ037,"COMPLICATION OF OTHER SURGICAL OR MEDICAL CARE, INJURY, INITIAL ENCOUNTER",MST028,"SUBCUTANEOUS TISSUE AND FASCIA PROCEDURES, NEC",058,OTHER DISORDERS OF NERVOUS SYSTEM,01,DISEASES AND DISORDERS OF THE NERVOUS SYSTEM,2,Moderate,Moderate,Medical,Medicare,Private Health Insurance,,,,N,80285.95,13228.83
New York City,Manhattan,7002053,001463,NYU Langone Hospitals,70 or Older,103,F,White,Not Span/Hispanic,3,Elective,Home or Self Care,2020,NVS020,OTHER SPECIFIED NERVOUS SYSTEM DISORDERS,CNS002,LUMBAR PUNCTURE,058,OTHER DISORDERS OF NERVOUS SYSTEM,01,DISEASES AND DISORDERS OF THE NERVOUS SYSTEM,1,Minor,Minor,Medical,Medicare,Private Health Insurance,,,,N,29352.72,10702.25
New York City,Manhattan,7002053,001463,NYU Langone Hospitals,70 or Older,103,F,White,Not Span/Hispanic,1,Emergency,Home or Self Care,2020,SYM010,NERVOUS SYSTEM SIGNS AND SYMPTOMS,,,058,OTHER DISORDERS OF NERVOUS SYSTEM,01,DISEASES AND DISORDERS OF THE NERVOUS SYSTEM,1,Minor,Moderate,Medical,Medicare,Blue Cross/Blue Shield,,,,Y,21392.76,5070.32
New York City,Manhattan,7002053,001463,NYU Langone Hospitals,70 or Older,100,F,White,Not Span/Hispanic,4,Emergency,Skilled Nursing Home,2020,CIR025,SEQUELA OF CEREBRAL INFARCTION AND OTHER CEREBROVASCULAR DISEASE,GIS017,GASTROSTOMY,058,OTHER DISORDERS OF NERVOUS SYSTEM,01,DISEASES AND DISORDERS OF THE NERVOUS SYSTEM,3,Major,Major,Medical,Medicare,Medicare,,,,Y,88122.7,19670.68
New York City,Manhattan,7002053,001463,NYU Langone Hospitals,70 or Older,100,F,White,Not Span/Hispanic,1,Emergency,Skilled Nursing Home,2020,NVS020,OTHER SPECIFIED NERVOUS SYSTEM DISORDERS,,,058,OTHER DISORDERS OF NERVOUS SYSTEM,01,DISEASES AND DISORDERS OF THE NERVOUS SYSTEM,2,Moderate,Moderate,Medical,Private Health Insurance,Medicaid,,,,Y,46177.51,13359.55
New York City,Manhattan,7002053,001463,NYU Langone Hospitals,18 to 29,112,F,Multi-racial,Not Span/Hispanic,1,Emergency,Home or Self Care,2020,NVS016,SLEEP WAKE DISORDERS,MHT005,"MENTAL HEALTH PROCEDURES, NEC",058,OTHER DISORDERS OF NERVOUS SYSTEM,01,DISEASES AND DISORDERS OF THE NERVOUS SYSTEM,3,Major,Moderate,Medical,Private Health Insurance,Private Health Insurance,,,,Y,55920.33,16570.71
New York City,Manhattan,7002053,001463,NYU Langone Hospitals,50 to 69,112,F,White,Not Span/Hispanic,3,Emergency,Home or Self Care,2020,INJ037,"COMPLICATION OF OTHER SURGICAL OR MEDICAL CARE, INJURY, INITIAL ENCOUNTER",CNS014,"CNS PROCEDURES, NEC",058,OTHER DISORDERS OF NERVOUS SYSTEM,01,DISEASES AND DISORDERS OF THE NERVOUS SYSTEM,2,Moderate,Major,Medical,Private Health Insurance,,,,,Y,57961.43,21076.06
New York City,Manhattan,7002053,001463,NYU Langone Hospitals,30 to 49,112,M,Black/African American,Not Span/Hispanic,1,Emergency,Home or Self Care,2020,SYM010,NERVOUS SYSTEM SIGNS AND SYMPTOMS,,,058,OTHER DISORDERS OF NERVOUS SYSTEM,01,DISEASES AND DISORDERS OF THE NERVOUS SYSTEM,2,Moderate,Minor,Medical,Private Health Insurance,,,,,Y,46344.78,10268.65
New York City,Manhattan,7002053,001463,NYU Langone Hospitals,70 or Older,112,M,Other Race,Spanish/Hispanic,3,Elective,Home w/ Home Health Services,2020,NVS020,OTHER SPECIFIED NERVOUS SYSTEM DISORDERS,CNS002,LUMBAR PUNCTURE,058,OTHER DISORDERS OF NERVOUS SYSTEM,01,DISEASES AND DISORDERS OF THE NERVOUS SYSTEM,2,Moderate,Minor,Medical,Medicare,Blue Cross/Blue Shield,,,,N,27209.05,10774.48
New York City,Manhattan,7002053,001463,NYU Langone Hospitals,0 to 17,112,F,White,Not Span/Hispanic,1,Elective,Home or Self Care,2020,SYM010,NERVOUS SYSTEM SIGNS AND SYMPTOMS,MAM011,ELECTROENCEPHALOGRAM (EEG),058,OTHER DISORDERS OF NERVOUS SYSTEM,01,DISEASES AND DISORDERS OF THE NERVOUS SYSTEM,1,Minor,Minor,Medical,Medicaid,,,,,N,25201.76,2821.87
New York City,Manhattan,7002053,001463,NYU Langone Hospitals,30 to 49,100,M,Other Race,Unknown,3,Emergency,Skilled Nursing Home,2020,NVS006,OTHER SPECIFIED HEREDITARY AND DEGENERATIVE NERVOUS SYSTEM CONDITIONS,MAM012,ICP AND OTHER CNS MONITORING (EXCLUDING EEG),058,OTHER DISORDERS OF NERVOUS SYSTEM,01,DISEASES AND DISORDERS OF THE NERVOUS SYSTEM,4,Extreme,Major,Medical,Medicaid,,,,,Y,60160.45,13445.56
New York City,Manhattan,7002053,001463,NYU Langone Hospitals,50 to 69,112,M,White,Not Span/Hispanic,1,Emergency,Home or Self Care,2020,CIR024,OTHER AND ILL-DEFINED CEREBROVASCULAR DISEASE,IMG002,FLUOROSCOPIC ANGIOGRAPHY (EXCLUDING CORONARY),058,OTHER DISORDERS OF NERVOUS SYSTEM,01,DISEASES AND DISORDERS OF THE NERVOUS SYSTEM,1,Minor,Minor,Medical,Private Health Insurance,,,,,Y,42328.68,8139.7
New York City,Manhattan,7002053,001463,NYU Langone Hospitals,0 to 17,100,M,White,Not Span/Hispanic,2,Emergency,Home or Self Care,2020,SYM016,OTHER GENERAL SIGNS AND SYMPTOMS,MAM011,ELECTROENCEPHALOGRAM (EEG),058,OTHER DISORDERS OF NERVOUS SYSTEM,01,DISEASES AND DISORDERS OF THE NERVOUS SYSTEM,1,Minor,Minor,Medical,Private Health Insurance,,,,,Y,43609.55,7102.64
New York City,Manhattan,7002053,001463,NYU Langone Hospitals,50 to 69,100,F,Other Race,Spanish/Hispanic,4,Emergency,Skilled Nursing Home,2020,SYM010,NERVOUS SYSTEM SIGNS AND SYMPTOMS,ENT013,ENT REPAIR,058,OTHER DISORDERS OF NERVOUS SYSTEM,01,DISEASES AND DISORDERS OF THE NERVOUS SYSTEM,1,Minor,Minor,Medical,Medicare,,,,,Y,86657.64,18552.21
New York City,Manhattan,7002053,001463,NYU Langone Hospitals,30 to 49,OOS,M,White,Not Span/Hispanic,1,Emergency,Home or Self Care,2020,MAL010,OTHER SPECIFIED AND UNSPECIFIED CONGENITAL ANOMALIES,,,058,OTHER DISORDERS OF NERVOUS SYSTEM,01,DISEASES AND DISORDERS OF THE NERVOUS SYSTEM,2,Moderate,Moderate,Medical,Medicare,,,,,Y,24169.38,5302.54
New York City,Manhattan,7002053,001463,NYU Langone Hospitals,0 to 17,,M,White,Not Span/Hispanic,13,Emergency,Home or Self Care,2020,NVS020,OTHER SPECIFIED NERVOUS SYSTEM DISORDERS,ADM021,"ADMINISTRATION OF THERAPEUTIC SUBSTANCES, NEC",058,OTHER DISORDERS OF NERVOUS SYSTEM,01,DISEASES AND DISORDERS OF THE NERVOUS SYSTEM,2,Moderate,Minor,Medical,Private Health Insurance,,,,,Y,214659.93,51060.29
New York City,Manhattan,7002053,001463,NYU Langone Hospitals,30 to 49,112,M,White,Not Span/Hispanic,1,Emergency,Home or Self Care,2020,SYM014,SKIN/SUBCUTANEOUS SIGNS AND SYMPTOMS,MAM011,ELECTROENCEPHALOGRAM (EEG),058,OTHER DISORDERS OF NERVOUS SYSTEM,01,DISEASES AND DISORDERS OF THE NERVOUS SYSTEM,1,Minor,Minor,Medical,Private Health Insurance,,,,,Y,60361.9,9766.98
New York City,Manhattan,7002053,001463,NYU Langone Hospitals,50 to 69,105,M,White,Not Span/Hispanic,4,Elective,Skilled Nursing Home,2020,NVS007,CEREBRAL PALSY,CNS013,SPINAL EPIDURAL CATHETER PLACEMENT,058,OTHER DISORDERS OF NERVOUS SYSTEM,01,DISEASES AND DISORDERS OF THE NERVOUS SYSTEM,2,Moderate,Minor,Medical,Medicare,Medicare,,,,N,82489.61,24307.23
New York City,Manhattan,7002053,001463,NYU Langone Hospitals,0 to 17,104,M,Other Race,Not Span/Hispanic,1,Elective,Home or Self Care,2020,CIR024,OTHER AND ILL-DEFINED CEREBROVASCULAR DISEASE,,,058,OTHER DISORDERS OF NERVOUS SYSTEM,01,DISEASES AND DISORDERS OF THE NERVOUS SYSTEM,1,Minor,Minor,Medical,Medicaid,,,,,N,28471.94,4026.3
New York City,Manhattan,7002053,001463,NYU Langone Hospitals,70 or Older,108,M,White,Not Span/Hispanic,3,Elective,Home or Self Care,2020,NVS020,OTHER SPECIFIED NERVOUS SYSTEM DISORDERS,CNS002,LUMBAR PUNCTURE,058,OTHER DISORDERS OF NERVOUS SYSTEM,01,DISEASES AND DISORDERS OF THE NERVOUS SYSTEM,1,Minor,Minor,Medical,Medicaid,,,,,N,23344.15,10017.66
New York City,Manhattan,7002053,001463,NYU Langone Hospitals,70 or Older,113,F,White,Not Span/Hispanic,4,Elective,Home or Self Care,2020,NVS020,OTHER SPECIFIED NERVOUS SYSTEM DISORDERS,CNS002,LUMBAR PUNCTURE,058,OTHER DISORDERS OF NERVOUS SYSTEM,01,DISEASES AND DISORDERS OF THE NERVOUS SYSTEM,1,Minor,Minor,Medical,Medicare,Blue Cross/Blue Shield,,,,N,61612.47,17147.71
New York City,Manhattan,7002053,001463,NYU Langone Hospitals,70 or Older,100,M,White,Not Span/Hispanic,14,Emergency,Psychiatric Hospital or Unit of Hosp,2020,NEO072,NEOPLASMS OF UNSPECIFIED NATURE OR UNCERTAIN BEHAVIOR,CNS002,LUMBAR PUNCTURE,058,OTHER DISORDERS OF NERVOUS SYSTEM,01,DISEASES AND DISORDERS OF THE NERVOUS SYSTEM,4,Extreme,Major,Medical,Medicare,,,,,Y,220123.91,56144.09
New York City,Manhattan,7002053,001463,NYU Langone Hospitals,30 to 49,104,F,Other Race,Spanish/Hispanic,1,Emergency,Home or Self Care,2020,NVS008,PARALYSIS (OTHER THAN CEREBRAL PALSY),ADM010,VACCINATIONS,058,OTHER DISORDERS OF NERVOUS SYSTEM,01,DISEASES AND DISORDERS OF THE NERVOUS SYSTEM,2,Moderate,Minor,Medical,Private Health Insurance,,,,,Y,29148.27,7154.66
New York City,Manhattan,7002053,001463,NYU Langone Hospitals,70 or Older,100,M,White,Not Span/Hispanic,3,Emergency,Skilled Nursing Home,2020,SYM010,NERVOUS SYSTEM SIGNS AND SYMPTOMS,MAM006,PACEMAKER AND DEFIBRILLATOR INTERROGATION,058,OTHER DISORDERS OF NERVOUS SYSTEM,01,DISEASES AND DISORDERS OF THE NERVOUS SYSTEM,1,Minor,Moderate,Medical,Medicare,Medicare,,,,Y,66108.04,16533.07
New York City,Manhattan,7002053,001463,NYU Langone Hospitals,0 to 17,115,M,White,Not Span/Hispanic,5,Elective,Inpatient Rehabilitation Facility,2020,NVS007,CEREBRAL PALSY,CNS013,SPINAL EPIDURAL CATHETER PLACEMENT,058,OTHER DISORDERS OF NERVOUS SYSTEM,01,DISEASES AND DISORDERS OF THE NERVOUS SYSTEM,2,Moderate,Moderate,Medical,Private Health Insurance,Medicaid,,,,N,209192.62,39387.34
New York City,Manhattan,7002053,001463,NYU Langone Hospitals,30 to 49,OOS,F,Other Race,Not Span/Hispanic,3,Emergency,Home or Self Care,2020,SYM010,NERVOUS SYSTEM SIGNS AND SYMPTOMS,,,058,OTHER DISORDERS OF NERVOUS SYSTEM,01,DISEASES AND DISORDERS OF THE NERVOUS SYSTEM,1,Minor,Minor,Medical,Private Health Insurance,,,,,Y,56149.65,12331.76
New York City,Manhattan,7002053,001463,NYU Langone Hospitals,0 to 17,112,M,Other Race,Unknown,4,Emergency,Home or Self Care,2020,SYM014,SKIN/SUBCUTANEOUS SIGNS AND SYMPTOMS,MAM011,ELECTROENCEPHALOGRAM (EEG),058,OTHER DISORDERS OF NERVOUS SYSTEM,01,DISEASES AND DISORDERS OF THE NERVOUS SYSTEM,3,Major,Moderate,Medical,Blue Cross/Blue Shield,Medicaid,,,,Y,81866.43,11998.59
New York City,Manhattan,7002053,001463,NYU Langone Hospitals,0 to 17,112,M,Other Race,Not Span/Hispanic,1,Elective,Home or Self Care,2020,NEO072,NEOPLASMS OF UNSPECIFIED NATURE OR UNCERTAIN BEHAVIOR,CNS001,MINIMALLY INVASIVE CNS BIOPSY,058,OTHER DISORDERS OF NERVOUS SYSTEM,01,DISEASES AND DISORDERS OF THE NERVOUS SYSTEM,3,Major,Minor,Medical,Medicaid,,,,,N,87176.07,14271.82
New York City,Manhattan,7002053,001463,NYU Langone Hospitals,50 to 69,OOS,F,White,Not Span/Hispanic,1,Emergency,Home or Self Care,2020,FAC009,"IMPLANT, DEVICE OR GRAFT RELATED ENCOUNTER",MST028,"SUBCUTANEOUS TISSUE AND FASCIA PROCEDURES, NEC",058,OTHER DISORDERS OF NERVOUS SYSTEM,01,DISEASES AND DISORDERS OF THE NERVOUS SYSTEM,3,Major,Moderate,Medical,Medicare,Private Health Insurance,,,,Y,170309.67,25445.71
New York City,Manhattan,7002053,001463,NYU Langone Hospitals,70 or Older,112,F,Other Race,Not Span/Hispanic,1,Emergency,Home or Self Care,2020,CIR025,SEQUELA OF CEREBRAL INFARCTION AND OTHER CEREBROVASCULAR DISEASE,MAM011,ELECTROENCEPHALOGRAM (EEG),058,OTHER DISORDERS OF NERVOUS SYSTEM,01,DISEASES AND DISORDERS OF THE NERVOUS SYSTEM,3,Major,Moderate,Medical,Medicare,Medicaid,,,,Y,74166.16,7673.66
New York City,Manhattan,7002053,001463,NYU Langone Hospitals,0 to 17,112,F,Other Race,Not Span/Hispanic,1,Urgent,Home or Self Care,2020,MAL001,CARDIAC AND CIRCULATORY CONGENITAL ANOMALIES,IMG002,FLUOROSCOPIC ANGIOGRAPHY (EXCLUDING CORONARY),058,OTHER DISORDERS OF NERVOUS SYSTEM,01,DISEASES AND DISORDERS OF THE NERVOUS SYSTEM,2,Moderate,Minor,Medical,Blue Cross/Blue Shield,,,,,N,33657.68,6927.19
New York City,Manhattan,7002053,001463,NYU Langone Hospitals,0 to 17,105,F,White,Not Span/Hispanic,2,Elective,Home or Self Care,2020,SYM010,NERVOUS SYSTEM SIGNS AND SYMPTOMS,MAM011,ELECTROENCEPHALOGRAM (EEG),058,OTHER DISORDERS OF NERVOUS SYSTEM,01,DISEASES AND DISORDERS OF THE NERVOUS SYSTEM,1,Minor,Minor,Medical,Private Health Insurance,,,,,N,52861.09,5508.35
New York City,Manhattan,7002053,001463,NYU Langone Hospitals,70 or Older,112,F,Black/African American,Not Span/Hispanic,5,Emergency,Home w/ Home Health Services,2020,NVS021,POSTPROCEDURAL OR POSTOPERATIVE NERVOUS SYSTEM COMPLICATION,CNS002,LUMBAR PUNCTURE,058,OTHER DISORDERS OF NERVOUS SYSTEM,01,DISEASES AND DISORDERS OF THE NERVOUS SYSTEM,3,Major,Moderate,Medical,Medicare,,,,,Y,65418.49,19309.04
New York City,Manhattan,7002053,001463,NYU Langone Hospitals,50 to 69,100,F,White,Not Span/Hispanic,5,Emergency,Inpatient Rehabilitation Facility,2020,INJ030,DRUG INDUCED OR TOXIC RELATED CONDITION,MAM011,ELECTROENCEPHALOGRAM (EEG),058,OTHER DISORDERS OF NERVOUS SYSTEM,01,DISEASES AND DISORDERS OF THE NERVOUS SYSTEM,2,Moderate,Major,Medical,Medicare,Private Health Insurance,,,,Y,143739.6,31329.82
New York City,Manhattan,7002053,001463,NYU Langone Hospitals,50 to 69,104,M,Other Race,Not Span/Hispanic,1,Emergency,Inpatient Rehabilitation Facility,2020,INJ037,"COMPLICATION OF OTHER SURGICAL OR MEDICAL CARE, INJURY, INITIAL ENCOUNTER",MST028,"SUBCUTANEOUS TISSUE AND FASCIA PROCEDURES, NEC",058,OTHER DISORDERS OF NERVOUS SYSTEM,01,DISEASES AND DISORDERS OF THE NERVOUS SYSTEM,3,Major,Major,Medical,Medicare,Private Health Insurance,,,,N,66473.16,11328.25
New York City,Manhattan,7002053,001463,NYU Langone Hospitals,50 to 69,OOS,F,White,Not Span/Hispanic,15,Emergency,Inpatient Rehabilitation Facility,2020,INJ073,"INJURY, SEQUELA",MAM011,ELECTROENCEPHALOGRAM (EEG),058,OTHER DISORDERS OF NERVOUS SYSTEM,01,DISEASES AND DISORDERS OF THE NERVOUS SYSTEM,3,Major,Major,Medical,Medicare,Private Health Insurance,,,,Y,198912.48,51830.43
New York City,Manhattan,7002053,001463,NYU Langone Hospitals,70 or Older,112,M,White,Not Span/Hispanic,3,Elective,Home or Self Care,2020,NVS020,OTHER SPECIFIED NERVOUS SYSTEM DISORDERS,CNS002,LUMBAR PUNCTURE,058,OTHER DISORDERS OF NERVOUS SYSTEM,01,DISEASES AND DISORDERS OF THE NERVOUS SYSTEM,2,Moderate,Minor,Medical,Medicare,Medicare,,,,N,34898,11137.22
New York City,Manhattan,7002053,001463,NYU Langone Hospitals,70 or Older,100,M,White,Not Span/Hispanic,4,Emergency,Skilled Nursing Home,2020,SYM010,NERVOUS SYSTEM SIGNS AND SYMPTOMS,,,058,OTHER DISORDERS OF NERVOUS SYSTEM,01,DISEASES AND DISORDERS OF THE NERVOUS SYSTEM,1,Minor,Minor,Medical,Medicare,Blue Cross/Blue Shield,,,,Y,62687.65,22566.69
New York City,Manhattan,7002053,001463,NYU Langone Hospitals,18 to 29,112,M,White,Not Span/Hispanic,4,Emergency,Home or Self Care,2020,NVS006,OTHER SPECIFIED HEREDITARY AND DEGENERATIVE NERVOUS SYSTEM CONDITIONS,OTR004,ISOLATION PROCEDURES,058,OTHER DISORDERS OF NERVOUS SYSTEM,01,DISEASES AND DISORDERS OF THE NERVOUS SYSTEM,3,Major,Major,Medical,Medicare,Medicaid,,,,Y,67326.32,23344.75
New York City,Manhattan,7002053,001463,NYU Langone Hospitals,30 to 49,113,M,White,Unknown,1,Emergency,Home w/ Home Health Services,2020,NVS021,POSTPROCEDURAL OR POSTOPERATIVE NERVOUS SYSTEM COMPLICATION,CNS002,LUMBAR PUNCTURE,058,OTHER DISORDERS OF NERVOUS SYSTEM,01,DISEASES AND DISORDERS OF THE NERVOUS SYSTEM,3,Major,Moderate,Medical,Medicaid,,,,,Y,81067.86,19862.61
New York City,Manhattan,7002053,001463,NYU Langone Hospitals,50 to 69,112,M,White,Not Span/Hispanic,9,Emergency,Home or Self Care,2020,NVS021,POSTPROCEDURAL OR POSTOPERATIVE NERVOUS SYSTEM COMPLICATION,,,058,OTHER DISORDERS OF NERVOUS SYSTEM,01,DISEASES AND DISORDERS OF THE NERVOUS SYSTEM,2,Moderate,Moderate,Medical,Medicare,,,,,Y,131378.21,39625.77
New York City,Manhattan,7002053,001463,NYU Langone Hospitals,50 to 69,OOS,M,White,Not Span/Hispanic,2,Elective,Home or Self Care,2020,NVS021,POSTPROCEDURAL OR POSTOPERATIVE NERVOUS SYSTEM COMPLICATION,MAM009,ELECTROPHYSIOLOGIC STUDIES,058,OTHER DISORDERS OF NERVOUS SYSTEM,01,DISEASES AND DISORDERS OF THE NERVOUS SYSTEM,2,Moderate,Moderate,Medical,Medicare,,,,,N,121906,19883.84
New York City,Manhattan,7002053,001463,NYU Langone Hospitals,50 to 69,104,M,Other Race,Unknown,1,Emergency,Home or Self Care,2020,NVS020,OTHER SPECIFIED NERVOUS SYSTEM DISORDERS,,,058,OTHER DISORDERS OF NERVOUS SYSTEM,01,DISEASES AND DISORDERS OF THE NERVOUS SYSTEM,3,Major,Extreme,Medical,Private Health Insurance,,,,,Y,37746.14,6471.71
New York City,Manhattan,7002053,001463,NYU Langone Hospitals,18 to 29,112,M,White,Unknown,1,Elective,Home or Self Care,2020,FAC009,"IMPLANT, DEVICE OR GRAFT RELATED ENCOUNTER",MST028,"SUBCUTANEOUS TISSUE AND FASCIA PROCEDURES, NEC",058,OTHER DISORDERS OF NERVOUS SYSTEM,01,DISEASES AND DISORDERS OF THE NERVOUS SYSTEM,3,Major,Moderate,Medical,Medicaid,,,,,N,163119.32,23849.78
New York City,Manhattan,7002053,001463,NYU Langone Hospitals,70 or Older,125,M,White,Not Span/Hispanic,3,Elective,Home or Self Care,2020,NVS020,OTHER SPECIFIED NERVOUS SYSTEM DISORDERS,CNS002,LUMBAR PUNCTURE,058,OTHER DISORDERS OF NERVOUS SYSTEM,01,DISEASES AND DISORDERS OF THE NERVOUS SYSTEM,1,Minor,Minor,Medical,Medicare,,,,,N,23102.8,10232.27
New York City,Manhattan,7002053,001463,NYU Langone Hospitals,0 to 17,112,M,White,Unknown,2,Emergency,Home or Self Care,2020,INJ037,"COMPLICATION OF OTHER SURGICAL OR MEDICAL CARE, INJURY, INITIAL ENCOUNTER",ENT017,"ENT PROCEDURES, NEC",058,OTHER DISORDERS OF NERVOUS SYSTEM,01,DISEASES AND DISORDERS OF THE NERVOUS SYSTEM,2,Moderate,Minor,Medical,Medicaid,,,,,Y,61663.88,11966.35
New York City,Manhattan,7002053,001463,NYU Langone Hospitals,50 to 69,100,F,White,Not Span/Hispanic,6,Emergency,Home or Self Care,2020,CIR022,SEQUELA OF HEMORRHAGIC CEREBROVASCULAR DISEASE,RES007,AIRWAY INTUBATION,058,OTHER DISORDERS OF NERVOUS SYSTEM,01,DISEASES AND DISORDERS OF THE NERVOUS SYSTEM,4,Extreme,Extreme,Medical,Blue Cross/Blue Shield,,,,,Y,218316.62,37913.18
New York City,Manhattan,7002053,001463,NYU Langone Hospitals,30 to 49,OOS,M,White,Not Span/Hispanic,24,Emergency,Home or Self Care,2020,NVS006,OTHER SPECIFIED HEREDITARY AND DEGENERATIVE NERVOUS SYSTEM CONDITIONS,,,058,OTHER DISORDERS OF NERVOUS SYSTEM,01,DISEASES AND DISORDERS OF THE NERVOUS SYSTEM,3,Major,Moderate,Medical,Medicare,Medicaid,,,,Y,196859.74,80783.54
New York City,Manhattan,7002053,001463,NYU Langone Hospitals,70 or Older,114,F,Black/African American,Not Span/Hispanic,3,Emergency,Skilled Nursing Home,2020,SYM010,NERVOUS SYSTEM SIGNS AND SYMPTOMS,,,058,OTHER DISORDERS OF NERVOUS SYSTEM,01,DISEASES AND DISORDERS OF THE NERVOUS SYSTEM,1,Minor,Moderate,Medical,Medicare,,,,,Y,70000.61,18715.73
New York City,Manhattan,7002053,001463,NYU Langone Hospitals,18 to 29,105,F,White,Not Span/Hispanic,1,Elective,Home or Self Care,2020,NVS007,CEREBRAL PALSY,MST028,"SUBCUTANEOUS TISSUE AND FASCIA PROCEDURES, NEC",058,OTHER DISORDERS OF NERVOUS SYSTEM,01,DISEASES AND DISORDERS OF THE NERVOUS SYSTEM,2,Moderate,Minor,Medical,Medicare,Medicaid,,,,N,191637.57,28450.27
New York City,Manhattan,7002053,001463,NYU Langone Hospitals,50 to 69,OOS,F,White,Not Span/Hispanic,1,Emergency,Skilled Nursing Home,2020,SYM014,SKIN/SUBCUTANEOUS SIGNS AND SYMPTOMS,,,058,OTHER DISORDERS OF NERVOUS SYSTEM,01,DISEASES AND DISORDERS OF THE NERVOUS SYSTEM,1,Minor,Moderate,Medical,Medicare,Medicare,,,,Y,51445.58,8407.29
New York City,Manhattan,7002053,001463,NYU Langone Hospitals,0 to 17,104,M,Black/African American,Not Span/Hispanic,3,Elective,Home or Self Care,2020,NVS006,OTHER SPECIFIED HEREDITARY AND DEGENERATIVE NERVOUS SYSTEM CONDITIONS,MAM011,ELECTROENCEPHALOGRAM (EEG),058,OTHER DISORDERS OF NERVOUS SYSTEM,01,DISEASES AND DISORDERS OF THE NERVOUS SYSTEM,2,Moderate,Minor,Medical,Medicaid,,,,,N,71320.42,7925.03
New York City,Manhattan,7002053,001463,NYU Langone Hospitals,70 or Older,112,M,White,Not Span/Hispanic,3,Elective,Home or Self Care,2020,NVS020,OTHER SPECIFIED NERVOUS SYSTEM DISORDERS,CNS002,LUMBAR PUNCTURE,058,OTHER DISORDERS OF NERVOUS SYSTEM,01,DISEASES AND DISORDERS OF THE NERVOUS SYSTEM,1,Minor,Minor,Medical,Medicare,Medicare,,,,N,32274.58,10761.69
New York City,Manhattan,7002053,001463,NYU Langone Hospitals,0 to 17,100,M,Other Race,Unknown,1,Emergency,Home or Self Care,2020,SYM010,NERVOUS SYSTEM SIGNS AND SYMPTOMS,MAM011,ELECTROENCEPHALOGRAM (EEG),058,OTHER DISORDERS OF NERVOUS SYSTEM,01,DISEASES AND DISORDERS OF THE NERVOUS SYSTEM,1,Minor,Minor,Medical,Private Health Insurance,,,,,Y,46925.65,4150.41
New York City,Manhattan,7002053,001463,NYU Langone Hospitals,70 or Older,100,F,Other Race,Unknown,11,Elective,Home or Self Care,2020,CIR025,SEQUELA OF CEREBRAL INFARCTION AND OTHER CEREBROVASCULAR DISEASE,RHB002,"PHYSICAL, OCCUPATIONAL, AND RESPIRATORY THERAPY TREATMENT",058,OTHER DISORDERS OF NERVOUS SYSTEM,01,DISEASES AND DISORDERS OF THE NERVOUS SYSTEM,1,Minor,Minor,Medical,Medicare,Medicare,,,,N,104056.89,33379.17
New York City,Manhattan,7002053,001463,NYU Langone Hospitals,50 to 69,100,M,White,Not Span/Hispanic,1,Emergency,Left Against Medical Advice,2020,NEO072,NEOPLASMS OF UNSPECIFIED NATURE OR UNCERTAIN BEHAVIOR,,,058,OTHER DISORDERS OF NERVOUS SYSTEM,01,DISEASES AND DISORDERS OF THE NERVOUS SYSTEM,1,Minor,Minor,Medical,Medicaid,,,,,Y,16196.26,4453.35