Hospital Service Area,Hospital County,Operating Certificate Number,Permanent Facility Id,Facility Name,Age Group,Zip Code - 3 digits,Gender,Race,Ethnicity,Length of Stay,Type of Admission,Patient Disposition,Discharge Year,CCS Diagnosis Code,CCS Diagnosis Description,CCS Procedure Code,CCS Procedure Description,APR DRG Code,APR DRG Description,APR MDC Code,APR MDC Description,APR Severity of Illness Code,APR Severity of Illness Description,APR Risk of Mortality,APR Medical Surgical Description,Payment Typology 1,Payment Typology 2,Payment Typology 3,Birth Weight,Abortion Edit Indicator,Emergency Department Indicator,Total Charges,Total Costs
New York City,Queens,7003004,003376,Cohen Children's Medical Center,0 to 17,115,M,Other Race,Not Span/Hispanic,120 +,Newborn,Short-term Hospital,2018,PNL001,LIVEBORN,ESA002,EXTRACORPOREAL MEMBRANE OXYGENATION,583,NEONATE W ECMO,15,NEWBORNS AND OTHER NEONATES WITH CONDITIONS ORIGINATING IN THE PERINATAL PERIOD,2,Moderate,Moderate,Surgical,Medicaid,Medicaid,Self-Pay,02600,,false,3425549.84,742284.83
New York City,Manhattan,7002054,001464,New York-Presbyterian Hospital - Columbia Presbyterian Center,0 to 17,OOS,F,Other Race,Not Span/Hispanic,18,Urgent,Short-term Hospital,2018,MAL001,CARDIAC AND CIRCULATORY CONGENITAL ANOMALIES,CAR013,HEART AND GREAT VESSEL BYPASS PROCEDURES,583,NEONATE W ECMO,15,NEWBORNS AND OTHER NEONATES WITH CONDITIONS ORIGINATING IN THE PERINATAL PERIOD,4,Extreme,Extreme,Surgical,Medicaid,Self-Pay,,03900,,false,686343.64,159765.66
New York City,Queens,7003004,003376,Cohen Children's Medical Center,0 to 17,117,M,Other Race,Not Span/Hispanic,15,Newborn,Short-term Hospital,2018,PNL001,LIVEBORN,ESA002,EXTRACORPOREAL MEMBRANE OXYGENATION,583,NEONATE W ECMO,15,NEWBORNS AND OTHER NEONATES WITH CONDITIONS ORIGINATING IN THE PERINATAL PERIOD,4,Extreme,Extreme,Surgical,Federal/State/Local/VA,Self-Pay,,03800,,false,512647.1,153418.76
New York City,Queens,7003004,003376,Cohen Children's Medical Center,0 to 17,114,F,Other Race,Unknown,21,Urgent,Expired,2018,PNL013,OTHER SPECIFIED AND UNSPECIFIED PERINATAL CONDITIONS,ESA002,EXTRACORPOREAL MEMBRANE OXYGENATION,583,NEONATE W ECMO,15,NEWBORNS AND OTHER NEONATES WITH CONDITIONS ORIGINATING IN THE PERINATAL PERIOD,2,Moderate,Moderate,Surgical,Medicaid,Self-Pay,,02500,,false,966192.1,338736.58
New York City,Manhattan,7002054,001464,New York-Presbyterian Hospital - Columbia Presbyterian Center,0 to 17,100,F,White,Not Span/Hispanic,1,Emergency,Expired,2018,PNL013,OTHER SPECIFIED AND UNSPECIFIED PERINATAL CONDITIONS,ESA002,EXTRACORPOREAL MEMBRANE OXYGENATION,583,NEONATE W ECMO,15,NEWBORNS AND OTHER NEONATES WITH CONDITIONS ORIGINATING IN THE PERINATAL PERIOD,2,Moderate,Moderate,Surgical,Private Health Insurance,Self-Pay,,02900,,false,46529.55,13023.86
New York City,Manhattan,7002054,001464,New York-Presbyterian Hospital - Columbia Presbyterian Center,0 to 17,,M,Black/African American,Spanish/Hispanic,9,Newborn,Expired,2018,PNL001,LIVEBORN,ESA003,MECHANICAL VENTILATION,583,NEONATE W ECMO,15,NEWBORNS AND OTHER NEONATES WITH CONDITIONS ORIGINATING IN THE PERINATAL PERIOD,2,Moderate,Moderate,Surgical,Medicaid,Medicaid,Self-Pay,04000,,false,628953.31,153427.03
Central NY,Onondaga,3301008,000636,Crouse Hospital,0 to 17,132,M,Black/African American,Not Span/Hispanic,112,Newborn,Home w/ Home Health Services,2018,PNL001,LIVEBORN,RES007,AIRWAY INTUBATION,583,NEONATE W ECMO,15,NEWBORNS AND OTHER NEONATES WITH CONDITIONS ORIGINATING IN THE PERINATAL PERIOD,3,Major,Major,Surgical,Medicaid,,,03400,,false,676252.07,316501.77
New York City,Manhattan,7002053,001463,NYU Langone Hospitals,0 to 17,111,M,White,Not Span/Hispanic,31,Newborn,Home or Self Care,2018,PNL001,LIVEBORN,RES007,AIRWAY INTUBATION,583,NEONATE W ECMO,15,NEWBORNS AND OTHER NEONATES WITH CONDITIONS ORIGINATING IN THE PERINATAL PERIOD,2,Moderate,Moderate,Surgical,Private Health Insurance,,,03300,,false,830365.08,196211.93
Western NY,Erie,1401014,000208,John R. Oishei Children's Hospital,0 to 17,142,M,Black/African American,Not Span/Hispanic,120 +,Newborn,Expired,2018,PNL001,LIVEBORN,ESA002,EXTRACORPOREAL MEMBRANE OXYGENATION,583,NEONATE W ECMO,15,NEWBORNS AND OTHER NEONATES WITH CONDITIONS ORIGINATING IN THE PERINATAL PERIOD,4,Extreme,Extreme,Surgical,Medicaid,Self-Pay,,00500,,false,3950530.36,1193306.81
New York City,Manhattan,7002054,001464,New York-Presbyterian Hospital - Columbia Presbyterian Center,0 to 17,112,M,White,Spanish/Hispanic,89,Newborn,Short-term Hospital,2018,PNL001,LIVEBORN,CNS014,"CNS PROCEDURES, NEC",583,NEONATE W ECMO,15,NEWBORNS AND OTHER NEONATES WITH CONDITIONS ORIGINATING IN THE PERINATAL PERIOD,4,Extreme,Extreme,Surgical,Medicaid,Medicaid,Self-Pay,01500,,false,2438088.77,539851.29
New York City,Manhattan,7002054,001464,New York-Presbyterian Hospital - Columbia Presbyterian Center,0 to 17,117,M,Other Race,Not Span/Hispanic,2,Urgent,Expired,2018,PNL006,RESPIRATORY PERINATAL CONDITION,ESA002,EXTRACORPOREAL MEMBRANE OXYGENATION,583,NEONATE W ECMO,15,NEWBORNS AND OTHER NEONATES WITH CONDITIONS ORIGINATING IN THE PERINATAL PERIOD,4,Extreme,Extreme,Surgical,Blue Cross/Blue Shield,Self-Pay,,03300,,false,178179.7,46372.41
New York City,Manhattan,7002054,001464,New York-Presbyterian Hospital - Columbia Presbyterian Center,0 to 17,OOS,F,Other Race,Not Span/Hispanic,7,Elective,Expired,2018,CIR005,MYOCARDITIS AND CARDIOMYOPATHY,ESA003,MECHANICAL VENTILATION,583,NEONATE W ECMO,15,NEWBORNS AND OTHER NEONATES WITH CONDITIONS ORIGINATING IN THE PERINATAL PERIOD,2,Moderate,Moderate,Surgical,Medicaid,Self-Pay,,02500,,false,398559,92084.15
New York City,Queens,7003004,003376,Cohen Children's Medical Center,0 to 17,,F,Other Race,Unknown,1,Urgent,Expired,2018,MAL008,MUSCULOSKELETAL CONGENITAL CONDITIONS,ESA002,EXTRACORPOREAL MEMBRANE OXYGENATION,583,NEONATE W ECMO,15,NEWBORNS AND OTHER NEONATES WITH CONDITIONS ORIGINATING IN THE PERINATAL PERIOD,2,Moderate,Moderate,Surgical,Medicaid,Medicaid,Self-Pay,02700,,false,93462.28,30835.31
New York City,Queens,7003004,003376,Cohen Children's Medical Center,0 to 17,114,F,Other Race,Not Span/Hispanic,83,Newborn,Home or Self Care,2018,PNL001,LIVEBORN,ESA002,EXTRACORPOREAL MEMBRANE OXYGENATION,583,NEONATE W ECMO,15,NEWBORNS AND OTHER NEONATES WITH CONDITIONS ORIGINATING IN THE PERINATAL PERIOD,4,Extreme,Extreme,Surgical,Medicaid,Medicaid,Self-Pay,02900,,false,1710101.74,687915.52
New York City,Manhattan,7002054,001464,New York-Presbyterian Hospital - Columbia Presbyterian Center,0 to 17,113,M,White,Not Span/Hispanic,4,Newborn,Expired,2018,PNL001,LIVEBORN,ESA002,EXTRACORPOREAL MEMBRANE OXYGENATION,583,NEONATE W ECMO,15,NEWBORNS AND OTHER NEONATES WITH CONDITIONS ORIGINATING IN THE PERINATAL PERIOD,4,Extreme,Extreme,Surgical,Private Health Insurance,Self-Pay,,03300,,false,343401.3,75689.83
New York City,Queens,7003004,003376,Cohen Children's Medical Center,0 to 17,,M,White,Unknown,4,Urgent,Expired,2018,PNL006,RESPIRATORY PERINATAL CONDITION,ESA002,EXTRACORPOREAL MEMBRANE OXYGENATION,583,NEONATE W ECMO,15,NEWBORNS AND OTHER NEONATES WITH CONDITIONS ORIGINATING IN THE PERINATAL PERIOD,1,Minor,Minor,Surgical,Medicaid,Self-Pay,,03700,,false,217623.27,70405.59
New York City,Manhattan,7002053,001463,NYU Langone Hospitals,0 to 17,112,M,White,Not Span/Hispanic,65,Newborn,Skilled Nursing Home,2018,PNL001,LIVEBORN,ESA002,EXTRACORPOREAL MEMBRANE OXYGENATION,583,NEONATE W ECMO,15,NEWBORNS AND OTHER NEONATES WITH CONDITIONS ORIGINATING IN THE PERINATAL PERIOD,2,Moderate,Moderate,Surgical,Private Health Insurance,,,03800,,false,1455129.32,416191.39
New York City,Manhattan,7002054,001464,New York-Presbyterian Hospital - Columbia Presbyterian Center,0 to 17,100,F,Other Race,Not Span/Hispanic,94,Urgent,Cancer Center or Children's Hospital,2018,MAL008,MUSCULOSKELETAL CONGENITAL CONDITIONS,ESA002,EXTRACORPOREAL MEMBRANE OXYGENATION,583,NEONATE W ECMO,15,NEWBORNS AND OTHER NEONATES WITH CONDITIONS ORIGINATING IN THE PERINATAL PERIOD,3,Major,Major,Surgical,Medicaid,Self-Pay,,03000,,false,2270139.98,486922.67
New York City,Manhattan,7002054,001464,New York-Presbyterian Hospital - Columbia Presbyterian Center,0 to 17,100,F,Other Race,Not Span/Hispanic,5,Newborn,Expired,2018,PNL001,LIVEBORN,CAR019,SEPTAL REPAIR AND OTHER THERAPEUTIC HEART PROCEDURES,583,NEONATE W ECMO,15,NEWBORNS AND OTHER NEONATES WITH CONDITIONS ORIGINATING IN THE PERINATAL PERIOD,4,Extreme,Extreme,Surgical,Private Health Insurance,Self-Pay,,02300,,false,386198.56,101081.87
New York City,Manhattan,7002054,001464,New York-Presbyterian Hospital - Columbia Presbyterian Center,0 to 17,104,M,Black/African American,Not Span/Hispanic,104,Newborn,Expired,2018,PNL001,LIVEBORN,ESA002,EXTRACORPOREAL MEMBRANE OXYGENATION,583,NEONATE W ECMO,15,NEWBORNS AND OTHER NEONATES WITH CONDITIONS ORIGINATING IN THE PERINATAL PERIOD,4,Extreme,Extreme,Surgical,Private Health Insurance,Self-Pay,,03700,,false,6328703.47,1546541.86
New York City,Manhattan,7002054,001464,New York-Presbyterian Hospital - Columbia Presbyterian Center,0 to 17,100,F,Black/African American,Not Span/Hispanic,50,Emergency,Home or Self Care,2018,PNL013,OTHER SPECIFIED AND UNSPECIFIED PERINATAL CONDITIONS,ESA002,EXTRACORPOREAL MEMBRANE OXYGENATION,583,NEONATE W ECMO,15,NEWBORNS AND OTHER NEONATES WITH CONDITIONS ORIGINATING IN THE PERINATAL PERIOD,1,Minor,Minor,Surgical,Medicaid,Medicaid,Self-Pay,02200,,false,1591500.87,335324.03
New York City,Queens,7003004,003376,Cohen Children's Medical Center,0 to 17,114,F,Other Race,Not Span/Hispanic,61,Newborn,Home w/ Home Health Services,2018,PNL001,LIVEBORN,ESA002,EXTRACORPOREAL MEMBRANE OXYGENATION,583,NEONATE W ECMO,15,NEWBORNS AND OTHER NEONATES WITH CONDITIONS ORIGINATING IN THE PERINATAL PERIOD,1,Minor,Minor,Surgical,Medicaid,Medicaid,Self-Pay,03700,,false,1318375.92,347177.03
New York City,Manhattan,7002053,001463,NYU Langone Hospitals,0 to 17,114,M,Other Race,Unknown,35,Emergency,Home w/ Home Health Services,2018,PNL006,RESPIRATORY PERINATAL CONDITION,ESA002,EXTRACORPOREAL MEMBRANE OXYGENATION,583,NEONATE W ECMO,15,NEWBORNS AND OTHER NEONATES WITH CONDITIONS ORIGINATING IN THE PERINATAL PERIOD,1,Minor,Minor,Surgical,Medicaid,,,03000,,false,1003945.02,243641.72
New York City,Queens,7003004,003376,Cohen Children's Medical Center,0 to 17,117,M,Other Race,Not Span/Hispanic,15,Urgent,Expired,2018,MAL001,CARDIAC AND CIRCULATORY CONGENITAL ANOMALIES,ESA002,EXTRACORPOREAL MEMBRANE OXYGENATION,583,NEONATE W ECMO,15,NEWBORNS AND OTHER NEONATES WITH CONDITIONS ORIGINATING IN THE PERINATAL PERIOD,4,Extreme,Extreme,Surgical,Medicaid,Medicaid,Self-Pay,02400,,false,755615.65,209263.25
New York City,Manhattan,7002054,001464,New York-Presbyterian Hospital - Columbia Presbyterian Center,0 to 17,OOS,F,Other Race,Not Span/Hispanic,120 +,Newborn,Cancer Center or Children's Hospital,2018,PNL001,LIVEBORN,CAR013,HEART AND GREAT VESSEL BYPASS PROCEDURES,583,NEONATE W ECMO,15,NEWBORNS AND OTHER NEONATES WITH CONDITIONS ORIGINATING IN THE PERINATAL PERIOD,4,Extreme,Extreme,Surgical,Medicaid,Self-Pay,,03000,,false,4019554.71,962942.54
New York City,Queens,7003004,003376,Cohen Children's Medical Center,0 to 17,113,F,Other Race,Not Span/Hispanic,20,Urgent,Home w/ Home Health Services,2018,PNL013,OTHER SPECIFIED AND UNSPECIFIED PERINATAL CONDITIONS,ESA002,EXTRACORPOREAL MEMBRANE OXYGENATION,583,NEONATE W ECMO,15,NEWBORNS AND OTHER NEONATES WITH CONDITIONS ORIGINATING IN THE PERINATAL PERIOD,1,Minor,Minor,Surgical,Medicaid,Medicaid,Self-Pay,03000,,false,451816.85,104344.54
New York City,Manhattan,7002054,001458,New York-Presbyterian Hospital - New York Weill Cornell Center,0 to 17,104,M,Other Race,Not Span/Hispanic,24,Emergency,Home or Self Care,2018,PNL006,RESPIRATORY PERINATAL CONDITION,ESA002,EXTRACORPOREAL MEMBRANE OXYGENATION,583,NEONATE W ECMO,15,NEWBORNS AND OTHER NEONATES WITH CONDITIONS ORIGINATING IN THE PERINATAL PERIOD,4,Extreme,Extreme,Surgical,Medicaid,Self-Pay,,03300,,false,675192.18,143356.99
New York City,Manhattan,7002054,001464,New York-Presbyterian Hospital - Columbia Presbyterian Center,0 to 17,,F,White,Multi-ethnic,35,Newborn,Home or Self Care,2018,PNL001,LIVEBORN,ESA002,EXTRACORPOREAL MEMBRANE OXYGENATION,583,NEONATE W ECMO,15,NEWBORNS AND OTHER NEONATES WITH CONDITIONS ORIGINATING IN THE PERINATAL PERIOD,4,Extreme,Extreme,Surgical,Medicaid,Medicaid,Self-Pay,03900,,false,1113025.06,243725.21
New York City,Bronx,7000006,003058,Montefiore Med Center - Jack D Weiler Hosp of A Einstein College Div,0 to 17,104,M,Other Race,Unknown,31,Newborn,Home w/ Home Health Services,2018,PNL001,LIVEBORN,ESA003,MECHANICAL VENTILATION,583,NEONATE W ECMO,15,NEWBORNS AND OTHER NEONATES WITH CONDITIONS ORIGINATING IN THE PERINATAL PERIOD,1,Minor,Minor,Surgical,Medicaid,,,02300,,false,810972.99,137067.1
New York City,Manhattan,7002024,001456,Mount Sinai Hospital,0 to 17,112,M,White,Spanish/Hispanic,120 +,Newborn,Home w/ Home Health Services,2018,PNL001,LIVEBORN,ESA002,EXTRACORPOREAL MEMBRANE OXYGENATION,583,NEONATE W ECMO,15,NEWBORNS AND OTHER NEONATES WITH CONDITIONS ORIGINATING IN THE PERINATAL PERIOD,4,Extreme,Extreme,Surgical,Medicaid,Medicaid,Self-Pay,02300,,false,3656338.92,704877.96
New York City,Bronx,7000006,001169,Montefiore Medical Center - Henry & Lucy Moses Div,0 to 17,105,F,Other Race,Unknown,120 +,Emergency,Inpatient Rehabilitation Facility,2018,PNL009,PERINATAL INFECTIONS,RES010,TRACHEOSTOMY,583,NEONATE W ECMO,15,NEWBORNS AND OTHER NEONATES WITH CONDITIONS ORIGINATING IN THE PERINATAL PERIOD,4,Extreme,Extreme,Surgical,Medicaid,,,04600,,false,3370689.45,569816.17
New York City,Manhattan,7002053,001463,NYU Langone Hospitals,0 to 17,OOS,M,Other Race,Unknown,11,Emergency,Short-term Hospital,2018,MAL007,RESPIRATORY CONGENITAL MALFORMATIONS,ESA002,EXTRACORPOREAL MEMBRANE OXYGENATION,583,NEONATE W ECMO,15,NEWBORNS AND OTHER NEONATES WITH CONDITIONS ORIGINATING IN THE PERINATAL PERIOD,2,Moderate,Moderate,Surgical,Private Health Insurance,,,02500,,false,931500.33,160495.09
New York City,Manhattan,7002053,001463,NYU Langone Hospitals,0 to 17,112,F,Other Race,Not Span/Hispanic,36,Emergency,Home or Self Care,2018,PNL013,OTHER SPECIFIED AND UNSPECIFIED PERINATAL CONDITIONS,ESA002,EXTRACORPOREAL MEMBRANE OXYGENATION,583,NEONATE W ECMO,15,NEWBORNS AND OTHER NEONATES WITH CONDITIONS ORIGINATING IN THE PERINATAL PERIOD,2,Moderate,Moderate,Surgical,Medicaid,,,03000,,false,993550.12,240116.19
Finger Lakes,Monroe,2701005,000413,Strong Memorial Hospital,0 to 17,140,F,Other Race,Not Span/Hispanic,120 +,Newborn,Expired,2018,PNL001,LIVEBORN,ESA002,EXTRACORPOREAL MEMBRANE OXYGENATION,583,NEONATE W ECMO,15,NEWBORNS AND OTHER NEONATES WITH CONDITIONS ORIGINATING IN THE PERINATAL PERIOD,4,Extreme,Extreme,Surgical,Private Health Insurance,Medicaid,Self-Pay,00600,,false,1321202.07,443014.25
Finger Lakes,Monroe,2701005,000413,Strong Memorial Hospital,0 to 17,146,F,White,Not Span/Hispanic,34,Newborn,Home w/ Home Health Services,2018,PNL001,LIVEBORN,ESA002,EXTRACORPOREAL MEMBRANE OXYGENATION,583,NEONATE W ECMO,15,NEWBORNS AND OTHER NEONATES WITH CONDITIONS ORIGINATING IN THE PERINATAL PERIOD,1,Minor,Minor,Surgical,Medicaid,,,04000,,false,344328.59,103664.77
New York City,Manhattan,7002054,001464,New York-Presbyterian Hospital - Columbia Presbyterian Center,0 to 17,OOS,M,White,Spanish/Hispanic,84,Urgent,Expired,2018,MAL001,CARDIAC AND CIRCULATORY CONGENITAL ANOMALIES,ESA002,EXTRACORPOREAL MEMBRANE OXYGENATION,583,NEONATE W ECMO,15,NEWBORNS AND OTHER NEONATES WITH CONDITIONS ORIGINATING IN THE PERINATAL PERIOD,4,Extreme,Extreme,Surgical,Private Health Insurance,Private Health Insurance,Self-Pay,03200,,false,2002067.35,429176.98
Finger Lakes,Monroe,2701005,000413,Strong Memorial Hospital,0 to 17,,F,Black/African American,Not Span/Hispanic,13,Newborn,Expired,2018,PNL001,LIVEBORN,CAR013,HEART AND GREAT VESSEL BYPASS PROCEDURES,583,NEONATE W ECMO,15,NEWBORNS AND OTHER NEONATES WITH CONDITIONS ORIGINATING IN THE PERINATAL PERIOD,4,Extreme,Extreme,Surgical,Medicaid,,,03300,,false,329253.03,104674.64
Finger Lakes,Monroe,2701005,000413,Strong Memorial Hospital,0 to 17,145,M,Multi-racial,Not Span/Hispanic,120 +,Newborn,Home w/ Home Health Services,2018,PNL001,LIVEBORN,RES008,"LUNG, PLEURA, OR DIAPHRAGM RESECTION (OPEN AND THORACOSCOPIC)",583,NEONATE W ECMO,15,NEWBORNS AND OTHER NEONATES WITH CONDITIONS ORIGINATING IN THE PERINATAL PERIOD,2,Moderate,Moderate,Surgical,Medicaid,,,03500,,false,1874540.35,513894.38
Finger Lakes,Monroe,2701005,000413,Strong Memorial Hospital,0 to 17,146,M,Black/African American,Not Span/Hispanic,77,Newborn,Home or Self Care,2018,PNL001,LIVEBORN,CAR024,VENOUS AND ARTERIAL CATHETER PLACEMENT,583,NEONATE W ECMO,15,NEWBORNS AND OTHER NEONATES WITH CONDITIONS ORIGINATING IN THE PERINATAL PERIOD,1,Minor,Minor,Surgical,Medicaid,,,05900,,false,762812.5,249752.42
Finger Lakes,Monroe,2701005,000413,Strong Memorial Hospital,0 to 17,140,F,White,Not Span/Hispanic,28,Newborn,Expired,2018,PNL001,LIVEBORN,ESA002,EXTRACORPOREAL MEMBRANE OXYGENATION,583,NEONATE W ECMO,15,NEWBORNS AND OTHER NEONATES WITH CONDITIONS ORIGINATING IN THE PERINATAL PERIOD,2,Moderate,Moderate,Surgical,Private Health Insurance,,,02500,,false,575840.11,157899.55
New York City,Manhattan,7002054,001464,New York-Presbyterian Hospital - Columbia Presbyterian Center,0 to 17,112,M,White,Not Span/Hispanic,35,Newborn,Home or Self Care,2018,PNL001,LIVEBORN,ESA002,EXTRACORPOREAL MEMBRANE OXYGENATION,583,NEONATE W ECMO,15,NEWBORNS AND OTHER NEONATES WITH CONDITIONS ORIGINATING IN THE PERINATAL PERIOD,4,Extreme,Extreme,Surgical,Blue Cross/Blue Shield,Medicaid,Medicaid,02400,,false,1194647.43,255235.23
