Hospital Service Area,Hospital County,Operating Certificate Number,Permanent Facility Id,Facility Name,Age Group,Zip Code - 3 digits,Gender,Race,Ethnicity,Length of Stay,Type of Admission,Patient Disposition,Discharge Year,CCS Diagnosis Code,CCS Diagnosis Description,CCS Procedure Code,CCS Procedure Description,APR DRG Code,APR DRG Description,APR MDC Code,APR MDC Description,APR Severity of Illness Code,APR Severity of Illness Description,APR Risk of Mortality,APR Medical Surgical Description,Payment Typology 1,Payment Typology 2,Payment Typology 3,Birth Weight,Abortion Edit Indicator,Emergency Department Indicator,Total Charges,Total Costs
New York City,Manhattan,7002054,001464,New York-Presbyterian Hospital - Columbia Presbyterian Center,0 to 17,104,M,Multi-racial,Multi-ethnic,89,Newborn,Home or Self Care,2018,PNL001,LIVEBORN,ESA004,NON-INVASIVE VENTILATION,591,NEONATE BIRTHWT 500-749G W/O MAJOR PROCEDURE,15,NEWBORNS AND OTHER NEONATES WITH CONDITIONS ORIGINATING IN THE PERINATAL PERIOD,3,Major,Minor,Medical,Medicaid,Medicaid,Self-Pay,00700,,false,1781583.1,363746.58
New York City,Bronx,7000006,003058,Montefiore Med Center - Jack D Weiler Hosp of A Einstein College Div,0 to 17,104,F,Other Race,Unknown,108,Newborn,Home w/ Home Health Services,2018,PNL001,LIVEBORN,ESA003,MECHANICAL VENTILATION,591,NEONATE BIRTHWT 500-749G W/O MAJOR PROCEDURE,15,NEWBORNS AND OTHER NEONATES WITH CONDITIONS ORIGINATING IN THE PERINATAL PERIOD,4,Extreme,Major,Medical,Medicaid,,,00600,,false,1999422.62,253444.22
New York City,Richmond,7004003,001740,Staten Island University Hosp-North,0 to 17,112,M,Other Race,Not Span/Hispanic,1,Newborn,Expired,2018,PNL001,LIVEBORN,RES007,AIRWAY INTUBATION,591,NEONATE BIRTHWT 500-749G W/O MAJOR PROCEDURE,15,NEWBORNS AND OTHER NEONATES WITH CONDITIONS ORIGINATING IN THE PERINATAL PERIOD,4,Extreme,Extreme,Medical,Private Health Insurance,,,00600,,false,20305.92,6381.48
New York City,Richmond,7004003,001740,Staten Island University Hosp-North,0 to 17,112,F,White,Not Span/Hispanic,1,Newborn,Expired,2018,PNL001,LIVEBORN,RES007,AIRWAY INTUBATION,591,NEONATE BIRTHWT 500-749G W/O MAJOR PROCEDURE,15,NEWBORNS AND OTHER NEONATES WITH CONDITIONS ORIGINATING IN THE PERINATAL PERIOD,3,Major,Major,Medical,Private Health Insurance,,,00700,,false,12327.45,5047.28
New York City,Manhattan,7002054,001464,New York-Presbyterian Hospital - Columbia Presbyterian Center,0 to 17,104,M,Other Race,Multi-ethnic,102,Newborn,Home or Self Care,2018,PNL001,LIVEBORN,ESA004,NON-INVASIVE VENTILATION,591,NEONATE BIRTHWT 500-749G W/O MAJOR PROCEDURE,15,NEWBORNS AND OTHER NEONATES WITH CONDITIONS ORIGINATING IN THE PERINATAL PERIOD,4,Extreme,Major,Medical,Medicaid,Medicaid,Self-Pay,00600,,false,2120849.13,433502.05
New York City,Manhattan,7002054,001464,New York-Presbyterian Hospital - Columbia Presbyterian Center,0 to 17,104,M,White,Spanish/Hispanic,120 +,Newborn,Home or Self Care,2018,PNL001,LIVEBORN,ESA003,MECHANICAL VENTILATION,591,NEONATE BIRTHWT 500-749G W/O MAJOR PROCEDURE,15,NEWBORNS AND OTHER NEONATES WITH CONDITIONS ORIGINATING IN THE PERINATAL PERIOD,4,Extreme,Major,Medical,Medicaid,Medicaid,Self-Pay,00500,,false,3031132.91,630096.37
New York City,Manhattan,7002054,001458,New York-Presbyterian Hospital - New York Weill Cornell Center,0 to 17,OOS,M,Other Race,Not Span/Hispanic,3,Newborn,Expired,2018,PNL001,LIVEBORN,RES007,AIRWAY INTUBATION,591,NEONATE BIRTHWT 500-749G W/O MAJOR PROCEDURE,15,NEWBORNS AND OTHER NEONATES WITH CONDITIONS ORIGINATING IN THE PERINATAL PERIOD,3,Major,Major,Medical,Private Health Insurance,Self-Pay,,00500,,false,89940.7,19086.92
New York City,Kings,7001021,001306,New York - Presbyterian Brooklyn Methodist Hospital,0 to 17,112,F,Black/African American,Not Span/Hispanic,77,Newborn,Home or Self Care,2018,PNL001,LIVEBORN,ADM017,ADMINISTRATION OF NUTRITIONAL AND ELECTROLYTIC SUBSTANCES,591,NEONATE BIRTHWT 500-749G W/O MAJOR PROCEDURE,15,NEWBORNS AND OTHER NEONATES WITH CONDITIONS ORIGINATING IN THE PERINATAL PERIOD,4,Extreme,Major,Medical,Medicaid,Self-Pay,,00500,,false,828498.98,193773.38
Western NY,Erie,1401014,000208,John R. Oishei Children's Hospital,0 to 17,147,M,White,Not Span/Hispanic,120 +,Elective,Home w/ Home Health Services,2018,PNL001,LIVEBORN,ESA003,MECHANICAL VENTILATION,591,NEONATE BIRTHWT 500-749G W/O MAJOR PROCEDURE,15,NEWBORNS AND OTHER NEONATES WITH CONDITIONS ORIGINATING IN THE PERINATAL PERIOD,4,Extreme,Major,Medical,Medicaid,Self-Pay,,00700,,false,1183448.26,303538.76
New York City,Kings,7001037,001320,University Hospital of Brooklyn,0 to 17,112,M,Black/African American,Not Span/Hispanic,36,Newborn,Expired,2018,PNL001,LIVEBORN,ESA003,MECHANICAL VENTILATION,591,NEONATE BIRTHWT 500-749G W/O MAJOR PROCEDURE,15,NEWBORNS AND OTHER NEONATES WITH CONDITIONS ORIGINATING IN THE PERINATAL PERIOD,4,Extreme,Extreme,Medical,Medicaid,Medicaid,Self-Pay,00600,,false,637161,353179.81
Long Island,Nassau,2908000,000511,NYU Langone Hospital-Long Island,0 to 17,115,M,White,Not Span/Hispanic,37,Newborn,Short-term Hospital,2018,PNL001,LIVEBORN,ESA003,MECHANICAL VENTILATION,591,NEONATE BIRTHWT 500-749G W/O MAJOR PROCEDURE,15,NEWBORNS AND OTHER NEONATES WITH CONDITIONS ORIGINATING IN THE PERINATAL PERIOD,4,Extreme,Major,Medical,Private Health Insurance,Private Health Insurance,Medicaid,00700,,false,2531055.29,317364.14
Capital/Adirond,Albany,0101000,000001,Albany Medical Center Hospital,0 to 17,123,F,Black/African American,Not Span/Hispanic,120 +,Urgent,Home or Self Care,2018,PNL005,RESPIRATORY DISTRESS SYNDROME,ESA003,MECHANICAL VENTILATION,591,NEONATE BIRTHWT 500-749G W/O MAJOR PROCEDURE,15,NEWBORNS AND OTHER NEONATES WITH CONDITIONS ORIGINATING IN THE PERINATAL PERIOD,4,Extreme,Major,Medical,"Managed Care, Unspecified",Medicaid,,00600,,false,1296340.68,335679.29
New York City,Bronx,7000002,001165,Jacobi Medical Center,0 to 17,104,M,Other Race,Unknown,116,Urgent,Inpatient Rehabilitation Facility,2018,PNL009,PERINATAL INFECTIONS,CAR024,VENOUS AND ARTERIAL CATHETER PLACEMENT,591,NEONATE BIRTHWT 500-749G W/O MAJOR PROCEDURE,15,NEWBORNS AND OTHER NEONATES WITH CONDITIONS ORIGINATING IN THE PERINATAL PERIOD,4,Extreme,Major,Medical,Medicaid,,,00500,,false,693151.15,410102.88
New York City,Manhattan,7002054,001464,New York-Presbyterian Hospital - Columbia Presbyterian Center,0 to 17,100,M,Black/African American,Not Span/Hispanic,56,Newborn,Home or Self Care,2018,PNL001,LIVEBORN,ESA004,NON-INVASIVE VENTILATION,591,NEONATE BIRTHWT 500-749G W/O MAJOR PROCEDURE,15,NEWBORNS AND OTHER NEONATES WITH CONDITIONS ORIGINATING IN THE PERINATAL PERIOD,2,Moderate,Minor,Medical,Blue Cross/Blue Shield,Self-Pay,,00700,,false,1083143.4,219495.5
New York City,Kings,7001037,001320,University Hospital of Brooklyn,0 to 17,112,M,Black/African American,Not Span/Hispanic,120 +,Newborn,Home w/ Home Health Services,2018,PNL001,LIVEBORN,ESA003,MECHANICAL VENTILATION,591,NEONATE BIRTHWT 500-749G W/O MAJOR PROCEDURE,15,NEWBORNS AND OTHER NEONATES WITH CONDITIONS ORIGINATING IN THE PERINATAL PERIOD,4,Extreme,Major,Medical,Medicaid,Medicaid,Self-Pay,00600,,false,1080906.5,716371.29
Central NY,Onondaga,3301008,000636,Crouse Hospital,0 to 17,130,F,White,Not Span/Hispanic,86,Newborn,Home w/ Home Health Services,2018,PNL001,LIVEBORN,ESA003,MECHANICAL VENTILATION,591,NEONATE BIRTHWT 500-749G W/O MAJOR PROCEDURE,15,NEWBORNS AND OTHER NEONATES WITH CONDITIONS ORIGINATING IN THE PERINATAL PERIOD,4,Extreme,Minor,Medical,Blue Cross/Blue Shield,,,00600,,false,264106.53,125141.18
New York City,Manhattan,7002054,001464,New York-Presbyterian Hospital - Columbia Presbyterian Center,0 to 17,104,F,Black/African American,Not Span/Hispanic,82,Newborn,Home or Self Care,2018,PNL001,LIVEBORN,ADM017,ADMINISTRATION OF NUTRITIONAL AND ELECTROLYTIC SUBSTANCES,591,NEONATE BIRTHWT 500-749G W/O MAJOR PROCEDURE,15,NEWBORNS AND OTHER NEONATES WITH CONDITIONS ORIGINATING IN THE PERINATAL PERIOD,3,Major,Moderate,Medical,Medicaid,Medicaid,Self-Pay,00600,,false,1694698.09,347767.35
Long Island,Nassau,2908000,000511,NYU Langone Hospital-Long Island,0 to 17,115,M,Other Race,Unknown,120 +,Newborn,Short-term Hospital,2018,PNL001,LIVEBORN,ESA005,CARDIAC CHEST COMPRESSION,591,NEONATE BIRTHWT 500-749G W/O MAJOR PROCEDURE,15,NEWBORNS AND OTHER NEONATES WITH CONDITIONS ORIGINATING IN THE PERINATAL PERIOD,4,Extreme,Extreme,Medical,Private Health Insurance,Private Health Insurance,Medicaid,00500,,false,2928045.26,376809.23
New York City,Manhattan,7002054,001464,New York-Presbyterian Hospital - Columbia Presbyterian Center,0 to 17,100,F,White,Spanish/Hispanic,120 +,Newborn,Home or Self Care,2018,PNL001,LIVEBORN,ADM017,ADMINISTRATION OF NUTRITIONAL AND ELECTROLYTIC SUBSTANCES,591,NEONATE BIRTHWT 500-749G W/O MAJOR PROCEDURE,15,NEWBORNS AND OTHER NEONATES WITH CONDITIONS ORIGINATING IN THE PERINATAL PERIOD,3,Major,Major,Medical,Medicaid,Medicaid,Self-Pay,00500,,false,2646112.56,541409.87
Western NY,Erie,1401014,000208,John R. Oishei Children's Hospital,0 to 17,142,F,Other Race,Spanish/Hispanic,120 +,Newborn,Home w/ Home Health Services,2018,PNL001,LIVEBORN,ESA003,MECHANICAL VENTILATION,591,NEONATE BIRTHWT 500-749G W/O MAJOR PROCEDURE,15,NEWBORNS AND OTHER NEONATES WITH CONDITIONS ORIGINATING IN THE PERINATAL PERIOD,4,Extreme,Extreme,Medical,Medicaid,Self-Pay,,00600,,false,1179917.33,310967.48
Western NY,Erie,1401014,000208,John R. Oishei Children's Hospital,0 to 17,142,F,Other Race,Spanish/Hispanic,120 +,Newborn,Home w/ Home Health Services,2018,PNL001,LIVEBORN,RES007,AIRWAY INTUBATION,591,NEONATE BIRTHWT 500-749G W/O MAJOR PROCEDURE,15,NEWBORNS AND OTHER NEONATES WITH CONDITIONS ORIGINATING IN THE PERINATAL PERIOD,4,Extreme,Extreme,Medical,Medicaid,Self-Pay,,00500,,false,1171536.17,300698.13
New York City,Manhattan,7002024,001456,Mount Sinai Hospital,0 to 17,100,M,Black/African American,Not Span/Hispanic,97,Newborn,Home or Self Care,2018,PNL001,LIVEBORN,ESA003,MECHANICAL VENTILATION,591,NEONATE BIRTHWT 500-749G W/O MAJOR PROCEDURE,15,NEWBORNS AND OTHER NEONATES WITH CONDITIONS ORIGINATING IN THE PERINATAL PERIOD,4,Extreme,Extreme,Medical,Medicaid,Medicaid,Self-Pay,00700,,false,1511896.62,283728.9
Western NY,Erie,1401014,000208,John R. Oishei Children's Hospital,0 to 17,142,F,Black/African American,Not Span/Hispanic,110,Newborn,Home w/ Home Health Services,2018,PNL001,LIVEBORN,EST002,PHOTOTHERAPY,591,NEONATE BIRTHWT 500-749G W/O MAJOR PROCEDURE,15,NEWBORNS AND OTHER NEONATES WITH CONDITIONS ORIGINATING IN THE PERINATAL PERIOD,4,Extreme,Major,Medical,Medicaid,Self-Pay,,00500,,false,1058810.33,273414.4
New York City,Manhattan,7002054,001464,New York-Presbyterian Hospital - Columbia Presbyterian Center,0 to 17,112,F,White,Not Span/Hispanic,120 +,Newborn,Home or Self Care,2018,PNL001,LIVEBORN,GIS006,PARACENTESIS,591,NEONATE BIRTHWT 500-749G W/O MAJOR PROCEDURE,15,NEWBORNS AND OTHER NEONATES WITH CONDITIONS ORIGINATING IN THE PERINATAL PERIOD,4,Extreme,Extreme,Medical,Medicaid,Medicaid,Self-Pay,00500,,false,3756682.91,778589.18
New York City,Queens,7003001,001628,Flushing Hospital Medical Center,0 to 17,112,F,Other Race,Not Span/Hispanic,17,Newborn,Short-term Hospital,2018,PNL001,LIVEBORN,IMG008,ULTRASONOGRAPHY,591,NEONATE BIRTHWT 500-749G W/O MAJOR PROCEDURE,15,NEWBORNS AND OTHER NEONATES WITH CONDITIONS ORIGINATING IN THE PERINATAL PERIOD,4,Extreme,Major,Medical,Medicaid,,,00700,,false,136530,44542.3
Western NY,Erie,1401014,000208,John R. Oishei Children's Hospital,0 to 17,,M,White,Unknown,105,Newborn,Home or Self Care,2018,PNL001,LIVEBORN,RES007,AIRWAY INTUBATION,591,NEONATE BIRTHWT 500-749G W/O MAJOR PROCEDURE,15,NEWBORNS AND OTHER NEONATES WITH CONDITIONS ORIGINATING IN THE PERINATAL PERIOD,4,Extreme,Major,Medical,Blue Cross/Blue Shield,Self-Pay,,00600,,false,973710.25,248067.38
Long Island,Nassau,2908000,000511,NYU Langone Hospital-Long Island,0 to 17,117,F,White,Not Span/Hispanic,83,Newborn,Home w/ Home Health Services,2018,PNL001,LIVEBORN,GNR003,INGUINAL AND FEMORAL HERNIA REPAIR,591,NEONATE BIRTHWT 500-749G W/O MAJOR PROCEDURE,15,NEWBORNS AND OTHER NEONATES WITH CONDITIONS ORIGINATING IN THE PERINATAL PERIOD,4,Extreme,Moderate,Medical,Medicaid,Medicaid,,00600,,false,1261489.23,177868.09
Central NY,Onondaga,3301008,000636,Crouse Hospital,0 to 17,135,F,Other Race,Not Span/Hispanic,3,Newborn,Expired,2018,PNL001,LIVEBORN,ESA003,MECHANICAL VENTILATION,591,NEONATE BIRTHWT 500-749G W/O MAJOR PROCEDURE,15,NEWBORNS AND OTHER NEONATES WITH CONDITIONS ORIGINATING IN THE PERINATAL PERIOD,3,Major,Major,Medical,Blue Cross/Blue Shield,,,00700,,false,33050.86,13836.31
New York City,Queens,7003001,001628,Flushing Hospital Medical Center,0 to 17,114,M,Other Race,Not Span/Hispanic,73,Newborn,Home or Self Care,2018,PNL001,LIVEBORN,RES007,AIRWAY INTUBATION,591,NEONATE BIRTHWT 500-749G W/O MAJOR PROCEDURE,15,NEWBORNS AND OTHER NEONATES WITH CONDITIONS ORIGINATING IN THE PERINATAL PERIOD,3,Major,Major,Medical,Medicaid,,,00600,,false,412674.25,133511.19
New York City,Queens,7003010,001637,New York - Presbyterian/Queens,0 to 17,113,M,Other Race,Not Span/Hispanic,92,Newborn,Home w/ Home Health Services,2018,PNL001,LIVEBORN,RES007,AIRWAY INTUBATION,591,NEONATE BIRTHWT 500-749G W/O MAJOR PROCEDURE,15,NEWBORNS AND OTHER NEONATES WITH CONDITIONS ORIGINATING IN THE PERINATAL PERIOD,4,Extreme,Major,Medical,"Managed Care, Unspecified",Medicaid,Self-Pay,00600,,false,1089113.01,208589.06
Long Island,Nassau,2950002,000528,Nassau University Medical Center,0 to 17,115,F,Black/African American,Not Span/Hispanic,106,Newborn,Home or Self Care,2018,PNL001,LIVEBORN,RES007,AIRWAY INTUBATION,591,NEONATE BIRTHWT 500-749G W/O MAJOR PROCEDURE,15,NEWBORNS AND OTHER NEONATES WITH CONDITIONS ORIGINATING IN THE PERINATAL PERIOD,3,Major,Minor,Medical,Medicaid,Medicaid,Self-Pay,00600,,false,672781.27,182011.37
New York City,Queens,7003001,001628,Flushing Hospital Medical Center,0 to 17,113,F,Other Race,Not Span/Hispanic,37,Newborn,Short-term Hospital,2018,PNL001,LIVEBORN,EST002,PHOTOTHERAPY,591,NEONATE BIRTHWT 500-749G W/O MAJOR PROCEDURE,15,NEWBORNS AND OTHER NEONATES WITH CONDITIONS ORIGINATING IN THE PERINATAL PERIOD,4,Extreme,Major,Medical,Private Health Insurance,,,00500,,false,295419,97625.44
New York City,Bronx,7000001,001178,BronxCare Hospital Center,0 to 17,100,F,Other Race,Spanish/Hispanic,84,Newborn,Home or Self Care,2018,PNL001,LIVEBORN,ESA003,MECHANICAL VENTILATION,591,NEONATE BIRTHWT 500-749G W/O MAJOR PROCEDURE,15,NEWBORNS AND OTHER NEONATES WITH CONDITIONS ORIGINATING IN THE PERINATAL PERIOD,4,Extreme,Major,Medical,Medicaid,,,00600,,false,278778.98,378855.7
New York City,Bronx,7000006,003058,Montefiore Med Center - Jack D Weiler Hosp of A Einstein College Div,0 to 17,104,F,Other Race,Unknown,113,Newborn,Home w/ Home Health Services,2018,PNL001,LIVEBORN,ESA003,MECHANICAL VENTILATION,591,NEONATE BIRTHWT 500-749G W/O MAJOR PROCEDURE,15,NEWBORNS AND OTHER NEONATES WITH CONDITIONS ORIGINATING IN THE PERINATAL PERIOD,4,Extreme,Extreme,Medical,Medicaid,,,00700,,false,2219605.42,285903.28
Capital/Adirond,Albany,0101000,000001,Albany Medical Center Hospital,0 to 17,122,F,Other Race,Unknown,120 +,Newborn,Home or Self Care,2018,PNL001,LIVEBORN,ESA003,MECHANICAL VENTILATION,591,NEONATE BIRTHWT 500-749G W/O MAJOR PROCEDURE,15,NEWBORNS AND OTHER NEONATES WITH CONDITIONS ORIGINATING IN THE PERINATAL PERIOD,4,Extreme,Moderate,Medical,"Managed Care, Unspecified",Medicaid,,00600,,false,1192846.55,305460.89
New York City,Queens,7003004,003376,Cohen Children's Medical Center,0 to 17,115,F,White,Not Span/Hispanic,120 +,Newborn,Home w/ Home Health Services,2018,PNL001,LIVEBORN,CAR010,LIGATION AND EMBOLIZATION OF VESSELS,591,NEONATE BIRTHWT 500-749G W/O MAJOR PROCEDURE,15,NEWBORNS AND OTHER NEONATES WITH CONDITIONS ORIGINATING IN THE PERINATAL PERIOD,4,Extreme,Major,Medical,Blue Cross/Blue Shield,Medicaid,Self-Pay,00500,,false,2173948.62,429002.19
New York City,Bronx,7000002,001165,Jacobi Medical Center,0 to 17,104,F,Other Race,Unknown,111,Newborn,Home w/ Home Health Services,2018,PNL001,LIVEBORN,RES007,AIRWAY INTUBATION,591,NEONATE BIRTHWT 500-749G W/O MAJOR PROCEDURE,15,NEWBORNS AND OTHER NEONATES WITH CONDITIONS ORIGINATING IN THE PERINATAL PERIOD,4,Extreme,Major,Medical,Medicaid,Medicaid,,00500,,false,659502.18,390194.46
New York City,Manhattan,7002054,001458,New York-Presbyterian Hospital - New York Weill Cornell Center,0 to 17,112,M,Black/African American,Not Span/Hispanic,11,Newborn,Expired,2018,PNL001,LIVEBORN,RES007,AIRWAY INTUBATION,591,NEONATE BIRTHWT 500-749G W/O MAJOR PROCEDURE,15,NEWBORNS AND OTHER NEONATES WITH CONDITIONS ORIGINATING IN THE PERINATAL PERIOD,4,Extreme,Extreme,Medical,Private Health Insurance,Self-Pay,,00700,,false,375498.91,77943.46
New York City,Queens,7003001,001628,Flushing Hospital Medical Center,0 to 17,113,M,Other Race,Not Span/Hispanic,120 +,Newborn,Short-term Hospital,2018,PNL001,LIVEBORN,ESA003,MECHANICAL VENTILATION,591,NEONATE BIRTHWT 500-749G W/O MAJOR PROCEDURE,15,NEWBORNS AND OTHER NEONATES WITH CONDITIONS ORIGINATING IN THE PERINATAL PERIOD,4,Extreme,Extreme,Medical,Medicaid,,,00600,,false,1264780.68,423684.81
Capital/Adirond,Albany,0101000,000001,Albany Medical Center Hospital,0 to 17,122,F,Other Race,Unknown,106,Newborn,Home w/ Home Health Services,2018,PNL001,LIVEBORN,CAR010,LIGATION AND EMBOLIZATION OF VESSELS,591,NEONATE BIRTHWT 500-749G W/O MAJOR PROCEDURE,15,NEWBORNS AND OTHER NEONATES WITH CONDITIONS ORIGINATING IN THE PERINATAL PERIOD,4,Extreme,Extreme,Medical,"Managed Care, Unspecified",,,00500,,false,970400.62,255674.9
New York City,Manhattan,7002032,001466,Mount Sinai West,0 to 17,OOS,F,Other Race,Not Span/Hispanic,94,Newborn,Home or Self Care,2018,PNL001,LIVEBORN,ENT004,DIAGNOSTIC AUDIOLOGY,591,NEONATE BIRTHWT 500-749G W/O MAJOR PROCEDURE,15,NEWBORNS AND OTHER NEONATES WITH CONDITIONS ORIGINATING IN THE PERINATAL PERIOD,4,Extreme,Major,Medical,Medicare,Medicaid,Self-Pay,00700,,false,1449875.79,396468.87
New York City,Kings,7001021,001306,New York - Presbyterian Brooklyn Methodist Hospital,0 to 17,112,M,Other Race,Not Span/Hispanic,25,Newborn,Short-term Hospital,2018,PNL001,LIVEBORN,ADM017,ADMINISTRATION OF NUTRITIONAL AND ELECTROLYTIC SUBSTANCES,591,NEONATE BIRTHWT 500-749G W/O MAJOR PROCEDURE,15,NEWBORNS AND OTHER NEONATES WITH CONDITIONS ORIGINATING IN THE PERINATAL PERIOD,4,Extreme,Minor,Medical,Private Health Insurance,Self-Pay,,00700,,false,329694.72,77952.64
New York City,Kings,7001003,001288,Brooklyn Hospital Center - Downtown Campus,0 to 17,112,M,Other Race,Spanish/Hispanic,77,Newborn,Home or Self Care,2018,PNL001,LIVEBORN,ESA003,MECHANICAL VENTILATION,591,NEONATE BIRTHWT 500-749G W/O MAJOR PROCEDURE,15,NEWBORNS AND OTHER NEONATES WITH CONDITIONS ORIGINATING IN THE PERINATAL PERIOD,4,Extreme,Minor,Medical,Medicaid,Medicaid,Self-Pay,00600,,false,826597.39,92455.04
Western NY,Erie,1401014,000208,John R. Oishei Children's Hospital,0 to 17,140,F,White,Not Span/Hispanic,120 +,Newborn,Home w/ Home Health Services,2018,PNL001,LIVEBORN,RES007,AIRWAY INTUBATION,591,NEONATE BIRTHWT 500-749G W/O MAJOR PROCEDURE,15,NEWBORNS AND OTHER NEONATES WITH CONDITIONS ORIGINATING IN THE PERINATAL PERIOD,4,Extreme,Major,Medical,Blue Cross/Blue Shield,Medicaid,Self-Pay,00600,,true,1280111.23,337437.62
Capital/Adirond,Albany,0101000,000001,Albany Medical Center Hospital,0 to 17,123,M,Other Race,Unknown,97,Newborn,Home or Self Care,2018,PNL001,LIVEBORN,ESA003,MECHANICAL VENTILATION,591,NEONATE BIRTHWT 500-749G W/O MAJOR PROCEDURE,15,NEWBORNS AND OTHER NEONATES WITH CONDITIONS ORIGINATING IN THE PERINATAL PERIOD,4,Extreme,Extreme,Medical,"Managed Care, Unspecified",,,00600,,false,902552.58,239115.92
New York City,Manhattan,7002054,001458,New York-Presbyterian Hospital - New York Weill Cornell Center,0 to 17,100,M,Black/African American,Not Span/Hispanic,120 +,Newborn,Expired,2018,PNL001,LIVEBORN,CAR010,LIGATION AND EMBOLIZATION OF VESSELS,591,NEONATE BIRTHWT 500-749G W/O MAJOR PROCEDURE,15,NEWBORNS AND OTHER NEONATES WITH CONDITIONS ORIGINATING IN THE PERINATAL PERIOD,4,Extreme,Extreme,Medical,"Managed Care, Unspecified",Medicaid,Self-Pay,00500,,false,2965358.58,632150.71
New York City,Queens,7003004,003376,Cohen Children's Medical Center,0 to 17,114,F,Other Race,Not Span/Hispanic,70,Newborn,Home or Self Care,2018,PNL001,LIVEBORN,EST002,PHOTOTHERAPY,591,NEONATE BIRTHWT 500-749G W/O MAJOR PROCEDURE,15,NEWBORNS AND OTHER NEONATES WITH CONDITIONS ORIGINATING IN THE PERINATAL PERIOD,3,Major,Moderate,Medical,Blue Cross/Blue Shield,Self-Pay,,00700,,false,1035098.82,196605.2
New York City,Kings,7001021,001306,New York - Presbyterian Brooklyn Methodist Hospital,0 to 17,112,M,White,Spanish/Hispanic,16,Newborn,Home or Self Care,2018,PNL001,LIVEBORN,RES007,AIRWAY INTUBATION,591,NEONATE BIRTHWT 500-749G W/O MAJOR PROCEDURE,15,NEWBORNS AND OTHER NEONATES WITH CONDITIONS ORIGINATING IN THE PERINATAL PERIOD,4,Extreme,Moderate,Medical,"Managed Care, Unspecified",Medicaid,Self-Pay,00500,,false,229415.96,54550.82
New York City,Kings,7001021,001306,New York - Presbyterian Brooklyn Methodist Hospital,0 to 17,112,F,Black/African American,Not Span/Hispanic,20,Newborn,Short-term Hospital,2018,PNL001,LIVEBORN,ADM017,ADMINISTRATION OF NUTRITIONAL AND ELECTROLYTIC SUBSTANCES,591,NEONATE BIRTHWT 500-749G W/O MAJOR PROCEDURE,15,NEWBORNS AND OTHER NEONATES WITH CONDITIONS ORIGINATING IN THE PERINATAL PERIOD,4,Extreme,Minor,Medical,Private Health Insurance,Self-Pay,,00500,,false,265387.53,61736.75
New York City,Richmond,7004003,001740,Staten Island University Hosp-North,0 to 17,103,M,Black/African American,Not Span/Hispanic,25,Newborn,Short-term Hospital,2018,PNL001,LIVEBORN,ESA003,MECHANICAL VENTILATION,591,NEONATE BIRTHWT 500-749G W/O MAJOR PROCEDURE,15,NEWBORNS AND OTHER NEONATES WITH CONDITIONS ORIGINATING IN THE PERINATAL PERIOD,4,Extreme,Major,Medical,Medicaid,Medicaid,,00600,,false,136554.41,75736.36
New York City,Queens,7003004,003376,Cohen Children's Medical Center,0 to 17,115,M,Other Race,Spanish/Hispanic,97,Newborn,Home w/ Home Health Services,2018,PNL001,LIVEBORN,CAR024,VENOUS AND ARTERIAL CATHETER PLACEMENT,591,NEONATE BIRTHWT 500-749G W/O MAJOR PROCEDURE,15,NEWBORNS AND OTHER NEONATES WITH CONDITIONS ORIGINATING IN THE PERINATAL PERIOD,4,Extreme,Major,Medical,Medicaid,Medicaid,Self-Pay,00700,,false,1519281.31,292754.73
New York City,Queens,7003004,003376,Cohen Children's Medical Center,0 to 17,115,M,Other Race,Spanish/Hispanic,119,Newborn,Short-term Hospital,2018,PNL001,LIVEBORN,ESA003,MECHANICAL VENTILATION,591,NEONATE BIRTHWT 500-749G W/O MAJOR PROCEDURE,15,NEWBORNS AND OTHER NEONATES WITH CONDITIONS ORIGINATING IN THE PERINATAL PERIOD,4,Extreme,Major,Medical,Medicaid,Medicaid,Self-Pay,00600,,false,1960925.51,383501.82
New York City,Bronx,7000006,001168,Montefiore Medical Center-Wakefield Hospital,0 to 17,104,F,Other Race,Unknown,71,Newborn,Home w/ Home Health Services,2018,PNL001,LIVEBORN,ESA003,MECHANICAL VENTILATION,591,NEONATE BIRTHWT 500-749G W/O MAJOR PROCEDURE,15,NEWBORNS AND OTHER NEONATES WITH CONDITIONS ORIGINATING IN THE PERINATAL PERIOD,4,Extreme,Extreme,Medical,Medicaid,,,00600,,false,1218583.12,150495.44
Central NY,Onondaga,3301008,000636,Crouse Hospital,0 to 17,139,F,White,Not Span/Hispanic,66,Urgent,Short-term Hospital,2018,PNL005,RESPIRATORY DISTRESS SYNDROME,ESA003,MECHANICAL VENTILATION,591,NEONATE BIRTHWT 500-749G W/O MAJOR PROCEDURE,15,NEWBORNS AND OTHER NEONATES WITH CONDITIONS ORIGINATING IN THE PERINATAL PERIOD,4,Extreme,Moderate,Medical,Medicaid,,,00700,,false,241507.86,114842.49
New York City,Manhattan,7002054,001458,New York-Presbyterian Hospital - New York Weill Cornell Center,0 to 17,113,F,Other Race,Not Span/Hispanic,110,Newborn,Home or Self Care,2018,PNL001,LIVEBORN,CAR010,LIGATION AND EMBOLIZATION OF VESSELS,591,NEONATE BIRTHWT 500-749G W/O MAJOR PROCEDURE,15,NEWBORNS AND OTHER NEONATES WITH CONDITIONS ORIGINATING IN THE PERINATAL PERIOD,4,Extreme,Major,Medical,"Managed Care, Unspecified",Medicaid,Self-Pay,00600,,false,2370461.08,509704.3