Hospital Service Area,Hospital County,Operating Certificate Number,Permanent Facility Id,Facility Name,Age Group,Zip Code - 3 digits,Gender,Race,Ethnicity,Length of Stay,Type of Admission,Patient Disposition,Discharge Year,CCS Diagnosis Code,CCS Diagnosis Description,CCS Procedure Code,CCS Procedure Description,APR DRG Code,APR DRG Description,APR MDC Code,APR MDC Description,APR Severity of Illness Code,APR Severity of Illness Description,APR Risk of Mortality,APR Medical Surgical Description,Payment Typology 1,Payment Typology 2,Payment Typology 3,Birth Weight,Abortion Edit Indicator,Emergency Department Indicator,Total Charges,Total Costs
New York City,Manhattan,7002054,001464,New York-Presbyterian Hospital - Columbia Presbyterian Center,0 to 17,100,M,Black/African American,Spanish/Hispanic,80,Newborn,Home or Self Care,2018,PNL001,LIVEBORN,ADM010,VACCINATIONS,593,NEONATE BIRTHWT 750-999G W/O MAJOR PROCEDURE,15,NEWBORNS AND OTHER NEONATES WITH CONDITIONS ORIGINATING IN THE PERINATAL PERIOD,3,Major,Minor,Medical,Medicaid,Medicaid,Self-Pay,00900,,false,1639682.43,335487.34
New York City,Manhattan,7002054,001464,New York-Presbyterian Hospital - Columbia Presbyterian Center,0 to 17,104,M,White,Spanish/Hispanic,120 +,Newborn,Cancer Center or Children's Hospital,2018,PNL001,LIVEBORN,ESA003,MECHANICAL VENTILATION,593,NEONATE BIRTHWT 750-999G W/O MAJOR PROCEDURE,15,NEWBORNS AND OTHER NEONATES WITH CONDITIONS ORIGINATING IN THE PERINATAL PERIOD,4,Extreme,Major,Medical,Medicaid,Medicaid,Self-Pay,00800,,false,3461865.08,706277.01
New York City,Queens,7003004,003376,Cohen Children's Medical Center,0 to 17,117,M,Other Race,Spanish/Hispanic,119,Newborn,Home or Self Care,2018,PNL001,LIVEBORN,CAR010,LIGATION AND EMBOLIZATION OF VESSELS,593,NEONATE BIRTHWT 750-999G W/O MAJOR PROCEDURE,15,NEWBORNS AND OTHER NEONATES WITH CONDITIONS ORIGINATING IN THE PERINATAL PERIOD,4,Extreme,Major,Medical,Blue Cross/Blue Shield,Medicaid,Self-Pay,00700,,false,2154386.46,423312.29
Capital/Adirond,Albany,0101000,000001,Albany Medical Center Hospital,0 to 17,128,M,Other Race,Unknown,81,Newborn,Home or Self Care,2018,PNL001,LIVEBORN,ESA003,MECHANICAL VENTILATION,593,NEONATE BIRTHWT 750-999G W/O MAJOR PROCEDURE,15,NEWBORNS AND OTHER NEONATES WITH CONDITIONS ORIGINATING IN THE PERINATAL PERIOD,4,Extreme,Moderate,Medical,Medicaid,,,00900,,false,747380.32,196593.47
New York City,Queens,7003003,001629,Jamaica Hospital Medical Center,0 to 17,114,M,Other Race,Not Span/Hispanic,88,Newborn,Home or Self Care,2018,PNL001,LIVEBORN,ADM021,"ADMINISTRATION OF THERAPEUTIC SUBSTANCES, NEC",593,NEONATE BIRTHWT 750-999G W/O MAJOR PROCEDURE,15,NEWBORNS AND OTHER NEONATES WITH CONDITIONS ORIGINATING IN THE PERINATAL PERIOD,4,Extreme,Moderate,Medical,Medicaid,,,00800,,false,370130,150822.43
Western NY,Erie,1401014,000208,John R. Oishei Children's Hospital,0 to 17,142,F,White,Not Span/Hispanic,85,Newborn,Home w/ Home Health Services,2018,PNL001,LIVEBORN,ADM021,"ADMINISTRATION OF THERAPEUTIC SUBSTANCES, NEC",593,NEONATE BIRTHWT 750-999G W/O MAJOR PROCEDURE,15,NEWBORNS AND OTHER NEONATES WITH CONDITIONS ORIGINATING IN THE PERINATAL PERIOD,4,Extreme,Moderate,Medical,Private Health Insurance,Self-Pay,,00700,,false,732511.72,184340.97
New York City,Queens,7003001,001628,Flushing Hospital Medical Center,0 to 17,113,M,Other Race,Not Span/Hispanic,26,Newborn,Another Type Not Listed,2018,PNL001,LIVEBORN,IMG008,ULTRASONOGRAPHY,593,NEONATE BIRTHWT 750-999G W/O MAJOR PROCEDURE,15,NEWBORNS AND OTHER NEONATES WITH CONDITIONS ORIGINATING IN THE PERINATAL PERIOD,4,Extreme,Moderate,Medical,Medicaid,,,00700,,false,193799,63431.43
New York City,Manhattan,7002054,001464,New York-Presbyterian Hospital - Columbia Presbyterian Center,0 to 17,OOS,M,White,Not Span/Hispanic,51,Newborn,Short-term Hospital,2018,PNL001,LIVEBORN,ESA003,MECHANICAL VENTILATION,593,NEONATE BIRTHWT 750-999G W/O MAJOR PROCEDURE,15,NEWBORNS AND OTHER NEONATES WITH CONDITIONS ORIGINATING IN THE PERINATAL PERIOD,4,Extreme,Major,Medical,Private Health Insurance,Self-Pay,,00900,,false,1140099.23,235129.88
Western NY,Erie,1401014,000208,John R. Oishei Children's Hospital,0 to 17,142,M,Black/African American,Not Span/Hispanic,100,Newborn,Home w/ Home Health Services,2018,PNL001,LIVEBORN,RES007,AIRWAY INTUBATION,593,NEONATE BIRTHWT 750-999G W/O MAJOR PROCEDURE,15,NEWBORNS AND OTHER NEONATES WITH CONDITIONS ORIGINATING IN THE PERINATAL PERIOD,4,Extreme,Major,Medical,Private Health Insurance,Self-Pay,,00700,,false,892575.26,222744.95
Western NY,Erie,1401014,000208,John R. Oishei Children's Hospital,0 to 17,147,F,White,Not Span/Hispanic,71,Newborn,Home w/ Home Health Services,2018,PNL001,LIVEBORN,RES007,AIRWAY INTUBATION,593,NEONATE BIRTHWT 750-999G W/O MAJOR PROCEDURE,15,NEWBORNS AND OTHER NEONATES WITH CONDITIONS ORIGINATING IN THE PERINATAL PERIOD,3,Major,Moderate,Medical,Medicaid,Self-Pay,,00800,,false,558270.52,134646.4
New York City,Manhattan,7002024,001456,Mount Sinai Hospital,0 to 17,115,M,Black/African American,Not Span/Hispanic,109,Newborn,Home or Self Care,2018,PNL001,LIVEBORN,ESA003,MECHANICAL VENTILATION,593,NEONATE BIRTHWT 750-999G W/O MAJOR PROCEDURE,15,NEWBORNS AND OTHER NEONATES WITH CONDITIONS ORIGINATING IN THE PERINATAL PERIOD,4,Extreme,Major,Medical,Private Health Insurance,Self-Pay,,00700,,false,1707577.49,320296.74
New York City,Bronx,7000001,001178,BronxCare Hospital Center,0 to 17,104,F,Black/African American,Not Span/Hispanic,72,Elective,Home or Self Care,2018,PNL001,LIVEBORN,CNS002,LUMBAR PUNCTURE,593,NEONATE BIRTHWT 750-999G W/O MAJOR PROCEDURE,15,NEWBORNS AND OTHER NEONATES WITH CONDITIONS ORIGINATING IN THE PERINATAL PERIOD,3,Major,Major,Medical,Medicaid,,,00900,,false,226485.99,317915.74
New York City,Kings,7001020,001305,Maimonides Medical Center,0 to 17,112,F,Black/African American,Not Span/Hispanic,86,Newborn,Home or Self Care,2018,PNL001,LIVEBORN,EST003,ULTRAVIOLET LIGHT THERAPY,593,NEONATE BIRTHWT 750-999G W/O MAJOR PROCEDURE,15,NEWBORNS AND OTHER NEONATES WITH CONDITIONS ORIGINATING IN THE PERINATAL PERIOD,3,Major,Minor,Medical,Medicaid,Self-Pay,,00900,,false,965493.01,135165.03
New York City,Queens,7003004,003376,Cohen Children's Medical Center,0 to 17,113,M,Other Race,Spanish/Hispanic,69,Newborn,Home w/ Home Health Services,2018,PNL001,LIVEBORN,CAR024,VENOUS AND ARTERIAL CATHETER PLACEMENT,593,NEONATE BIRTHWT 750-999G W/O MAJOR PROCEDURE,15,NEWBORNS AND OTHER NEONATES WITH CONDITIONS ORIGINATING IN THE PERINATAL PERIOD,3,Major,Moderate,Medical,Medicaid,Medicaid,Self-Pay,00900,,false,1048086.04,200200.4
New York City,Queens,7003004,003376,Cohen Children's Medical Center,0 to 17,114,F,Other Race,Not Span/Hispanic,57,Newborn,Home or Self Care,2018,PNL001,LIVEBORN,RES007,AIRWAY INTUBATION,593,NEONATE BIRTHWT 750-999G W/O MAJOR PROCEDURE,15,NEWBORNS AND OTHER NEONATES WITH CONDITIONS ORIGINATING IN THE PERINATAL PERIOD,2,Moderate,Moderate,Medical,Private Health Insurance,Medicaid,Self-Pay,00700,,false,898316.41,174734.49
New York City,Kings,7001021,001306,New York - Presbyterian Brooklyn Methodist Hospital,0 to 17,112,F,Black/African American,Not Span/Hispanic,57,Emergency,Home or Self Care,2018,PNL001,LIVEBORN,EST002,PHOTOTHERAPY,593,NEONATE BIRTHWT 750-999G W/O MAJOR PROCEDURE,15,NEWBORNS AND OTHER NEONATES WITH CONDITIONS ORIGINATING IN THE PERINATAL PERIOD,4,Extreme,Moderate,Medical,Medicaid,Self-Pay,,00800,,false,590533.25,137350.37
Central NY,Onondaga,3301008,000636,Crouse Hospital,0 to 17,132,M,Black/African American,Not Span/Hispanic,60,Newborn,Home w/ Home Health Services,2018,PNL001,LIVEBORN,ESA004,NON-INVASIVE VENTILATION,593,NEONATE BIRTHWT 750-999G W/O MAJOR PROCEDURE,15,NEWBORNS AND OTHER NEONATES WITH CONDITIONS ORIGINATING IN THE PERINATAL PERIOD,3,Major,Minor,Medical,Blue Cross/Blue Shield,,,00900,,false,179953.12,87014.55
Long Island,Nassau,2908000,000511,NYU Langone Hospital-Long Island,0 to 17,117,F,White,Not Span/Hispanic,120 +,Newborn,Home w/ Home Health Services,2018,PNL001,LIVEBORN,ESA003,MECHANICAL VENTILATION,593,NEONATE BIRTHWT 750-999G W/O MAJOR PROCEDURE,15,NEWBORNS AND OTHER NEONATES WITH CONDITIONS ORIGINATING IN THE PERINATAL PERIOD,4,Extreme,Moderate,Medical,Private Health Insurance,,,00900,,false,1792430.54,249944.86
New York City,Manhattan,7002032,001466,Mount Sinai West,0 to 17,103,F,Other Race,Not Span/Hispanic,69,Newborn,Home w/ Home Health Services,2018,PNL001,LIVEBORN,ESA003,MECHANICAL VENTILATION,593,NEONATE BIRTHWT 750-999G W/O MAJOR PROCEDURE,15,NEWBORNS AND OTHER NEONATES WITH CONDITIONS ORIGINATING IN THE PERINATAL PERIOD,4,Extreme,Minor,Medical,Medicaid,Medicaid,Self-Pay,00800,,false,1071502.07,295458.26
New York City,Kings,7001003,001288,Brooklyn Hospital Center - Downtown Campus,0 to 17,113,M,Other Race,Unknown,95,Newborn,Home or Self Care,2018,PNL001,LIVEBORN,ESA004,NON-INVASIVE VENTILATION,593,NEONATE BIRTHWT 750-999G W/O MAJOR PROCEDURE,15,NEWBORNS AND OTHER NEONATES WITH CONDITIONS ORIGINATING IN THE PERINATAL PERIOD,3,Major,Major,Medical,Medicaid,Medicaid,Self-Pay,00800,,false,1099198.7,123639.76
New York City,Kings,7001020,001305,Maimonides Medical Center,0 to 17,112,M,Other Race,Not Span/Hispanic,118,Newborn,Home or Self Care,2018,PNL001,LIVEBORN,ESA003,MECHANICAL VENTILATION,593,NEONATE BIRTHWT 750-999G W/O MAJOR PROCEDURE,15,NEWBORNS AND OTHER NEONATES WITH CONDITIONS ORIGINATING IN THE PERINATAL PERIOD,4,Extreme,Major,Medical,Medicaid,Medicaid,Self-Pay,00800,,false,1541685.52,230989.45
New York City,Queens,7003004,003376,Cohen Children's Medical Center,0 to 17,114,M,Other Race,Not Span/Hispanic,32,Newborn,Home or Self Care,2018,PNL001,LIVEBORN,RES007,AIRWAY INTUBATION,593,NEONATE BIRTHWT 750-999G W/O MAJOR PROCEDURE,15,NEWBORNS AND OTHER NEONATES WITH CONDITIONS ORIGINATING IN THE PERINATAL PERIOD,4,Extreme,Moderate,Medical,Medicaid,Self-Pay,,00800,,false,481360.24,91564.93
New York City,Richmond,7004003,001740,Staten Island University Hosp-North,0 to 17,103,F,Black/African American,Not Span/Hispanic,83,Newborn,Home w/ Home Health Services,2018,PNL001,LIVEBORN,CAR029,"CARDIOVASCULAR DEVICE PROCEDURES, NEC",593,NEONATE BIRTHWT 750-999G W/O MAJOR PROCEDURE,15,NEWBORNS AND OTHER NEONATES WITH CONDITIONS ORIGINATING IN THE PERINATAL PERIOD,4,Extreme,Major,Medical,Medicaid,,,00700,,false,496148.11,256118.16
New York City,Queens,7003007,001633,Queens Hospital Center,0 to 17,114,M,Other Race,Not Span/Hispanic,1,Newborn,Expired,2018,PNL001,LIVEBORN,ESA003,MECHANICAL VENTILATION,593,NEONATE BIRTHWT 750-999G W/O MAJOR PROCEDURE,15,NEWBORNS AND OTHER NEONATES WITH CONDITIONS ORIGINATING IN THE PERINATAL PERIOD,2,Moderate,Minor,Medical,Medicaid,Medicaid,,00900,,false,7085.38,3783.37
New York City,Manhattan,7002053,001463,NYU Langone Hospitals,0 to 17,111,F,Other Race,Unknown,78,Newborn,Home or Self Care,2018,PNL001,LIVEBORN,RES007,AIRWAY INTUBATION,593,NEONATE BIRTHWT 750-999G W/O MAJOR PROCEDURE,15,NEWBORNS AND OTHER NEONATES WITH CONDITIONS ORIGINATING IN THE PERINATAL PERIOD,3,Major,Moderate,Medical,Private Health Insurance,,,00700,,false,1059172.26,441209.86
New York City,Kings,7001035,001318,Wyckoff Heights Medical Center,0 to 17,112,M,Other Race,Not Span/Hispanic,102,Newborn,Home or Self Care,2018,PNL001,LIVEBORN,CAR024,VENOUS AND ARTERIAL CATHETER PLACEMENT,593,NEONATE BIRTHWT 750-999G W/O MAJOR PROCEDURE,15,NEWBORNS AND OTHER NEONATES WITH CONDITIONS ORIGINATING IN THE PERINATAL PERIOD,4,Extreme,Extreme,Medical,Medicaid,,,00800,,false,405092.35,143157.12
New York City,Kings,7001035,001318,Wyckoff Heights Medical Center,0 to 17,112,F,Other Race,Not Span/Hispanic,77,Newborn,Home or Self Care,2018,PNL001,LIVEBORN,ESA004,NON-INVASIVE VENTILATION,593,NEONATE BIRTHWT 750-999G W/O MAJOR PROCEDURE,15,NEWBORNS AND OTHER NEONATES WITH CONDITIONS ORIGINATING IN THE PERINATAL PERIOD,2,Moderate,Moderate,Medical,Medicaid,Miscellaneous/Other,,00900,,false,306192.66,109483.18
New York City,Bronx,7000002,001165,Jacobi Medical Center,0 to 17,,F,Other Race,Spanish/Hispanic,64,Urgent,Home w/ Home Health Services,2018,PNL001,LIVEBORN,CAR024,VENOUS AND ARTERIAL CATHETER PLACEMENT,593,NEONATE BIRTHWT 750-999G W/O MAJOR PROCEDURE,15,NEWBORNS AND OTHER NEONATES WITH CONDITIONS ORIGINATING IN THE PERINATAL PERIOD,3,Major,Major,Medical,Medicaid,Medicaid,Medicaid,00700,,false,381065.15,225457.2
New York City,Queens,7003000,001626,Elmhurst Hospital Center,0 to 17,104,M,Other Race,Unknown,71,Newborn,Home w/ Home Health Services,2018,PNL001,LIVEBORN,ADM010,VACCINATIONS,593,NEONATE BIRTHWT 750-999G W/O MAJOR PROCEDURE,15,NEWBORNS AND OTHER NEONATES WITH CONDITIONS ORIGINATING IN THE PERINATAL PERIOD,2,Moderate,Moderate,Medical,Medicaid,Medicaid,,00800,,false,406795.08,242029.24
New York City,Kings,7001037,001320,University Hospital of Brooklyn,0 to 17,111,F,Black/African American,Not Span/Hispanic,106,Urgent,Home or Self Care,2018,PNL005,RESPIRATORY DISTRESS SYNDROME,ESA003,MECHANICAL VENTILATION,593,NEONATE BIRTHWT 750-999G W/O MAJOR PROCEDURE,15,NEWBORNS AND OTHER NEONATES WITH CONDITIONS ORIGINATING IN THE PERINATAL PERIOD,4,Extreme,Major,Medical,Blue Cross/Blue Shield,Medicaid,Self-Pay,00800,,false,754233,490910.67
Capital/Adirond,Albany,0101000,000001,Albany Medical Center Hospital,0 to 17,123,M,White,Unknown,1,Urgent,Expired,2018,PNL006,RESPIRATORY PERINATAL CONDITION,ESA003,MECHANICAL VENTILATION,593,NEONATE BIRTHWT 750-999G W/O MAJOR PROCEDURE,15,NEWBORNS AND OTHER NEONATES WITH CONDITIONS ORIGINATING IN THE PERINATAL PERIOD,4,Extreme,Major,Medical,"Managed Care, Unspecified",,,00700,,false,18542.58,5391.56
New York City,Kings,7001037,001320,University Hospital of Brooklyn,0 to 17,112,F,Black/African American,Not Span/Hispanic,120 +,Newborn,Home w/ Home Health Services,2018,PNL001,LIVEBORN,ESA003,MECHANICAL VENTILATION,593,NEONATE BIRTHWT 750-999G W/O MAJOR PROCEDURE,15,NEWBORNS AND OTHER NEONATES WITH CONDITIONS ORIGINATING IN THE PERINATAL PERIOD,4,Extreme,Major,Medical,Medicaid,Medicaid,Self-Pay,00700,,false,893121,627010.92
New York City,Bronx,7000006,003058,Montefiore Med Center - Jack D Weiler Hosp of A Einstein College Div,0 to 17,104,F,Black/African American,Not Span/Hispanic,120 +,Emergency,Inpatient Rehabilitation Facility,2018,PNL001,LIVEBORN,ESA003,MECHANICAL VENTILATION,593,NEONATE BIRTHWT 750-999G W/O MAJOR PROCEDURE,15,NEWBORNS AND OTHER NEONATES WITH CONDITIONS ORIGINATING IN THE PERINATAL PERIOD,4,Extreme,Major,Medical,Medicaid,,,00900,,true,2386321.68,296335.88
Central NY,Onondaga,3301008,000636,Crouse Hospital,0 to 17,136,F,White,Not Span/Hispanic,46,Newborn,Short-term Hospital,2018,PNL001,LIVEBORN,CAR024,VENOUS AND ARTERIAL CATHETER PLACEMENT,593,NEONATE BIRTHWT 750-999G W/O MAJOR PROCEDURE,15,NEWBORNS AND OTHER NEONATES WITH CONDITIONS ORIGINATING IN THE PERINATAL PERIOD,2,Moderate,Minor,Medical,Medicaid,,,00800,,false,149342.24,72460.38
New York City,Manhattan,7002054,001458,New York-Presbyterian Hospital - New York Weill Cornell Center,0 to 17,113,M,Other Race,Not Span/Hispanic,112,Newborn,Home w/ Home Health Services,2018,PNL001,LIVEBORN,CAR010,LIGATION AND EMBOLIZATION OF VESSELS,593,NEONATE BIRTHWT 750-999G W/O MAJOR PROCEDURE,15,NEWBORNS AND OTHER NEONATES WITH CONDITIONS ORIGINATING IN THE PERINATAL PERIOD,4,Extreme,Major,Medical,"Managed Care, Unspecified",Medicaid,Self-Pay,00900,,false,2497376.38,532659.85
Capital/Adirond,Albany,0101000,000001,Albany Medical Center Hospital,0 to 17,123,M,White,Not Span/Hispanic,91,Newborn,Home or Self Care,2018,PNL001,LIVEBORN,RES007,AIRWAY INTUBATION,593,NEONATE BIRTHWT 750-999G W/O MAJOR PROCEDURE,15,NEWBORNS AND OTHER NEONATES WITH CONDITIONS ORIGINATING IN THE PERINATAL PERIOD,4,Extreme,Major,Medical,"Managed Care, Unspecified",,,00900,,false,837695.5,218333.41
New York City,Bronx,7000006,003058,Montefiore Med Center - Jack D Weiler Hosp of A Einstein College Div,0 to 17,104,F,Other Race,Unknown,120 +,Newborn,Home w/ Home Health Services,2018,PNL001,LIVEBORN,ESA004,NON-INVASIVE VENTILATION,593,NEONATE BIRTHWT 750-999G W/O MAJOR PROCEDURE,15,NEWBORNS AND OTHER NEONATES WITH CONDITIONS ORIGINATING IN THE PERINATAL PERIOD,4,Extreme,Major,Medical,Blue Cross/Blue Shield,,,00800,,false,2004561.46,249487.08
Central NY,Onondaga,3301008,000636,Crouse Hospital,0 to 17,130,M,Other Race,Not Span/Hispanic,61,Newborn,Home w/ Home Health Services,2018,PNL001,LIVEBORN,ESA004,NON-INVASIVE VENTILATION,593,NEONATE BIRTHWT 750-999G W/O MAJOR PROCEDURE,15,NEWBORNS AND OTHER NEONATES WITH CONDITIONS ORIGINATING IN THE PERINATAL PERIOD,3,Major,Minor,Medical,Blue Cross/Blue Shield,Medicaid,,00900,,false,183793.17,88859.6
New York City,Manhattan,7002054,001458,New York-Presbyterian Hospital - New York Weill Cornell Center,0 to 17,104,M,Other Race,Not Span/Hispanic,74,Newborn,Home or Self Care,2018,PNL001,LIVEBORN,GNR003,INGUINAL AND FEMORAL HERNIA REPAIR,593,NEONATE BIRTHWT 750-999G W/O MAJOR PROCEDURE,15,NEWBORNS AND OTHER NEONATES WITH CONDITIONS ORIGINATING IN THE PERINATAL PERIOD,4,Extreme,Moderate,Medical,Medicaid,Self-Pay,,00800,,false,1511113.75,309728
New York City,Bronx,7000006,003058,Montefiore Med Center - Jack D Weiler Hosp of A Einstein College Div,0 to 17,104,F,Other Race,Unknown,86,Newborn,Home or Self Care,2018,PNL001,LIVEBORN,ESA003,MECHANICAL VENTILATION,593,NEONATE BIRTHWT 750-999G W/O MAJOR PROCEDURE,15,NEWBORNS AND OTHER NEONATES WITH CONDITIONS ORIGINATING IN THE PERINATAL PERIOD,4,Extreme,Major,Medical,Medicaid,,,00800,,false,1526664.75,190928
New York City,Kings,7001020,001305,Maimonides Medical Center,0 to 17,112,M,Black/African American,Not Span/Hispanic,55,Newborn,Home or Self Care,2018,PNL001,LIVEBORN,ADM017,ADMINISTRATION OF NUTRITIONAL AND ELECTROLYTIC SUBSTANCES,593,NEONATE BIRTHWT 750-999G W/O MAJOR PROCEDURE,15,NEWBORNS AND OTHER NEONATES WITH CONDITIONS ORIGINATING IN THE PERINATAL PERIOD,2,Moderate,Minor,Medical,Blue Cross/Blue Shield,Self-Pay,,00900,,false,616953.02,86662.04
New York City,Manhattan,7002053,001463,NYU Langone Hospitals,0 to 17,113,M,White,Spanish/Hispanic,106,Newborn,Home or Self Care,2018,PNL001,LIVEBORN,RES007,AIRWAY INTUBATION,593,NEONATE BIRTHWT 750-999G W/O MAJOR PROCEDURE,15,NEWBORNS AND OTHER NEONATES WITH CONDITIONS ORIGINATING IN THE PERINATAL PERIOD,4,Extreme,Major,Medical,Medicaid,,,00800,,false,1456918.36,581615.18
Central NY,Onondaga,3301008,000636,Crouse Hospital,0 to 17,136,M,White,Not Span/Hispanic,55,Newborn,Short-term Hospital,2018,PNL001,LIVEBORN,ESA004,NON-INVASIVE VENTILATION,593,NEONATE BIRTHWT 750-999G W/O MAJOR PROCEDURE,15,NEWBORNS AND OTHER NEONATES WITH CONDITIONS ORIGINATING IN THE PERINATAL PERIOD,4,Extreme,Major,Medical,"Managed Care, Unspecified",,,00800,,false,188370.73,90156.66
Capital/Adirond,Albany,0101000,000001,Albany Medical Center Hospital,0 to 17,120,M,White,Not Span/Hispanic,54,Newborn,Home or Self Care,2018,PNL001,LIVEBORN,ADM017,ADMINISTRATION OF NUTRITIONAL AND ELECTROLYTIC SUBSTANCES,593,NEONATE BIRTHWT 750-999G W/O MAJOR PROCEDURE,15,NEWBORNS AND OTHER NEONATES WITH CONDITIONS ORIGINATING IN THE PERINATAL PERIOD,4,Extreme,Moderate,Medical,Private Health Insurance,,,00800,,false,479762.99,124879.88
Long Island,Nassau,2908000,000511,NYU Langone Hospital-Long Island,0 to 17,115,M,White,Spanish/Hispanic,80,Newborn,Home w/ Home Health Services,2018,PNL001,LIVEBORN,MRS001,CIRCUMCISION,593,NEONATE BIRTHWT 750-999G W/O MAJOR PROCEDURE,15,NEWBORNS AND OTHER NEONATES WITH CONDITIONS ORIGINATING IN THE PERINATAL PERIOD,3,Major,Moderate,Medical,Medicaid,Medicaid,,00900,,false,1171338.57,167757.56
New York City,Kings,7001021,001306,New York - Presbyterian Brooklyn Methodist Hospital,0 to 17,113,M,White,Not Span/Hispanic,58,Newborn,Home or Self Care,2018,PNL001,LIVEBORN,ESA004,NON-INVASIVE VENTILATION,593,NEONATE BIRTHWT 750-999G W/O MAJOR PROCEDURE,15,NEWBORNS AND OTHER NEONATES WITH CONDITIONS ORIGINATING IN THE PERINATAL PERIOD,3,Major,Minor,Medical,"Managed Care, Unspecified",Medicaid,Self-Pay,00900,,false,631562.34,148618.25
New York City,Kings,7001020,001305,Maimonides Medical Center,0 to 17,112,F,Other Race,Not Span/Hispanic,2,Newborn,Expired,2018,PNL001,LIVEBORN,ESA004,NON-INVASIVE VENTILATION,593,NEONATE BIRTHWT 750-999G W/O MAJOR PROCEDURE,15,NEWBORNS AND OTHER NEONATES WITH CONDITIONS ORIGINATING IN THE PERINATAL PERIOD,4,Extreme,Extreme,Medical,Medicaid,Medicaid,Self-Pay,00800,,false,48181.07,11345.68
New York City,Queens,7003004,003376,Cohen Children's Medical Center,0 to 17,113,M,Other Race,Spanish/Hispanic,70,Newborn,Home w/ Home Health Services,2018,PNL001,LIVEBORN,CAR010,LIGATION AND EMBOLIZATION OF VESSELS,593,NEONATE BIRTHWT 750-999G W/O MAJOR PROCEDURE,15,NEWBORNS AND OTHER NEONATES WITH CONDITIONS ORIGINATING IN THE PERINATAL PERIOD,4,Extreme,Major,Medical,Private Health Insurance,Medicaid,Self-Pay,00900,,false,1085807.25,206691.08
Capital/Adirond,Albany,0101000,000001,Albany Medical Center Hospital,0 to 17,120,M,Other Race,Unknown,95,Newborn,Home or Self Care,2018,PNL001,LIVEBORN,ESA003,MECHANICAL VENTILATION,593,NEONATE BIRTHWT 750-999G W/O MAJOR PROCEDURE,15,NEWBORNS AND OTHER NEONATES WITH CONDITIONS ORIGINATING IN THE PERINATAL PERIOD,4,Extreme,Moderate,Medical,Medicaid,,,00900,,false,859562.57,224475.13
Capital/Adirond,Albany,0101000,000001,Albany Medical Center Hospital,0 to 17,120,F,Other Race,Spanish/Hispanic,49,Newborn,Home or Self Care,2018,PNL001,LIVEBORN,RES007,AIRWAY INTUBATION,593,NEONATE BIRTHWT 750-999G W/O MAJOR PROCEDURE,15,NEWBORNS AND OTHER NEONATES WITH CONDITIONS ORIGINATING IN THE PERINATAL PERIOD,2,Moderate,Minor,Medical,Medicaid,,,00800,,false,442258.3,129506.56
New York City,Queens,7003000,001626,Elmhurst Hospital Center,0 to 17,113,M,Other Race,Spanish/Hispanic,41,Newborn,Home or Self Care,2018,PNL001,LIVEBORN,ADM017,ADMINISTRATION OF NUTRITIONAL AND ELECTROLYTIC SUBSTANCES,593,NEONATE BIRTHWT 750-999G W/O MAJOR PROCEDURE,15,NEWBORNS AND OTHER NEONATES WITH CONDITIONS ORIGINATING IN THE PERINATAL PERIOD,3,Major,Moderate,Medical,Medicaid,Medicaid,,00800,,false,94874.08,56446.85
New York City,Queens,7003004,003376,Cohen Children's Medical Center,0 to 17,113,F,Other Race,Not Span/Hispanic,1,Newborn,Expired,2018,PNL001,LIVEBORN,RES007,AIRWAY INTUBATION,593,NEONATE BIRTHWT 750-999G W/O MAJOR PROCEDURE,15,NEWBORNS AND OTHER NEONATES WITH CONDITIONS ORIGINATING IN THE PERINATAL PERIOD,4,Extreme,Major,Medical,Medicaid,Medicaid,Self-Pay,00700,,false,19016.34,3550.72
Long Island,Nassau,2908000,000511,NYU Langone Hospital-Long Island,0 to 17,115,M,Black/African American,Not Span/Hispanic,101,Newborn,Home w/ Home Health Services,2018,PNL001,LIVEBORN,RES007,AIRWAY INTUBATION,593,NEONATE BIRTHWT 750-999G W/O MAJOR PROCEDURE,15,NEWBORNS AND OTHER NEONATES WITH CONDITIONS ORIGINATING IN THE PERINATAL PERIOD,4,Extreme,Moderate,Medical,Private Health Insurance,,,00800,,false,1519083.23,214951.57
New York City,Manhattan,7002053,001463,NYU Langone Hospitals,0 to 17,117,F,White,Not Span/Hispanic,81,Newborn,Home or Self Care,2018,PNL001,LIVEBORN,ESA003,MECHANICAL VENTILATION,593,NEONATE BIRTHWT 750-999G W/O MAJOR PROCEDURE,15,NEWBORNS AND OTHER NEONATES WITH CONDITIONS ORIGINATING IN THE PERINATAL PERIOD,4,Extreme,Major,Medical,Private Health Insurance,,,00800,,false,1032312.17,427478.88
New York City,Queens,7003004,003376,Cohen Children's Medical Center,0 to 17,113,F,Other Race,Spanish/Hispanic,67,Newborn,Home or Self Care,2018,PNL001,LIVEBORN,CAR024,VENOUS AND ARTERIAL CATHETER PLACEMENT,593,NEONATE BIRTHWT 750-999G W/O MAJOR PROCEDURE,15,NEWBORNS AND OTHER NEONATES WITH CONDITIONS ORIGINATING IN THE PERINATAL PERIOD,3,Major,Major,Medical,Medicaid,Medicaid,Self-Pay,00700,,false,1028072.81,196621.51