Hospital Service Area,Hospital County,Operating Certificate Number,Permanent Facility Id,Facility Name,Age Group,Zip Code - 3 digits,Gender,Race,Ethnicity,Length of Stay,Type of Admission,Patient Disposition,Discharge Year,CCS Diagnosis Code,CCS Diagnosis Description,CCS Procedure Code,CCS Procedure Description,APR DRG Code,APR DRG Description,APR MDC Code,APR MDC Description,APR Severity of Illness Code,APR Severity of Illness Description,APR Risk of Mortality,APR Medical Surgical Description,Payment Typology 1,Payment Typology 2,Payment Typology 3,Birth Weight,Abortion Edit Indicator,Emergency Department Indicator,Total Charges,Total Costs
New York City,Manhattan,7002053,001463,NYU Langone Hospitals,0 to 17,,F,Other Race,Spanish/Hispanic,120 +,Emergency,Home w/ Home Health Services,2020,PNL012,NEONATAL DIGESTIVE AND FEEDING DISORDERS,ESA003,MECHANICAL VENTILATION,593,NEONATE BIRTHWT 750-999G W/O MAJOR PROCEDURE,15,NEWBORNS AND OTHER NEONATES WITH CONDITIONS ORIGINATING IN THE PERINATAL PERIOD,4,Extreme,Extreme,Medical,Medicaid,,,00700,,N,2839546.85,841491.14
New York City,Manhattan,7002053,001463,NYU Langone Hospitals,0 to 17,,M,Black/African American,Unknown,120 +,Newborn,Home or Self Care,2020,PNL001,LIVEBORN,RES007,AIRWAY INTUBATION,593,NEONATE BIRTHWT 750-999G W/O MAJOR PROCEDURE,15,NEWBORNS AND OTHER NEONATES WITH CONDITIONS ORIGINATING IN THE PERINATAL PERIOD,2,Moderate,Moderate,Medical,Blue Cross/Blue Shield,,,00800,,N,1859152.21,570940.48
New York City,Manhattan,7002053,001463,NYU Langone Hospitals,0 to 17,112,M,White,Unknown,120 +,Newborn,Home w/ Home Health Services,2020,PNL001,LIVEBORN,RES007,AIRWAY INTUBATION,593,NEONATE BIRTHWT 750-999G W/O MAJOR PROCEDURE,15,NEWBORNS AND OTHER NEONATES WITH CONDITIONS ORIGINATING IN THE PERINATAL PERIOD,4,Extreme,Moderate,Medical,Medicaid,,,00800,,N,2160599.86,702432.23
New York City,Manhattan,7002053,001463,NYU Langone Hospitals,0 to 17,112,M,White,Unknown,114,Newborn,Home w/ Home Health Services,2020,PNL001,LIVEBORN,ESA004,NON-INVASIVE VENTILATION,593,NEONATE BIRTHWT 750-999G W/O MAJOR PROCEDURE,15,NEWBORNS AND OTHER NEONATES WITH CONDITIONS ORIGINATING IN THE PERINATAL PERIOD,4,Extreme,Major,Medical,Medicaid,,,00700,,N,1726691.6,531773.23
New York City,Manhattan,7002053,001463,NYU Langone Hospitals,0 to 17,104,F,Multi-racial,Unknown,85,Newborn,Home or Self Care,2020,PNL001,LIVEBORN,CAR024,VENOUS AND ARTERIAL CATHETER PLACEMENT,593,NEONATE BIRTHWT 750-999G W/O MAJOR PROCEDURE,15,NEWBORNS AND OTHER NEONATES WITH CONDITIONS ORIGINATING IN THE PERINATAL PERIOD,3,Major,Moderate,Medical,Private Health Insurance,,,00900,,N,1154458.52,378679.47
New York City,Manhattan,7002053,001463,NYU Langone Hospitals,0 to 17,112,M,Other Race,Not Span/Hispanic,120 +,Newborn,Home or Self Care,2020,PNL001,LIVEBORN,RES007,AIRWAY INTUBATION,593,NEONATE BIRTHWT 750-999G W/O MAJOR PROCEDURE,15,NEWBORNS AND OTHER NEONATES WITH CONDITIONS ORIGINATING IN THE PERINATAL PERIOD,4,Extreme,Moderate,Medical,Private Health Insurance,Private Health Insurance,,00800,,N,1740241.56,564632.31
New York City,Manhattan,7002053,001463,NYU Langone Hospitals,0 to 17,100,F,Other Race,Unknown,98,Newborn,Home or Self Care,2020,PNL001,LIVEBORN,CNS002,LUMBAR PUNCTURE,593,NEONATE BIRTHWT 750-999G W/O MAJOR PROCEDURE,15,NEWBORNS AND OTHER NEONATES WITH CONDITIONS ORIGINATING IN THE PERINATAL PERIOD,2,Moderate,Major,Medical,Medicaid,,,00900,,N,1330377.15,430878.03
New York City,Manhattan,7002053,001463,NYU Langone Hospitals,0 to 17,112,M,Black/African American,Not Span/Hispanic,120 +,Newborn,Home or Self Care,2020,PNL001,LIVEBORN,CAR024,VENOUS AND ARTERIAL CATHETER PLACEMENT,593,NEONATE BIRTHWT 750-999G W/O MAJOR PROCEDURE,15,NEWBORNS AND OTHER NEONATES WITH CONDITIONS ORIGINATING IN THE PERINATAL PERIOD,3,Major,Major,Medical,Blue Cross/Blue Shield,Medicaid,,00800,,N,1917441.92,613411.98
New York City,Manhattan,7002053,001463,NYU Langone Hospitals,0 to 17,112,F,Other Race,Not Span/Hispanic,38,Newborn,Home or Self Care,2020,PNL001,LIVEBORN,CAR024,VENOUS AND ARTERIAL CATHETER PLACEMENT,593,NEONATE BIRTHWT 750-999G W/O MAJOR PROCEDURE,15,NEWBORNS AND OTHER NEONATES WITH CONDITIONS ORIGINATING IN THE PERINATAL PERIOD,2,Moderate,Moderate,Medical,Self-Pay,,,00900,,N,489208.56,166158.02
New York City,Manhattan,7002053,001463,NYU Langone Hospitals,0 to 17,112,F,Other Race,Not Span/Hispanic,96,Newborn,Skilled Nursing Home,2020,PNL001,LIVEBORN,CNS002,LUMBAR PUNCTURE,593,NEONATE BIRTHWT 750-999G W/O MAJOR PROCEDURE,15,NEWBORNS AND OTHER NEONATES WITH CONDITIONS ORIGINATING IN THE PERINATAL PERIOD,2,Moderate,Moderate,Medical,Medicaid,,,00900,,N,1488912.83,493916.1
New York City,Manhattan,7002053,001463,NYU Langone Hospitals,0 to 17,100,M,White,Not Span/Hispanic,120 +,Newborn,Home or Self Care,2020,PNL001,LIVEBORN,RES007,AIRWAY INTUBATION,593,NEONATE BIRTHWT 750-999G W/O MAJOR PROCEDURE,15,NEWBORNS AND OTHER NEONATES WITH CONDITIONS ORIGINATING IN THE PERINATAL PERIOD,3,Major,Major,Medical,Private Health Insurance,Medicaid,,00800,,N,1687240.72,558394.14
New York City,Manhattan,7002053,001463,NYU Langone Hospitals,0 to 17,112,M,Other Race,Spanish/Hispanic,120 +,Newborn,Home w/ Home Health Services,2020,PNL001,LIVEBORN,ESA003,MECHANICAL VENTILATION,593,NEONATE BIRTHWT 750-999G W/O MAJOR PROCEDURE,15,NEWBORNS AND OTHER NEONATES WITH CONDITIONS ORIGINATING IN THE PERINATAL PERIOD,3,Major,Minor,Medical,Medicaid,,,00800,,N,3427882.88,1019010.57
New York City,Manhattan,7002053,001463,NYU Langone Hospitals,0 to 17,OOS,F,White,Not Span/Hispanic,1,Newborn,Expired,2020,PNL001,LIVEBORN,ESA003,MECHANICAL VENTILATION,593,NEONATE BIRTHWT 750-999G W/O MAJOR PROCEDURE,15,NEWBORNS AND OTHER NEONATES WITH CONDITIONS ORIGINATING IN THE PERINATAL PERIOD,3,Major,Moderate,Medical,Private Health Insurance,,,00800,,N,61757.28,10304.77
New York City,Manhattan,7002053,001463,NYU Langone Hospitals,0 to 17,115,F,White,Unknown,1,Newborn,Expired,2020,PNL001,LIVEBORN,ESA003,MECHANICAL VENTILATION,593,NEONATE BIRTHWT 750-999G W/O MAJOR PROCEDURE,15,NEWBORNS AND OTHER NEONATES WITH CONDITIONS ORIGINATING IN THE PERINATAL PERIOD,3,Major,Extreme,Medical,Medicaid,,,00800,,N,24085.31,5153.46
