Hospital Service Area,Hospital County,Operating Certificate Number,Permanent Facility Id,Facility Name,Age Group,Zip Code - 3 digits,Gender,Race,Ethnicity,Length of Stay,Type of Admission,Patient Disposition,Discharge Year,CCS Diagnosis Code,CCS Diagnosis Description,CCS Procedure Code,CCS Procedure Description,APR DRG Code,APR DRG Description,APR MDC Code,APR MDC Description,APR Severity of Illness Code,APR Severity of Illness Description,APR Risk of Mortality,APR Medical Surgical Description,Payment Typology 1,Payment Typology 2,Payment Typology 3,Birth Weight,Abortion Edit Indicator,Emergency Department Indicator,Total Charges,Total Costs
New York City,Bronx,7000006,001169,Montefiore Medical Center - Henry & Lucy Moses Div,30 to 49,104,M,Other Race,Spanish/Hispanic,31,Emergency,Home w/ Home Health Services,2018,END003,DIABETES MELLITUS WITH COMPLICATION,HEP012,PANCREAS TRANSPLANT,006,PANCREAS TRANSPLANT,10,"ENDOCRINE, NUTRITIONAL AND METABOLIC DISEASES AND DISORDERS",3,Major,Major,Surgical,Medicaid,,,,,false,967315.25,179594.77
New York City,Manhattan,7002054,001464,New York-Presbyterian Hospital - Columbia Presbyterian Center,18 to 29,100,F,Multi-racial,Multi-ethnic,10,Urgent,Home or Self Care,2018,GEN003,CHRONIC KIDNEY DISEASE,URN011,KIDNEY TRANSPLANT,006,PANCREAS TRANSPLANT,11,DISEASES AND DISORDERS OF THE KIDNEY AND URINARY TRACT,3,Major,Moderate,Surgical,Medicaid,Medicaid,Self-Pay,,,false,507912.58,146245.23
New York City,Manhattan,7002054,001464,New York-Presbyterian Hospital - Columbia Presbyterian Center,30 to 49,104,M,Multi-racial,Spanish/Hispanic,32,Urgent,Home w/ Home Health Services,2018,END003,DIABETES MELLITUS WITH COMPLICATION,URN011,KIDNEY TRANSPLANT,006,PANCREAS TRANSPLANT,11,DISEASES AND DISORDERS OF THE KIDNEY AND URINARY TRACT,3,Major,Moderate,Surgical,Medicare,Medicaid,Self-Pay,,,false,723774.27,192662.01
New York City,Bronx,7000006,001169,Montefiore Medical Center - Henry & Lucy Moses Div,30 to 49,104,F,Other Race,Not Span/Hispanic,13,Emergency,Home w/ Home Health Services,2018,GEN003,CHRONIC KIDNEY DISEASE,HEP012,PANCREAS TRANSPLANT,006,PANCREAS TRANSPLANT,11,DISEASES AND DISORDERS OF THE KIDNEY AND URINARY TRACT,3,Major,Major,Surgical,Medicare,Medicaid,,,,false,567298.63,107312.18
New York City,Manhattan,7002054,001458,New York-Presbyterian Hospital - New York Weill Cornell Center,30 to 49,109,M,White,Not Span/Hispanic,4,Emergency,Home or Self Care,2018,END003,DIABETES MELLITUS WITH COMPLICATION,HEP012,PANCREAS TRANSPLANT,006,PANCREAS TRANSPLANT,10,"ENDOCRINE, NUTRITIONAL AND METABOLIC DISEASES AND DISORDERS",2,Moderate,Minor,Surgical,Blue Cross/Blue Shield,Self-Pay,,,,false,321433.38,89007.3
Western NY,Erie,1401005,000210,Erie County Medical Center,30 to 49,142,M,White,Not Span/Hispanic,8,Elective,Home w/ Home Health Services,2018,GEN003,CHRONIC KIDNEY DISEASE,HEP012,PANCREAS TRANSPLANT,006,PANCREAS TRANSPLANT,11,DISEASES AND DISORDERS OF THE KIDNEY AND URINARY TRACT,3,Major,Moderate,Surgical,Medicaid,Medicaid,,,,false,254732.85,230296.37
New York City,Bronx,7000006,001169,Montefiore Medical Center - Henry & Lucy Moses Div,30 to 49,104,F,Black/African American,Not Span/Hispanic,8,Emergency,Home w/ Home Health Services,2018,GEN003,CHRONIC KIDNEY DISEASE,URN011,KIDNEY TRANSPLANT,006,PANCREAS TRANSPLANT,11,DISEASES AND DISORDERS OF THE KIDNEY AND URINARY TRACT,3,Major,Moderate,Surgical,Medicare,Medicaid,,,,false,446801.9,87136.38
Central NY,Onondaga,3301007,000635,University Hospital SUNY Health Science Center,50 to 69,137,M,White,Not Span/Hispanic,6,Emergency,Home or Self Care,2018,END003,DIABETES MELLITUS WITH COMPLICATION,URN011,KIDNEY TRANSPLANT,006,PANCREAS TRANSPLANT,11,DISEASES AND DISORDERS OF THE KIDNEY AND URINARY TRACT,2,Moderate,Moderate,Surgical,Medicare,Medicaid,,,,false,341649.45,205192.44
New York City,Manhattan,7002054,001464,New York-Presbyterian Hospital - Columbia Presbyterian Center,50 to 69,117,F,Multi-racial,Not Span/Hispanic,29,Urgent,Inpatient Rehabilitation Facility,2018,END003,DIABETES MELLITUS WITH COMPLICATION,HEP012,PANCREAS TRANSPLANT,006,PANCREAS TRANSPLANT,11,DISEASES AND DISORDERS OF THE KIDNEY AND URINARY TRACT,4,Extreme,Extreme,Surgical,Medicare,Private Health Insurance,Self-Pay,,,false,954111,316483.05
Central NY,Onondaga,3301007,000635,University Hospital SUNY Health Science Center,30 to 49,137,F,White,Not Span/Hispanic,10,Emergency,Home or Self Care,2018,END003,DIABETES MELLITUS WITH COMPLICATION,URN011,KIDNEY TRANSPLANT,006,PANCREAS TRANSPLANT,11,DISEASES AND DISORDERS OF THE KIDNEY AND URINARY TRACT,2,Moderate,Minor,Surgical,Blue Cross/Blue Shield,Medicare,,,,false,394046.8,220961.21
Western NY,Erie,1401005,000210,Erie County Medical Center,30 to 49,140,M,White,Not Span/Hispanic,6,Urgent,Home w/ Home Health Services,2018,GEN003,CHRONIC KIDNEY DISEASE,HEP012,PANCREAS TRANSPLANT,006,PANCREAS TRANSPLANT,11,DISEASES AND DISORDERS OF THE KIDNEY AND URINARY TRACT,3,Major,Major,Surgical,Medicare,Medicaid,,,,false,251019.17,223690.16
Western NY,Erie,1401005,000210,Erie County Medical Center,18 to 29,142,F,Black/African American,Not Span/Hispanic,9,Elective,Home w/ Home Health Services,2018,GEN003,CHRONIC KIDNEY DISEASE,HEP012,PANCREAS TRANSPLANT,006,PANCREAS TRANSPLANT,11,DISEASES AND DISORDERS OF THE KIDNEY AND URINARY TRACT,2,Moderate,Moderate,Surgical,Medicaid,Medicaid,,,,false,267233.44,238005.58
New York City,Manhattan,7002054,001458,New York-Presbyterian Hospital - New York Weill Cornell Center,50 to 69,OOS,M,White,Not Span/Hispanic,7,Emergency,Home or Self Care,2018,END003,DIABETES MELLITUS WITH COMPLICATION,URN011,KIDNEY TRANSPLANT,006,PANCREAS TRANSPLANT,11,DISEASES AND DISORDERS OF THE KIDNEY AND URINARY TRACT,2,Moderate,Moderate,Surgical,Medicare,Private Health Insurance,Self-Pay,,,false,361446.66,98577.34
New York City,Manhattan,7002054,001458,New York-Presbyterian Hospital - New York Weill Cornell Center,30 to 49,100,M,Black/African American,Not Span/Hispanic,6,Emergency,Home or Self Care,2018,END003,DIABETES MELLITUS WITH COMPLICATION,URN011,KIDNEY TRANSPLANT,006,PANCREAS TRANSPLANT,11,DISEASES AND DISORDERS OF THE KIDNEY AND URINARY TRACT,3,Major,Major,Surgical,"Managed Care, Unspecified",Medicaid,Self-Pay,,,false,371530.73,111503.8
New York City,Manhattan,7002054,001458,New York-Presbyterian Hospital - New York Weill Cornell Center,50 to 69,100,M,Black/African American,Not Span/Hispanic,8,Emergency,Home or Self Care,2018,GEN003,CHRONIC KIDNEY DISEASE,URN011,KIDNEY TRANSPLANT,006,PANCREAS TRANSPLANT,11,DISEASES AND DISORDERS OF THE KIDNEY AND URINARY TRACT,3,Major,Moderate,Surgical,Medicare,Medicaid,Self-Pay,,,false,379770.53,102688.11
Western NY,Erie,1401005,000210,Erie County Medical Center,30 to 49,142,F,Black/African American,Not Span/Hispanic,6,Urgent,Home or Self Care,2018,END003,DIABETES MELLITUS WITH COMPLICATION,URN011,KIDNEY TRANSPLANT,006,PANCREAS TRANSPLANT,11,DISEASES AND DISORDERS OF THE KIDNEY AND URINARY TRACT,2,Moderate,Moderate,Surgical,Medicare,Medicaid,Self-Pay,,,false,242930.72,220166.61
New York City,Bronx,7000006,001169,Montefiore Medical Center - Henry & Lucy Moses Div,18 to 29,104,F,Other Race,Spanish/Hispanic,9,Emergency,Home w/ Home Health Services,2018,GEN003,CHRONIC KIDNEY DISEASE,HEP012,PANCREAS TRANSPLANT,006,PANCREAS TRANSPLANT,11,DISEASES AND DISORDERS OF THE KIDNEY AND URINARY TRACT,3,Major,Major,Surgical,Medicaid,,,,,false,474321.83,92397.78
New York City,Bronx,7000006,001169,Montefiore Medical Center - Henry & Lucy Moses Div,50 to 69,104,M,Other Race,Spanish/Hispanic,5,Emergency,Home or Self Care,2018,GEN003,CHRONIC KIDNEY DISEASE,URN011,KIDNEY TRANSPLANT,006,PANCREAS TRANSPLANT,11,DISEASES AND DISORDERS OF THE KIDNEY AND URINARY TRACT,3,Major,Major,Surgical,Medicare,Medicaid,,,,false,424180.39,76747.96
New York City,Bronx,7000006,001169,Montefiore Medical Center - Henry & Lucy Moses Div,18 to 29,104,F,Other Race,Spanish/Hispanic,7,Emergency,Home w/ Home Health Services,2018,GEN003,CHRONIC KIDNEY DISEASE,URN011,KIDNEY TRANSPLANT,006,PANCREAS TRANSPLANT,11,DISEASES AND DISORDERS OF THE KIDNEY AND URINARY TRACT,3,Major,Moderate,Surgical,Medicaid,,,,,false,447998.34,82857.4
New York City,Manhattan,7002054,001464,New York-Presbyterian Hospital - Columbia Presbyterian Center,30 to 49,100,M,Multi-racial,Not Span/Hispanic,38,Urgent,Home w/ Home Health Services,2018,END003,DIABETES MELLITUS WITH COMPLICATION,HEP012,PANCREAS TRANSPLANT,006,PANCREAS TRANSPLANT,11,DISEASES AND DISORDERS OF THE KIDNEY AND URINARY TRACT,4,Extreme,Extreme,Surgical,Medicare,Medicaid,Self-Pay,,,false,1039740.48,341526.64
New York City,Manhattan,7002024,001456,Mount Sinai Hospital,18 to 29,100,F,Other Race,Spanish/Hispanic,6,Urgent,Home w/ Home Health Services,2018,END003,DIABETES MELLITUS WITH COMPLICATION,HEP012,PANCREAS TRANSPLANT,006,PANCREAS TRANSPLANT,01,DISEASES AND DISORDERS OF THE NERVOUS SYSTEM,3,Major,Moderate,Surgical,Medicaid,Medicaid,Self-Pay,,,false,208713.38,63936.47
Finger Lakes,Monroe,2701005,000413,Strong Memorial Hospital,30 to 49,136,F,White,Not Span/Hispanic,84,Urgent,Skilled Nursing Home,2018,GEN003,CHRONIC KIDNEY DISEASE,URN011,KIDNEY TRANSPLANT,006,PANCREAS TRANSPLANT,11,DISEASES AND DISORDERS OF THE KIDNEY AND URINARY TRACT,4,Extreme,Extreme,Surgical,Blue Cross/Blue Shield,Medicare,,,,false,1036797.59,426657.93
New York City,Manhattan,7002054,001464,New York-Presbyterian Hospital - Columbia Presbyterian Center,30 to 49,112,M,Other Race,Spanish/Hispanic,10,Emergency,Home or Self Care,2018,END003,DIABETES MELLITUS WITH COMPLICATION,URN011,KIDNEY TRANSPLANT,006,PANCREAS TRANSPLANT,11,DISEASES AND DISORDERS OF THE KIDNEY AND URINARY TRACT,3,Major,Major,Surgical,Medicare,Medicaid,Self-Pay,,,false,500505.33,143690.13
New York City,Manhattan,7002054,001464,New York-Presbyterian Hospital - Columbia Presbyterian Center,50 to 69,OOS,F,White,Not Span/Hispanic,5,Elective,Home w/ Home Health Services,2018,END003,DIABETES MELLITUS WITH COMPLICATION,HEP012,PANCREAS TRANSPLANT,006,PANCREAS TRANSPLANT,11,DISEASES AND DISORDERS OF THE KIDNEY AND URINARY TRACT,2,Moderate,Major,Surgical,Blue Cross/Blue Shield,Medicare,Self-Pay,,,false,256383.08,67792.82
New York City,Bronx,7000006,001169,Montefiore Medical Center - Henry & Lucy Moses Div,30 to 49,OOS,M,Other Race,Unknown,4,Emergency,Home or Self Care,2018,DIG020,PANCREATIC DISORDERS (EXCLUDING DIABETES),HEP012,PANCREAS TRANSPLANT,006,PANCREAS TRANSPLANT,07,DISEASES AND DISORDERS OF THE HEPATOBILIARY SYSTEM AND PANCREAS,2,Moderate,Minor,Surgical,Private Health Insurance,,,,,false,292195.57,50524.24
New York City,Manhattan,7002024,001456,Mount Sinai Hospital,30 to 49,113,M,Other Race,Not Span/Hispanic,8,Urgent,Home w/ Home Health Services,2018,END003,DIABETES MELLITUS WITH COMPLICATION,URN011,KIDNEY TRANSPLANT,006,PANCREAS TRANSPLANT,11,DISEASES AND DISORDERS OF THE KIDNEY AND URINARY TRACT,3,Major,Moderate,Surgical,Medicare,Medicare,Medicaid,,,false,303641.63,93708.31
Capital/Adirond,Albany,0101000,000001,Albany Medical Center Hospital,30 to 49,123,M,Other Race,Not Span/Hispanic,10,Elective,Home or Self Care,2018,END003,DIABETES MELLITUS WITH COMPLICATION,URN011,KIDNEY TRANSPLANT,006,PANCREAS TRANSPLANT,11,DISEASES AND DISORDERS OF THE KIDNEY AND URINARY TRACT,3,Major,Major,Surgical,Medicare,Blue Cross/Blue Shield,,,,false,238213.41,116918.56
New York City,Manhattan,7002054,001464,New York-Presbyterian Hospital - Columbia Presbyterian Center,30 to 49,OOS,M,Other Race,Spanish/Hispanic,14,Urgent,Home or Self Care,2018,END003,DIABETES MELLITUS WITH COMPLICATION,HEP012,PANCREAS TRANSPLANT,006,PANCREAS TRANSPLANT,11,DISEASES AND DISORDERS OF THE KIDNEY AND URINARY TRACT,3,Major,Major,Surgical,Blue Cross/Blue Shield,Self-Pay,,,,false,510797.29,146954.53
Western NY,Erie,1401005,000210,Erie County Medical Center,30 to 49,141,M,White,Not Span/Hispanic,8,Elective,Home or Self Care,2018,GEN003,CHRONIC KIDNEY DISEASE,URN011,KIDNEY TRANSPLANT,006,PANCREAS TRANSPLANT,11,DISEASES AND DISORDERS OF THE KIDNEY AND URINARY TRACT,3,Major,Major,Surgical,Blue Cross/Blue Shield,,,,,false,263762.15,236229.82
Finger Lakes,Monroe,2701005,000413,Strong Memorial Hospital,30 to 49,130,M,Black/African American,Not Span/Hispanic,9,Urgent,Home or Self Care,2018,END003,DIABETES MELLITUS WITH COMPLICATION,HEP012,PANCREAS TRANSPLANT,006,PANCREAS TRANSPLANT,11,DISEASES AND DISORDERS OF THE KIDNEY AND URINARY TRACT,2,Moderate,Minor,Surgical,Private Health Insurance,,,,,false,214739.65,121087.8
New York City,Bronx,7000006,001169,Montefiore Medical Center - Henry & Lucy Moses Div,50 to 69,104,M,Other Race,Unknown,9,Emergency,Home w/ Home Health Services,2018,GEN003,CHRONIC KIDNEY DISEASE,URN011,KIDNEY TRANSPLANT,006,PANCREAS TRANSPLANT,11,DISEASES AND DISORDERS OF THE KIDNEY AND URINARY TRACT,3,Major,Major,Surgical,Medicare,,,,,false,503406.63,93701.35
New York City,Manhattan,7002054,001458,New York-Presbyterian Hospital - New York Weill Cornell Center,30 to 49,117,M,White,Not Span/Hispanic,7,Urgent,Home or Self Care,2018,END003,DIABETES MELLITUS WITH COMPLICATION,URN011,KIDNEY TRANSPLANT,006,PANCREAS TRANSPLANT,11,DISEASES AND DISORDERS OF THE KIDNEY AND URINARY TRACT,2,Moderate,Moderate,Surgical,Medicare,Blue Cross/Blue Shield,Self-Pay,,,false,373815.18,101059.69
New York City,Bronx,7000006,001169,Montefiore Medical Center - Henry & Lucy Moses Div,30 to 49,104,M,White,Not Span/Hispanic,8,Emergency,Home or Self Care,2018,GEN003,CHRONIC KIDNEY DISEASE,URN011,KIDNEY TRANSPLANT,006,PANCREAS TRANSPLANT,11,DISEASES AND DISORDERS OF THE KIDNEY AND URINARY TRACT,3,Major,Moderate,Surgical,Private Health Insurance,,,,,false,458778.84,92473.54
New York City,Manhattan,7002054,001458,New York-Presbyterian Hospital - New York Weill Cornell Center,30 to 49,103,F,White,Not Span/Hispanic,6,Emergency,Home w/ Home Health Services,2018,GEN003,CHRONIC KIDNEY DISEASE,URN011,KIDNEY TRANSPLANT,006,PANCREAS TRANSPLANT,11,DISEASES AND DISORDERS OF THE KIDNEY AND URINARY TRACT,3,Major,Moderate,Surgical,Medicare,Medicaid,Self-Pay,,,false,350034.23,100212.16
Central NY,Onondaga,3301007,000635,University Hospital SUNY Health Science Center,30 to 49,136,M,White,Not Span/Hispanic,9,Emergency,Home or Self Care,2018,END003,DIABETES MELLITUS WITH COMPLICATION,HEP012,PANCREAS TRANSPLANT,006,PANCREAS TRANSPLANT,10,"ENDOCRINE, NUTRITIONAL AND METABOLIC DISEASES AND DISORDERS",3,Major,Major,Surgical,Medicaid,,,,,false,256014.05,141686.59
New York City,Manhattan,7002054,001458,New York-Presbyterian Hospital - New York Weill Cornell Center,30 to 49,112,F,Other Race,Spanish/Hispanic,10,Emergency,Home or Self Care,2018,GEN003,CHRONIC KIDNEY DISEASE,URN011,KIDNEY TRANSPLANT,006,PANCREAS TRANSPLANT,11,DISEASES AND DISORDERS OF THE KIDNEY AND URINARY TRACT,4,Extreme,Major,Surgical,Medicare,Medicaid,Self-Pay,,,false,398905.62,101664.55
Finger Lakes,Monroe,2701005,000413,Strong Memorial Hospital,30 to 49,146,M,Black/African American,Not Span/Hispanic,8,Urgent,Home or Self Care,2018,END003,DIABETES MELLITUS WITH COMPLICATION,URN011,KIDNEY TRANSPLANT,006,PANCREAS TRANSPLANT,11,DISEASES AND DISORDERS OF THE KIDNEY AND URINARY TRACT,3,Major,Moderate,Surgical,Medicare,Blue Cross/Blue Shield,,,,false,210155.81,113614.76
New York City,Manhattan,7002054,001464,New York-Presbyterian Hospital - Columbia Presbyterian Center,30 to 49,112,M,Black/African American,Not Span/Hispanic,8,Urgent,Home w/ Home Health Services,2018,GEN003,CHRONIC KIDNEY DISEASE,URN011,KIDNEY TRANSPLANT,006,PANCREAS TRANSPLANT,05,DISEASES AND DISORDERS OF THE CIRCULATORY SYSTEM,3,Major,Moderate,Surgical,Medicare,Medicaid,Self-Pay,,,false,469924.77,138726.04
Central NY,Onondaga,3301007,000635,University Hospital SUNY Health Science Center,30 to 49,131,M,White,Not Span/Hispanic,8,Elective,Home w/ Home Health Services,2018,END003,DIABETES MELLITUS WITH COMPLICATION,HEP012,PANCREAS TRANSPLANT,006,PANCREAS TRANSPLANT,02,DISEASES AND DISORDERS OF THE EYE,2,Moderate,Moderate,Surgical,Medicare,Medicaid,,,,false,288412.38,149647.44
Finger Lakes,Monroe,2701005,000413,Strong Memorial Hospital,30 to 49,144,F,White,Not Span/Hispanic,6,Urgent,Home or Self Care,2018,END003,DIABETES MELLITUS WITH COMPLICATION,HEP012,PANCREAS TRANSPLANT,006,PANCREAS TRANSPLANT,02,DISEASES AND DISORDERS OF THE EYE,2,Moderate,Minor,Surgical,Medicare,Medicaid,,,,false,142067.76,78330.33
Western NY,Erie,1401005,000210,Erie County Medical Center,50 to 69,142,M,Black/African American,Not Span/Hispanic,5,Elective,Home w/ Home Health Services,2018,END003,DIABETES MELLITUS WITH COMPLICATION,HEP012,PANCREAS TRANSPLANT,006,PANCREAS TRANSPLANT,11,DISEASES AND DISORDERS OF THE KIDNEY AND URINARY TRACT,2,Moderate,Moderate,Surgical,Medicare,Blue Cross/Blue Shield,,,,false,251447.66,229256.63
Western NY,Erie,1401005,000210,Erie County Medical Center,18 to 29,142,F,Black/African American,Not Span/Hispanic,6,Urgent,Home or Self Care,2018,END003,DIABETES MELLITUS WITH COMPLICATION,HEP012,PANCREAS TRANSPLANT,006,PANCREAS TRANSPLANT,11,DISEASES AND DISORDERS OF THE KIDNEY AND URINARY TRACT,3,Major,Major,Surgical,Medicaid,Medicaid,,,,false,246471.39,224339.41
Western NY,Erie,1401005,000210,Erie County Medical Center,50 to 69,142,F,White,Not Span/Hispanic,6,Elective,Home or Self Care,2018,GEN003,CHRONIC KIDNEY DISEASE,HEP012,PANCREAS TRANSPLANT,006,PANCREAS TRANSPLANT,11,DISEASES AND DISORDERS OF THE KIDNEY AND URINARY TRACT,3,Major,Moderate,Surgical,Private Health Insurance,,,,,false,234335.53,212366.13
New York City,Manhattan,7002024,001456,Mount Sinai Hospital,30 to 49,100,M,White,Spanish/Hispanic,7,Urgent,Home w/ Home Health Services,2018,END003,DIABETES MELLITUS WITH COMPLICATION,URN011,KIDNEY TRANSPLANT,006,PANCREAS TRANSPLANT,11,DISEASES AND DISORDERS OF THE KIDNEY AND URINARY TRACT,2,Moderate,Moderate,Surgical,Medicare,Medicaid,Self-Pay,,,false,287096.81,91174.32
New York City,Manhattan,7002054,001458,New York-Presbyterian Hospital - New York Weill Cornell Center,30 to 49,OOS,M,Black/African American,Not Span/Hispanic,6,Elective,Home or Self Care,2018,INJ036,"COMPLICATION OF TRANSPLANTED ORGANS OR TISSUE, INITIAL ENCOUNTER",URN011,KIDNEY TRANSPLANT,006,PANCREAS TRANSPLANT,11,DISEASES AND DISORDERS OF THE KIDNEY AND URINARY TRACT,3,Major,Major,Surgical,Private Health Insurance,Medicare,Self-Pay,,,false,428168.61,128984.99
Capital/Adirond,Albany,0101000,000001,Albany Medical Center Hospital,30 to 49,OOS,M,White,Not Span/Hispanic,13,Urgent,Home or Self Care,2018,END003,DIABETES MELLITUS WITH COMPLICATION,URN011,KIDNEY TRANSPLANT,006,PANCREAS TRANSPLANT,11,DISEASES AND DISORDERS OF THE KIDNEY AND URINARY TRACT,3,Major,Moderate,Surgical,Medicare,Blue Cross/Blue Shield,,,,false,280521.17,126056.64
New York City,Manhattan,7002054,001464,New York-Presbyterian Hospital - Columbia Presbyterian Center,30 to 49,105,F,Black/African American,Not Span/Hispanic,7,Urgent,Home or Self Care,2018,END003,DIABETES MELLITUS WITH COMPLICATION,HEP012,PANCREAS TRANSPLANT,006,PANCREAS TRANSPLANT,11,DISEASES AND DISORDERS OF THE KIDNEY AND URINARY TRACT,3,Major,Major,Surgical,Blue Cross/Blue Shield,Self-Pay,,,,false,454982.82,129426.37
New York City,Bronx,7000006,001169,Montefiore Medical Center - Henry & Lucy Moses Div,30 to 49,104,M,Other Race,Spanish/Hispanic,7,Emergency,Home or Self Care,2018,GEN003,CHRONIC KIDNEY DISEASE,HEP012,PANCREAS TRANSPLANT,006,PANCREAS TRANSPLANT,11,DISEASES AND DISORDERS OF THE KIDNEY AND URINARY TRACT,3,Major,Moderate,Surgical,Medicare,Private Health Insurance,,,,false,347751.02,62412.87
New York City,Bronx,7000006,001169,Montefiore Medical Center - Henry & Lucy Moses Div,30 to 49,104,M,White,Spanish/Hispanic,61,Emergency,Inpatient Rehabilitation Facility,2018,END003,DIABETES MELLITUS WITH COMPLICATION,URN011,KIDNEY TRANSPLANT,006,PANCREAS TRANSPLANT,11,DISEASES AND DISORDERS OF THE KIDNEY AND URINARY TRACT,4,Extreme,Major,Surgical,Medicare,,,,,false,1789851.77,328232.25
New York City,Manhattan,7002054,001458,New York-Presbyterian Hospital - New York Weill Cornell Center,18 to 29,112,F,Other Race,Not Span/Hispanic,32,Emergency,Home w/ Home Health Services,2018,END003,DIABETES MELLITUS WITH COMPLICATION,HEP012,PANCREAS TRANSPLANT,006,PANCREAS TRANSPLANT,11,DISEASES AND DISORDERS OF THE KIDNEY AND URINARY TRACT,4,Extreme,Major,Surgical,"Managed Care, Unspecified",Medicaid,Self-Pay,,,false,788969.81,217771.62
New York City,Bronx,7000006,001169,Montefiore Medical Center - Henry & Lucy Moses Div,30 to 49,104,M,Other Race,Spanish/Hispanic,12,Emergency,Home w/ Home Health Services,2018,GEN003,CHRONIC KIDNEY DISEASE,HEP012,PANCREAS TRANSPLANT,006,PANCREAS TRANSPLANT,11,DISEASES AND DISORDERS OF THE KIDNEY AND URINARY TRACT,3,Major,Major,Surgical,Medicare,Medicaid,,,,false,530489.31,103001.63
Central NY,Onondaga,3301007,000635,University Hospital SUNY Health Science Center,30 to 49,130,M,White,Not Span/Hispanic,22,Emergency,Home w/ Home Health Services,2018,END003,DIABETES MELLITUS WITH COMPLICATION,HEP012,PANCREAS TRANSPLANT,006,PANCREAS TRANSPLANT,10,"ENDOCRINE, NUTRITIONAL AND METABOLIC DISEASES AND DISORDERS",3,Major,Minor,Surgical,Medicare,Medicaid,,,,false,441149.02,194638.7
New York City,Bronx,7000006,001169,Montefiore Medical Center - Henry & Lucy Moses Div,30 to 49,104,M,Other Race,Spanish/Hispanic,7,Emergency,Home w/ Home Health Services,2018,END003,DIABETES MELLITUS WITH COMPLICATION,HEP012,PANCREAS TRANSPLANT,006,PANCREAS TRANSPLANT,11,DISEASES AND DISORDERS OF THE KIDNEY AND URINARY TRACT,4,Extreme,Extreme,Surgical,Private Health Insurance,,,,,false,473642.26,89427.18
New York City,Bronx,7000006,001169,Montefiore Medical Center - Henry & Lucy Moses Div,30 to 49,108,F,Other Race,Unknown,6,Emergency,Home w/ Home Health Services,2018,GEN003,CHRONIC KIDNEY DISEASE,URN011,KIDNEY TRANSPLANT,006,PANCREAS TRANSPLANT,11,DISEASES AND DISORDERS OF THE KIDNEY AND URINARY TRACT,3,Major,Major,Surgical,Private Health Insurance,,,,,false,426046.92,82130.06
Central NY,Onondaga,3301007,000635,University Hospital SUNY Health Science Center,30 to 49,130,F,White,Not Span/Hispanic,8,Emergency,Home or Self Care,2018,END003,DIABETES MELLITUS WITH COMPLICATION,HEP012,PANCREAS TRANSPLANT,006,PANCREAS TRANSPLANT,11,DISEASES AND DISORDERS OF THE KIDNEY AND URINARY TRACT,3,Major,Major,Surgical,Medicare,Blue Cross/Blue Shield,,,,false,304333.9,161819.74
New York City,Bronx,7000006,001169,Montefiore Medical Center - Henry & Lucy Moses Div,50 to 69,104,M,Other Race,Unknown,10,Emergency,Home or Self Care,2018,GEN003,CHRONIC KIDNEY DISEASE,URN011,KIDNEY TRANSPLANT,006,PANCREAS TRANSPLANT,11,DISEASES AND DISORDERS OF THE KIDNEY AND URINARY TRACT,3,Major,Moderate,Surgical,Private Health Insurance,,,,,false,526174.63,98880.05
Central NY,Onondaga,3301007,000635,University Hospital SUNY Health Science Center,30 to 49,137,M,White,Not Span/Hispanic,10,Emergency,Home w/ Home Health Services,2018,END003,DIABETES MELLITUS WITH COMPLICATION,URN011,KIDNEY TRANSPLANT,006,PANCREAS TRANSPLANT,11,DISEASES AND DISORDERS OF THE KIDNEY AND URINARY TRACT,3,Major,Major,Surgical,Medicare,Medicaid,,,,false,392442.17,221439.91
Central NY,Onondaga,3301007,000635,University Hospital SUNY Health Science Center,30 to 49,132,M,Black/African American,Not Span/Hispanic,11,Elective,Home or Self Care,2018,END003,DIABETES MELLITUS WITH COMPLICATION,HEP012,PANCREAS TRANSPLANT,006,PANCREAS TRANSPLANT,11,DISEASES AND DISORDERS OF THE KIDNEY AND URINARY TRACT,3,Major,Major,Surgical,Medicaid,,,,,false,428763.4,236550.42
New York City,Manhattan,7002054,001464,New York-Presbyterian Hospital - Columbia Presbyterian Center,18 to 29,OOS,M,Other Race,Spanish/Hispanic,12,Urgent,Home w/ Home Health Services,2018,END003,DIABETES MELLITUS WITH COMPLICATION,HEP012,PANCREAS TRANSPLANT,006,PANCREAS TRANSPLANT,01,DISEASES AND DISORDERS OF THE NERVOUS SYSTEM,3,Major,Moderate,Surgical,Private Health Insurance,Self-Pay,,,,false,384660.4,109475