Hospital Service Area,Hospital County,Operating Certificate Number,Permanent Facility Id,Facility Name,Age Group,Zip Code - 3 digits,Gender,Race,Ethnicity,Length of Stay,Type of Admission,Patient Disposition,Discharge Year,CCS Diagnosis Code,CCS Diagnosis Description,CCS Procedure Code,CCS Procedure Description,APR DRG Code,APR DRG Description,APR MDC Code,APR MDC Description,APR Severity of Illness Code,APR Severity of Illness Description,APR Risk of Mortality,APR Medical Surgical Description,Payment Typology 1,Payment Typology 2,Payment Typology 3,Birth Weight,Abortion Edit Indicator,Emergency Department Indicator,Total Charges,Total Costs
New York City,Manhattan,7002053,001463,NYU Langone Hospitals,30 to 49,110,M,White,Spanish/Hispanic,8,Emergency,Home w/ Home Health Services,2019,END003,DIABETES MELLITUS WITH COMPLICATION,HEP012,PANCREAS TRANSPLANT,006,PANCREAS TRANSPLANT,11,DISEASES AND DISORDERS OF THE KIDNEY AND URINARY TRACT,3,Major,Minor,Surgical,Blue Cross/Blue Shield,Medicare,,,,false,740971.48,211679.47
Capital/Adirond,Albany,0101000,000001,Albany Medical Center Hospital,50 to 69,128,M,White,Not Span/Hispanic,6,Elective,Home or Self Care,2019,END003,DIABETES MELLITUS WITH COMPLICATION,HEP012,PANCREAS TRANSPLANT,006,PANCREAS TRANSPLANT,11,DISEASES AND DISORDERS OF THE KIDNEY AND URINARY TRACT,2,Moderate,Moderate,Surgical,Medicare,Medicare,,,,false,181970.52,99207.71
Finger Lakes,Monroe,2701005,000413,Strong Memorial Hospital,30 to 49,133,F,White,Not Span/Hispanic,7,Urgent,Home or Self Care,2019,END003,DIABETES MELLITUS WITH COMPLICATION,HEP012,PANCREAS TRANSPLANT,006,PANCREAS TRANSPLANT,10,"ENDOCRINE, NUTRITIONAL AND METABOLIC DISEASES AND DISORDERS",3,Major,Moderate,Surgical,Blue Cross/Blue Shield,,,,,false,127377.93,71245.28
New York City,Manhattan,7002054,001458,New York-Presbyterian Hospital - New York Weill Cornell Center,30 to 49,111,F,White,Not Span/Hispanic,7,Emergency,Home w/ Home Health Services,2019,END003,DIABETES MELLITUS WITH COMPLICATION,URN011,KIDNEY TRANSPLANT,006,PANCREAS TRANSPLANT,11,DISEASES AND DISORDERS OF THE KIDNEY AND URINARY TRACT,2,Moderate,Moderate,Surgical,Medicare,Medicaid,Self-Pay,,,false,373809.94,102672.14
New York City,Manhattan,7002054,001458,New York-Presbyterian Hospital - New York Weill Cornell Center,30 to 49,OOS,F,Black/African American,Not Span/Hispanic,31,Emergency,Home w/ Home Health Services,2019,END003,DIABETES MELLITUS WITH COMPLICATION,URN011,KIDNEY TRANSPLANT,006,PANCREAS TRANSPLANT,11,DISEASES AND DISORDERS OF THE KIDNEY AND URINARY TRACT,4,Extreme,Major,Surgical,Medicare,Self-Pay,,,,false,707421.56,188315.16
New York City,Manhattan,7002054,001458,New York-Presbyterian Hospital - New York Weill Cornell Center,30 to 49,114,M,Other Race,Spanish/Hispanic,9,Emergency,Home or Self Care,2019,END003,DIABETES MELLITUS WITH COMPLICATION,URN011,KIDNEY TRANSPLANT,006,PANCREAS TRANSPLANT,11,DISEASES AND DISORDERS OF THE KIDNEY AND URINARY TRACT,3,Major,Moderate,Surgical,"Managed Care, Unspecified",Medicaid,Self-Pay,,,false,421743.3,120518.71
New York City,Kings,7001037,001320,University Hospital of Brooklyn,30 to 49,112,M,Black/African American,Not Span/Hispanic,14,Urgent,Home w/ Home Health Services,2019,END003,DIABETES MELLITUS WITH COMPLICATION,URN011,KIDNEY TRANSPLANT,006,PANCREAS TRANSPLANT,11,DISEASES AND DISORDERS OF THE KIDNEY AND URINARY TRACT,2,Moderate,Moderate,Surgical,Medicare,Blue Cross/Blue Shield,Self-Pay,,,false,324964,157027.68
New York City,Bronx,7000006,001169,Montefiore Medical Center - Henry & Lucy Moses Div,30 to 49,104,M,Black/African American,Not Span/Hispanic,11,Emergency,Skilled Nursing Home,2019,END003,DIABETES MELLITUS WITH COMPLICATION,URN011,KIDNEY TRANSPLANT,006,PANCREAS TRANSPLANT,10,"ENDOCRINE, NUTRITIONAL AND METABOLIC DISEASES AND DISORDERS",3,Major,Extreme,Surgical,Medicare,Medicaid,,,,false,640310.19,115359.42
New York City,Manhattan,7002054,001464,New York-Presbyterian Hospital - Columbia Presbyterian Center,30 to 49,114,M,Other Race,Not Span/Hispanic,15,Urgent,Home or Self Care,2019,END003,DIABETES MELLITUS WITH COMPLICATION,HEP012,PANCREAS TRANSPLANT,006,PANCREAS TRANSPLANT,11,DISEASES AND DISORDERS OF THE KIDNEY AND URINARY TRACT,4,Extreme,Major,Surgical,Private Health Insurance,Medicare,Self-Pay,,,false,709824.28,237019.68
New York City,Manhattan,7002053,001463,NYU Langone Hospitals,50 to 69,104,M,Other Race,Not Span/Hispanic,11,Emergency,Home w/ Home Health Services,2019,END003,DIABETES MELLITUS WITH COMPLICATION,HEP012,PANCREAS TRANSPLANT,006,PANCREAS TRANSPLANT,11,DISEASES AND DISORDERS OF THE KIDNEY AND URINARY TRACT,3,Major,Major,Surgical,Medicaid,,,,,false,1019013.77,353713.19
Western NY,Erie,1401005,000210,Erie County Medical Center,50 to 69,147,F,White,Not Span/Hispanic,9,Elective,Expired,2019,END003,DIABETES MELLITUS WITH COMPLICATION,URN011,KIDNEY TRANSPLANT,006,PANCREAS TRANSPLANT,11,DISEASES AND DISORDERS OF THE KIDNEY AND URINARY TRACT,3,Major,Major,Surgical,Blue Cross/Blue Shield,,,,,false,279585.31,240633.3
Central NY,Onondaga,3301007,000635,University Hospital SUNY Health Science Center,30 to 49,137,F,White,Not Span/Hispanic,8,Elective,Home or Self Care,2019,END002,DIABETES MELLITUS WITHOUT COMPLICATION,HEP012,PANCREAS TRANSPLANT,006,PANCREAS TRANSPLANT,10,"ENDOCRINE, NUTRITIONAL AND METABOLIC DISEASES AND DISORDERS",2,Moderate,Minor,Surgical,Medicare,Private Health Insurance,,,,false,320473.86,163239.27
New York City,Manhattan,7002054,001464,New York-Presbyterian Hospital - Columbia Presbyterian Center,30 to 49,,F,White,Not Span/Hispanic,16,Urgent,Home or Self Care,2019,END003,DIABETES MELLITUS WITH COMPLICATION,URN011,KIDNEY TRANSPLANT,006,PANCREAS TRANSPLANT,11,DISEASES AND DISORDERS OF THE KIDNEY AND URINARY TRACT,3,Major,Moderate,Surgical,Medicare,Private Health Insurance,Self-Pay,,,true,600640.42,175696.29
Western NY,Erie,1401005,000210,Erie County Medical Center,50 to 69,142,M,Other Race,Unknown,63,Elective,Inpatient Rehabilitation Facility,2019,GEN003,CHRONIC KIDNEY DISEASE,HEP012,PANCREAS TRANSPLANT,006,PANCREAS TRANSPLANT,11,DISEASES AND DISORDERS OF THE KIDNEY AND URINARY TRACT,4,Extreme,Extreme,Surgical,Blue Cross/Blue Shield,,,,,false,608063.76,396214.63
New York City,Kings,7001037,001320,University Hospital of Brooklyn,30 to 49,112,M,Black/African American,Not Span/Hispanic,25,Urgent,Home or Self Care,2019,GEN003,CHRONIC KIDNEY DISEASE,URN011,KIDNEY TRANSPLANT,006,PANCREAS TRANSPLANT,11,DISEASES AND DISORDERS OF THE KIDNEY AND URINARY TRACT,3,Major,Major,Surgical,Medicaid,Medicaid,Self-Pay,,,false,590839,298829.13
New York City,Bronx,7000006,001169,Montefiore Medical Center - Henry & Lucy Moses Div,30 to 49,104,F,Other Race,Spanish/Hispanic,7,Emergency,Home or Self Care,2019,GEN003,CHRONIC KIDNEY DISEASE,HEP012,PANCREAS TRANSPLANT,006,PANCREAS TRANSPLANT,11,DISEASES AND DISORDERS OF THE KIDNEY AND URINARY TRACT,4,Extreme,Major,Surgical,Medicaid,,,,,false,438929.89,85994.71
New York City,Manhattan,7002024,001456,Mount Sinai Hospital,30 to 49,100,F,Other Race,Not Span/Hispanic,7,Urgent,Home or Self Care,2019,END003,DIABETES MELLITUS WITH COMPLICATION,URN011,KIDNEY TRANSPLANT,006,PANCREAS TRANSPLANT,11,DISEASES AND DISORDERS OF THE KIDNEY AND URINARY TRACT,3,Major,Moderate,Surgical,Blue Cross/Blue Shield,Self-Pay,,,,false,349615.85,107012.39
New York City,Bronx,7000006,001169,Montefiore Medical Center - Henry & Lucy Moses Div,30 to 49,104,F,Black/African American,Not Span/Hispanic,16,Emergency,Inpatient Rehabilitation Facility,2019,GEN003,CHRONIC KIDNEY DISEASE,HEP012,PANCREAS TRANSPLANT,006,PANCREAS TRANSPLANT,11,DISEASES AND DISORDERS OF THE KIDNEY AND URINARY TRACT,3,Major,Moderate,Surgical,Medicaid,,,,,false,680972.68,129423.79
New York City,Bronx,7000006,001169,Montefiore Medical Center - Henry & Lucy Moses Div,50 to 69,114,F,Other Race,Spanish/Hispanic,7,Emergency,Home w/ Home Health Services,2019,END003,DIABETES MELLITUS WITH COMPLICATION,URN011,KIDNEY TRANSPLANT,006,PANCREAS TRANSPLANT,11,DISEASES AND DISORDERS OF THE KIDNEY AND URINARY TRACT,4,Extreme,Major,Surgical,Self-Pay,,,,,false,451413.3,83822.05
New York City,Manhattan,7002053,001463,NYU Langone Hospitals,30 to 49,114,F,Black/African American,Not Span/Hispanic,8,Emergency,Home w/ Home Health Services,2019,GEN003,CHRONIC KIDNEY DISEASE,URN011,KIDNEY TRANSPLANT,006,PANCREAS TRANSPLANT,11,DISEASES AND DISORDERS OF THE KIDNEY AND URINARY TRACT,3,Major,Moderate,Surgical,Private Health Insurance,,,,,false,937462.06,324522.91
New York City,Manhattan,7002054,001458,New York-Presbyterian Hospital - New York Weill Cornell Center,30 to 49,113,M,White,Spanish/Hispanic,9,Emergency,Home or Self Care,2019,END003,DIABETES MELLITUS WITH COMPLICATION,HEP012,PANCREAS TRANSPLANT,006,PANCREAS TRANSPLANT,11,DISEASES AND DISORDERS OF THE KIDNEY AND URINARY TRACT,3,Major,Moderate,Surgical,Medicare,Medicare,Self-Pay,,,false,294892.5,90412.29
New York City,Manhattan,7002053,001463,NYU Langone Hospitals,30 to 49,104,M,Black/African American,Not Span/Hispanic,10,Emergency,Home w/ Home Health Services,2019,END003,DIABETES MELLITUS WITH COMPLICATION,URN011,KIDNEY TRANSPLANT,006,PANCREAS TRANSPLANT,11,DISEASES AND DISORDERS OF THE KIDNEY AND URINARY TRACT,3,Major,Major,Surgical,Medicare,Medicaid,,,,false,910906.25,332810.3
New York City,Manhattan,7002054,001458,New York-Presbyterian Hospital - New York Weill Cornell Center,30 to 49,OOS,F,White,Not Span/Hispanic,84,Emergency,Inpatient Rehabilitation Facility,2019,END003,DIABETES MELLITUS WITH COMPLICATION,RES010,TRACHEOSTOMY,006,PANCREAS TRANSPLANT,11,DISEASES AND DISORDERS OF THE KIDNEY AND URINARY TRACT,4,Extreme,Extreme,Surgical,Private Health Insurance,Self-Pay,,,,false,3025070.82,1167536.27
New York City,Manhattan,7002054,001458,New York-Presbyterian Hospital - New York Weill Cornell Center,50 to 69,100,M,Other Race,Multi-ethnic,6,Emergency,Home or Self Care,2019,END003,DIABETES MELLITUS WITH COMPLICATION,HEP012,PANCREAS TRANSPLANT,006,PANCREAS TRANSPLANT,10,"ENDOCRINE, NUTRITIONAL AND METABOLIC DISEASES AND DISORDERS",2,Moderate,Moderate,Surgical,Private Health Insurance,Self-Pay,,,,false,260516.06,82490.79
New York City,Manhattan,7002053,001463,NYU Langone Hospitals,30 to 49,100,F,Black/African American,Not Span/Hispanic,17,Emergency,Home w/ Home Health Services,2019,END003,DIABETES MELLITUS WITH COMPLICATION,URN011,KIDNEY TRANSPLANT,006,PANCREAS TRANSPLANT,11,DISEASES AND DISORDERS OF THE KIDNEY AND URINARY TRACT,3,Major,Major,Surgical,Medicare,Medicaid,,,,false,1213863.38,390570.96
New York City,Manhattan,7002053,001463,NYU Langone Hospitals,50 to 69,119,F,White,Not Span/Hispanic,11,Emergency,Home w/ Home Health Services,2019,END003,DIABETES MELLITUS WITH COMPLICATION,URN011,KIDNEY TRANSPLANT,006,PANCREAS TRANSPLANT,11,DISEASES AND DISORDERS OF THE KIDNEY AND URINARY TRACT,3,Major,Major,Surgical,Private Health Insurance,,,,,false,937194.09,332211.54
New York City,Bronx,7000006,001169,Montefiore Medical Center - Henry & Lucy Moses Div,30 to 49,104,M,Black/African American,Not Span/Hispanic,9,Emergency,Home w/ Home Health Services,2019,GEN003,CHRONIC KIDNEY DISEASE,URN011,KIDNEY TRANSPLANT,006,PANCREAS TRANSPLANT,11,DISEASES AND DISORDERS OF THE KIDNEY AND URINARY TRACT,3,Major,Moderate,Surgical,Private Health Insurance,,,,,false,545383.03,103546.73
Finger Lakes,Monroe,2701005,000413,Strong Memorial Hospital,30 to 49,144,M,Other Race,Spanish/Hispanic,13,Urgent,Home w/ Home Health Services,2019,END003,DIABETES MELLITUS WITH COMPLICATION,HEP012,PANCREAS TRANSPLANT,006,PANCREAS TRANSPLANT,11,DISEASES AND DISORDERS OF THE KIDNEY AND URINARY TRACT,3,Major,Major,Surgical,Medicare,Medicaid,,,,false,230863.49,125022.21
New York City,Bronx,7000006,001169,Montefiore Medical Center - Henry & Lucy Moses Div,50 to 69,104,M,Other Race,Unknown,9,Emergency,Home or Self Care,2019,GEN003,CHRONIC KIDNEY DISEASE,HEP012,PANCREAS TRANSPLANT,006,PANCREAS TRANSPLANT,11,DISEASES AND DISORDERS OF THE KIDNEY AND URINARY TRACT,3,Major,Moderate,Surgical,Medicaid,,,,,false,486245.16,94042.14
New York City,Manhattan,7002024,001456,Mount Sinai Hospital,30 to 49,113,M,Other Race,Spanish/Hispanic,11,Urgent,Home or Self Care,2019,END003,DIABETES MELLITUS WITH COMPLICATION,URN011,KIDNEY TRANSPLANT,006,PANCREAS TRANSPLANT,11,DISEASES AND DISORDERS OF THE KIDNEY AND URINARY TRACT,3,Major,Moderate,Surgical,Medicare,Medicaid,Self-Pay,,,false,334426.99,94693.99
New York City,Manhattan,7002024,001456,Mount Sinai Hospital,50 to 69,100,F,Black/African American,Not Span/Hispanic,33,Urgent,Home or Self Care,2019,END003,DIABETES MELLITUS WITH COMPLICATION,URN011,KIDNEY TRANSPLANT,006,PANCREAS TRANSPLANT,11,DISEASES AND DISORDERS OF THE KIDNEY AND URINARY TRACT,4,Extreme,Extreme,Surgical,Medicare,Private Health Insurance,Medicaid,,,false,692063.08,204738.97
New York City,Manhattan,7002024,001456,Mount Sinai Hospital,30 to 49,112,M,Other Race,Unknown,9,Urgent,Home or Self Care,2019,END003,DIABETES MELLITUS WITH COMPLICATION,URN011,KIDNEY TRANSPLANT,006,PANCREAS TRANSPLANT,11,DISEASES AND DISORDERS OF THE KIDNEY AND URINARY TRACT,2,Moderate,Moderate,Surgical,Medicare,Private Health Insurance,Self-Pay,,,false,429109.24,135629.65
Capital/Adirond,Albany,0101000,000001,Albany Medical Center Hospital,30 to 49,121,F,White,Not Span/Hispanic,9,Urgent,Home or Self Care,2019,END003,DIABETES MELLITUS WITH COMPLICATION,HEP012,PANCREAS TRANSPLANT,006,PANCREAS TRANSPLANT,11,DISEASES AND DISORDERS OF THE KIDNEY AND URINARY TRACT,2,Moderate,Minor,Surgical,Medicare,Private Health Insurance,,,,false,189558.52,101122.17
New York City,Manhattan,7002053,001463,NYU Langone Hospitals,30 to 49,113,M,Other Race,Not Span/Hispanic,7,Emergency,Home w/ Home Health Services,2019,END003,DIABETES MELLITUS WITH COMPLICATION,URN011,KIDNEY TRANSPLANT,006,PANCREAS TRANSPLANT,11,DISEASES AND DISORDERS OF THE KIDNEY AND URINARY TRACT,3,Major,Moderate,Surgical,Medicare,Medicaid,,,,false,928765.31,315849.41
New York City,Bronx,7000006,001169,Montefiore Medical Center - Henry & Lucy Moses Div,50 to 69,104,M,Other Race,Spanish/Hispanic,5,Emergency,Home w/ Home Health Services,2019,END003,DIABETES MELLITUS WITH COMPLICATION,URN011,KIDNEY TRANSPLANT,006,PANCREAS TRANSPLANT,11,DISEASES AND DISORDERS OF THE KIDNEY AND URINARY TRACT,3,Major,Moderate,Surgical,Medicare,Medicaid,,,,false,415121.46,78034.87
New York City,Manhattan,7002054,001464,New York-Presbyterian Hospital - Columbia Presbyterian Center,18 to 29,100,M,Multi-racial,Multi-ethnic,8,Urgent,Home w/ Home Health Services,2019,END003,DIABETES MELLITUS WITH COMPLICATION,URN011,KIDNEY TRANSPLANT,006,PANCREAS TRANSPLANT,11,DISEASES AND DISORDERS OF THE KIDNEY AND URINARY TRACT,3,Major,Moderate,Surgical,Medicaid,Medicaid,Self-Pay,,,false,515894.09,159199.61
New York City,Manhattan,7002053,001463,NYU Langone Hospitals,50 to 69,112,F,Black/African American,Not Span/Hispanic,22,Elective,Home w/ Home Health Services,2019,END003,DIABETES MELLITUS WITH COMPLICATION,URN011,KIDNEY TRANSPLANT,006,PANCREAS TRANSPLANT,11,DISEASES AND DISORDERS OF THE KIDNEY AND URINARY TRACT,4,Extreme,Major,Surgical,Medicare,Medicaid,,,,false,1218121.17,408100.65
New York City,Manhattan,7002054,001458,New York-Presbyterian Hospital - New York Weill Cornell Center,50 to 69,100,M,Black/African American,Spanish/Hispanic,8,Emergency,Inpatient Rehabilitation Facility,2019,GEN003,CHRONIC KIDNEY DISEASE,URN011,KIDNEY TRANSPLANT,006,PANCREAS TRANSPLANT,11,DISEASES AND DISORDERS OF THE KIDNEY AND URINARY TRACT,3,Major,Moderate,Surgical,"Managed Care, Unspecified",Medicaid,Self-Pay,,,false,421980.34,124195.58
New York City,Manhattan,7002053,001463,NYU Langone Hospitals,30 to 49,100,M,White,Not Span/Hispanic,17,Emergency,Inpatient Rehabilitation Facility,2019,END003,DIABETES MELLITUS WITH COMPLICATION,GIS008,APPENDECTOMY,006,PANCREAS TRANSPLANT,11,DISEASES AND DISORDERS OF THE KIDNEY AND URINARY TRACT,3,Major,Moderate,Surgical,Blue Cross/Blue Shield,,,,,false,1086330.47,360727.22
New York City,Manhattan,7002054,001464,New York-Presbyterian Hospital - Columbia Presbyterian Center,30 to 49,112,M,Black/African American,Spanish/Hispanic,11,Urgent,Home w/ Home Health Services,2019,GEN003,CHRONIC KIDNEY DISEASE,URN011,KIDNEY TRANSPLANT,006,PANCREAS TRANSPLANT,11,DISEASES AND DISORDERS OF THE KIDNEY AND URINARY TRACT,3,Major,Moderate,Surgical,Medicare,Medicaid,Self-Pay,,,false,529046.64,154195.28
New York City,Bronx,7000006,001169,Montefiore Medical Center - Henry & Lucy Moses Div,30 to 49,111,M,Other Race,Not Span/Hispanic,8,Emergency,Home or Self Care,2019,END003,DIABETES MELLITUS WITH COMPLICATION,HEP012,PANCREAS TRANSPLANT,006,PANCREAS TRANSPLANT,11,DISEASES AND DISORDERS OF THE KIDNEY AND URINARY TRACT,3,Major,Moderate,Surgical,Private Health Insurance,,,,,false,452010.73,87382.1
New York City,Manhattan,7002024,001456,Mount Sinai Hospital,30 to 49,115,M,Black/African American,Not Span/Hispanic,8,Emergency,Home or Self Care,2019,GEN003,CHRONIC KIDNEY DISEASE,URN011,KIDNEY TRANSPLANT,006,PANCREAS TRANSPLANT,11,DISEASES AND DISORDERS OF THE KIDNEY AND URINARY TRACT,2,Moderate,Minor,Surgical,Medicare,Medicaid,Self-Pay,,,true,354654.64,118697.05
Central NY,Onondaga,3301007,000635,University Hospital SUNY Health Science Center,30 to 49,136,M,Other Race,Spanish/Hispanic,18,Emergency,Home or Self Care,2019,END003,DIABETES MELLITUS WITH COMPLICATION,URN011,KIDNEY TRANSPLANT,006,PANCREAS TRANSPLANT,11,DISEASES AND DISORDERS OF THE KIDNEY AND URINARY TRACT,3,Major,Major,Surgical,Medicare,Medicaid,,,,false,515284.7,255316.34
Western NY,Erie,1401005,000210,Erie County Medical Center,30 to 49,142,F,White,Not Span/Hispanic,8,Elective,Home w/ Home Health Services,2019,END003,DIABETES MELLITUS WITH COMPLICATION,URN011,KIDNEY TRANSPLANT,006,PANCREAS TRANSPLANT,11,DISEASES AND DISORDERS OF THE KIDNEY AND URINARY TRACT,4,Extreme,Major,Surgical,Medicare,Medicaid,Medicare,,,false,255555.31,224214.07
New York City,Manhattan,7002024,001456,Mount Sinai Hospital,50 to 69,115,M,Other Race,Unknown,7,Urgent,Home or Self Care,2019,END003,DIABETES MELLITUS WITH COMPLICATION,URN011,KIDNEY TRANSPLANT,006,PANCREAS TRANSPLANT,11,DISEASES AND DISORDERS OF THE KIDNEY AND URINARY TRACT,4,Extreme,Major,Surgical,Medicare,Medicare,Medicaid,,,false,366850.34,112624.98
New York City,Manhattan,7002053,001463,NYU Langone Hospitals,30 to 49,112,M,Other Race,Spanish/Hispanic,9,Emergency,Home w/ Home Health Services,2019,END003,DIABETES MELLITUS WITH COMPLICATION,URN011,KIDNEY TRANSPLANT,006,PANCREAS TRANSPLANT,11,DISEASES AND DISORDERS OF THE KIDNEY AND URINARY TRACT,3,Major,Minor,Surgical,Medicare,Medicaid,,,,false,911024.95,320465.76
New York City,Manhattan,7002054,001464,New York-Presbyterian Hospital - Columbia Presbyterian Center,50 to 69,OOS,F,White,Not Span/Hispanic,14,Urgent,Home w/ Home Health Services,2019,END003,DIABETES MELLITUS WITH COMPLICATION,URN011,KIDNEY TRANSPLANT,006,PANCREAS TRANSPLANT,11,DISEASES AND DISORDERS OF THE KIDNEY AND URINARY TRACT,3,Major,Major,Surgical,Blue Cross/Blue Shield,Self-Pay,,,,false,578272.33,159699.5
New York City,Manhattan,7002054,001464,New York-Presbyterian Hospital - Columbia Presbyterian Center,50 to 69,113,F,Multi-racial,Not Span/Hispanic,9,Urgent,Home or Self Care,2019,GEN003,CHRONIC KIDNEY DISEASE,URN011,KIDNEY TRANSPLANT,006,PANCREAS TRANSPLANT,05,DISEASES AND DISORDERS OF THE CIRCULATORY SYSTEM,3,Major,Moderate,Surgical,Medicare,Private Health Insurance,Self-Pay,,,false,469951.45,125401.78
Western NY,Erie,1401005,000210,Erie County Medical Center,50 to 69,140,M,White,Not Span/Hispanic,7,Emergency,Home or Self Care,2019,END003,DIABETES MELLITUS WITH COMPLICATION,HEP012,PANCREAS TRANSPLANT,006,PANCREAS TRANSPLANT,11,DISEASES AND DISORDERS OF THE KIDNEY AND URINARY TRACT,3,Major,Major,Surgical,Blue Cross/Blue Shield,,,,,false,254878.79,229337.45
Western NY,Erie,1401005,000210,Erie County Medical Center,30 to 49,142,M,Black/African American,Not Span/Hispanic,6,Elective,Home or Self Care,2019,GEN003,CHRONIC KIDNEY DISEASE,HEP012,PANCREAS TRANSPLANT,006,PANCREAS TRANSPLANT,11,DISEASES AND DISORDERS OF THE KIDNEY AND URINARY TRACT,3,Major,Moderate,Surgical,Private Health Insurance,,,,,false,220211.58,194099.88
New York City,Bronx,7000006,001169,Montefiore Medical Center - Henry & Lucy Moses Div,30 to 49,104,F,Other Race,Spanish/Hispanic,8,Emergency,Home or Self Care,2019,DIG020,PANCREATIC DISORDERS (EXCLUDING DIABETES),HEP012,PANCREAS TRANSPLANT,006,PANCREAS TRANSPLANT,07,DISEASES AND DISORDERS OF THE HEPATOBILIARY SYSTEM AND PANCREAS,3,Major,Major,Surgical,Medicare,Medicaid,,,,false,479863.84,93900.59
New York City,Manhattan,7002053,001463,NYU Langone Hospitals,30 to 49,110,F,White,Not Span/Hispanic,9,Emergency,Home w/ Home Health Services,2019,END003,DIABETES MELLITUS WITH COMPLICATION,HEP012,PANCREAS TRANSPLANT,006,PANCREAS TRANSPLANT,11,DISEASES AND DISORDERS OF THE KIDNEY AND URINARY TRACT,2,Moderate,Moderate,Surgical,Medicare,Private Health Insurance,,,,false,957868.65,327357.98
New York City,Manhattan,7002024,001456,Mount Sinai Hospital,30 to 49,100,F,Black/African American,Not Span/Hispanic,8,Urgent,Home or Self Care,2019,GEN003,CHRONIC KIDNEY DISEASE,URN011,KIDNEY TRANSPLANT,006,PANCREAS TRANSPLANT,11,DISEASES AND DISORDERS OF THE KIDNEY AND URINARY TRACT,3,Major,Moderate,Surgical,Medicare,Medicaid,Self-Pay,,,false,375299.2,114960.91
New York City,Manhattan,7002054,001464,New York-Presbyterian Hospital - Columbia Presbyterian Center,50 to 69,100,M,Other Race,Spanish/Hispanic,9,Urgent,Home w/ Home Health Services,2019,END003,DIABETES MELLITUS WITH COMPLICATION,URN011,KIDNEY TRANSPLANT,006,PANCREAS TRANSPLANT,11,DISEASES AND DISORDERS OF THE KIDNEY AND URINARY TRACT,3,Major,Major,Surgical,Medicaid,Medicaid,Self-Pay,,,false,532340.67,173805.01
New York City,Manhattan,7002053,001463,NYU Langone Hospitals,30 to 49,114,F,Other Race,Not Span/Hispanic,9,Emergency,Home w/ Home Health Services,2019,GEN003,CHRONIC KIDNEY DISEASE,URN011,KIDNEY TRANSPLANT,006,PANCREAS TRANSPLANT,11,DISEASES AND DISORDERS OF THE KIDNEY AND URINARY TRACT,3,Major,Moderate,Surgical,Private Health Insurance,,,,,false,946987.88,327867.09
Capital/Adirond,Albany,0101000,000001,Albany Medical Center Hospital,30 to 49,121,M,White,Not Span/Hispanic,11,Urgent,Home or Self Care,2019,END003,DIABETES MELLITUS WITH COMPLICATION,URN011,KIDNEY TRANSPLANT,006,PANCREAS TRANSPLANT,11,DISEASES AND DISORDERS OF THE KIDNEY AND URINARY TRACT,2,Moderate,Moderate,Surgical,Medicare,"Managed Care, Unspecified",,,,false,301744.44,169448.22
New York City,Manhattan,7002054,001464,New York-Presbyterian Hospital - Columbia Presbyterian Center,50 to 69,127,M,White,Not Span/Hispanic,6,Urgent,Home or Self Care,2019,END003,DIABETES MELLITUS WITH COMPLICATION,URN011,KIDNEY TRANSPLANT,006,PANCREAS TRANSPLANT,11,DISEASES AND DISORDERS OF THE KIDNEY AND URINARY TRACT,2,Moderate,Moderate,Surgical,Medicare,Medicaid,Self-Pay,,,false,446128.62,124252.94
New York City,Manhattan,7002054,001464,New York-Presbyterian Hospital - Columbia Presbyterian Center,30 to 49,OOS,F,Other Race,Spanish/Hispanic,14,Urgent,Home or Self Care,2019,END003,DIABETES MELLITUS WITH COMPLICATION,HEP012,PANCREAS TRANSPLANT,006,PANCREAS TRANSPLANT,10,"ENDOCRINE, NUTRITIONAL AND METABOLIC DISEASES AND DISORDERS",3,Major,Moderate,Surgical,Medicare,Private Health Insurance,Self-Pay,,,false,486806.19,127428.02
New York City,Manhattan,7002054,001458,New York-Presbyterian Hospital - New York Weill Cornell Center,30 to 49,112,M,White,Spanish/Hispanic,8,Emergency,Home or Self Care,2019,END003,DIABETES MELLITUS WITH COMPLICATION,HEP012,PANCREAS TRANSPLANT,006,PANCREAS TRANSPLANT,11,DISEASES AND DISORDERS OF THE KIDNEY AND URINARY TRACT,3,Major,Major,Surgical,Medicare,Blue Cross/Blue Shield,Self-Pay,,,false,408425.42,111489.99