Hospital Service Area,Hospital County,Operating Certificate Number,Permanent Facility Id,Facility Name,Age Group,Zip Code - 3 digits,Gender,Race,Ethnicity,Length of Stay,Type of Admission,Patient Disposition,Discharge Year,CCS Diagnosis Code,CCS Diagnosis Description,CCS Procedure Code,CCS Procedure Description,APR DRG Code,APR DRG Description,APR MDC Code,APR MDC Description,APR Severity of Illness Code,APR Severity of Illness Description,APR Risk of Mortality,APR Medical Surgical Description,Payment Typology 1,Payment Typology 2,Payment Typology 3,Birth Weight,Abortion Edit Indicator,Emergency Department Indicator,Total Charges,Total Costs
Long Island,Nassau,2908000,000511,NYU Langone Hospital-Long Island,0 to 17,117,M,Other Race,Not Span/Hispanic,41,Newborn,Home or Self Care,2020,PNL001,LIVEBORN,ESA004,NON-INVASIVE VENTILATION,602,NEONATE BWT 1000-1249G W RESP DIST SYND/OTH MAJ RESP OR MAJ ANOM,15,NEWBORNS AND OTHER NEONATES WITH CONDITIONS ORIGINATING IN THE PERINATAL PERIOD,2,Moderate,Minor,Medical,Blue Cross/Blue Shield,Blue Cross/Blue Shield,,01100,,N,537970.42,182554.87
Long Island,Nassau,2908000,000511,NYU Langone Hospital-Long Island,0 to 17,114,M,Black/African American,Unknown,46,Newborn,Home w/ Home Health Services,2020,PNL001,LIVEBORN,CAR024,VENOUS AND ARTERIAL CATHETER PLACEMENT,602,NEONATE BWT 1000-1249G W RESP DIST SYND/OTH MAJ RESP OR MAJ ANOM,15,NEWBORNS AND OTHER NEONATES WITH CONDITIONS ORIGINATING IN THE PERINATAL PERIOD,3,Major,Moderate,Medical,Medicaid,,,01100,,N,623829.56,206074.43
Long Island,Nassau,2908000,000511,NYU Langone Hospital-Long Island,0 to 17,113,F,Other Race,Spanish/Hispanic,59,Newborn,Home or Self Care,2020,PNL001,LIVEBORN,RES007,AIRWAY INTUBATION,602,NEONATE BWT 1000-1249G W RESP DIST SYND/OTH MAJ RESP OR MAJ ANOM,15,NEWBORNS AND OTHER NEONATES WITH CONDITIONS ORIGINATING IN THE PERINATAL PERIOD,3,Major,Major,Medical,Blue Cross/Blue Shield,Private Health Insurance,,01000,,N,844299.16,267791.36
Long Island,Nassau,2908000,000511,NYU Langone Hospital-Long Island,0 to 17,115,F,Black/African American,Not Span/Hispanic,65,Newborn,Home w/ Home Health Services,2020,PNL001,LIVEBORN,EST002,PHOTOTHERAPY,602,NEONATE BWT 1000-1249G W RESP DIST SYND/OTH MAJ RESP OR MAJ ANOM,15,NEWBORNS AND OTHER NEONATES WITH CONDITIONS ORIGINATING IN THE PERINATAL PERIOD,3,Major,Major,Medical,Blue Cross/Blue Shield,,,01000,,N,923745.11,298883.05
Long Island,Nassau,2908000,000511,NYU Langone Hospital-Long Island,0 to 17,115,F,Other Race,Not Span/Hispanic,81,Urgent,Home w/ Home Health Services,2020,PNL002,SHORT GESTATION; LOW BIRTH WEIGHT; AND FETAL GROWTH RETARDATION,ESA003,MECHANICAL VENTILATION,602,NEONATE BWT 1000-1249G W RESP DIST SYND/OTH MAJ RESP OR MAJ ANOM,15,NEWBORNS AND OTHER NEONATES WITH CONDITIONS ORIGINATING IN THE PERINATAL PERIOD,4,Extreme,Major,Medical,Medicaid,,,01000,,N,1371101.66,402525.14
Long Island,Nassau,2908000,000511,NYU Langone Hospital-Long Island,0 to 17,115,M,White,Spanish/Hispanic,64,Newborn,Home w/ Home Health Services,2020,PNL001,LIVEBORN,RES007,AIRWAY INTUBATION,602,NEONATE BWT 1000-1249G W RESP DIST SYND/OTH MAJ RESP OR MAJ ANOM,15,NEWBORNS AND OTHER NEONATES WITH CONDITIONS ORIGINATING IN THE PERINATAL PERIOD,3,Major,Moderate,Medical,Medicaid,,,01100,,N,908691.91,293757.35
Long Island,Nassau,2908000,000511,NYU Langone Hospital-Long Island,0 to 17,113,M,Black/African American,Not Span/Hispanic,43,Newborn,Home or Self Care,2020,PNL001,LIVEBORN,CAR024,VENOUS AND ARTERIAL CATHETER PLACEMENT,602,NEONATE BWT 1000-1249G W RESP DIST SYND/OTH MAJ RESP OR MAJ ANOM,15,NEWBORNS AND OTHER NEONATES WITH CONDITIONS ORIGINATING IN THE PERINATAL PERIOD,4,Extreme,Moderate,Medical,Blue Cross/Blue Shield,Private Health Insurance,,01100,,N,683799.11,206701.07
Long Island,Nassau,2908000,000511,NYU Langone Hospital-Long Island,0 to 17,115,F,Other Race,Not Span/Hispanic,59,Newborn,Home w/ Home Health Services,2020,PNL001,LIVEBORN,RES007,AIRWAY INTUBATION,602,NEONATE BWT 1000-1249G W RESP DIST SYND/OTH MAJ RESP OR MAJ ANOM,15,NEWBORNS AND OTHER NEONATES WITH CONDITIONS ORIGINATING IN THE PERINATAL PERIOD,3,Major,Moderate,Medical,Medicare,,,01200,,N,953052.83,270809.27
Long Island,Nassau,2908000,000511,NYU Langone Hospital-Long Island,0 to 17,114,F,Black/African American,Not Span/Hispanic,34,Newborn,Home w/ Home Health Services,2020,PNL001,LIVEBORN,ESA004,NON-INVASIVE VENTILATION,602,NEONATE BWT 1000-1249G W RESP DIST SYND/OTH MAJ RESP OR MAJ ANOM,15,NEWBORNS AND OTHER NEONATES WITH CONDITIONS ORIGINATING IN THE PERINATAL PERIOD,3,Major,Minor,Medical,Medicaid,,,01200,,N,405776.71,130673
Long Island,Nassau,2908000,000511,NYU Langone Hospital-Long Island,0 to 17,117,F,White,Not Span/Hispanic,45,Newborn,Home or Self Care,2020,PNL001,LIVEBORN,ESA004,NON-INVASIVE VENTILATION,602,NEONATE BWT 1000-1249G W RESP DIST SYND/OTH MAJ RESP OR MAJ ANOM,15,NEWBORNS AND OTHER NEONATES WITH CONDITIONS ORIGINATING IN THE PERINATAL PERIOD,2,Moderate,Minor,Medical,Medicaid,,,01000,,N,556851.71,180481.99
Long Island,Nassau,2908000,000511,NYU Langone Hospital-Long Island,0 to 17,117,M,Black/African American,Unknown,38,Newborn,Home w/ Home Health Services,2020,PNL001,LIVEBORN,EST002,PHOTOTHERAPY,602,NEONATE BWT 1000-1249G W RESP DIST SYND/OTH MAJ RESP OR MAJ ANOM,15,NEWBORNS AND OTHER NEONATES WITH CONDITIONS ORIGINATING IN THE PERINATAL PERIOD,3,Major,Moderate,Medical,Medicaid,,,01100,,N,568396.27,194825.6
Long Island,Nassau,2908000,000511,NYU Langone Hospital-Long Island,0 to 17,117,F,White,Not Span/Hispanic,56,Newborn,Home w/ Home Health Services,2020,PNL001,LIVEBORN,ESA004,NON-INVASIVE VENTILATION,602,NEONATE BWT 1000-1249G W RESP DIST SYND/OTH MAJ RESP OR MAJ ANOM,15,NEWBORNS AND OTHER NEONATES WITH CONDITIONS ORIGINATING IN THE PERINATAL PERIOD,3,Major,Minor,Medical,Private Health Insurance,,,01000,,N,808868.7,249018.43
Long Island,Nassau,2908000,000511,NYU Langone Hospital-Long Island,0 to 17,117,F,White,Not Span/Hispanic,44,Newborn,Home w/ Home Health Services,2020,PNL001,LIVEBORN,CAR024,VENOUS AND ARTERIAL CATHETER PLACEMENT,602,NEONATE BWT 1000-1249G W RESP DIST SYND/OTH MAJ RESP OR MAJ ANOM,15,NEWBORNS AND OTHER NEONATES WITH CONDITIONS ORIGINATING IN THE PERINATAL PERIOD,3,Major,Moderate,Medical,Private Health Insurance,,,01100,,N,713973.47,229809.46
Long Island,Nassau,2908000,000511,NYU Langone Hospital-Long Island,0 to 17,119,M,Black/African American,Not Span/Hispanic,54,Newborn,Home or Self Care,2020,PNL001,LIVEBORN,RES007,AIRWAY INTUBATION,602,NEONATE BWT 1000-1249G W RESP DIST SYND/OTH MAJ RESP OR MAJ ANOM,15,NEWBORNS AND OTHER NEONATES WITH CONDITIONS ORIGINATING IN THE PERINATAL PERIOD,3,Major,Minor,Medical,Medicaid,,,01100,,N,866398.8,284838.57
Long Island,Nassau,2908000,000511,NYU Langone Hospital-Long Island,0 to 17,114,M,Black/African American,Not Span/Hispanic,67,Newborn,Home w/ Home Health Services,2020,PNL001,LIVEBORN,MRS001,CIRCUMCISION,602,NEONATE BWT 1000-1249G W RESP DIST SYND/OTH MAJ RESP OR MAJ ANOM,15,NEWBORNS AND OTHER NEONATES WITH CONDITIONS ORIGINATING IN THE PERINATAL PERIOD,4,Extreme,Extreme,Medical,Private Health Insurance,,,01000,,N,1356718.74,370075.32
