Hospital Service Area,Hospital County,Operating Certificate Number,Permanent Facility Id,Facility Name,Age Group,Zip Code - 3 digits,Gender,Race,Ethnicity,Length of Stay,Type of Admission,Patient Disposition,Discharge Year,CCS Diagnosis Code,CCS Diagnosis Description,CCS Procedure Code,CCS Procedure Description,APR DRG Code,APR DRG Description,APR MDC Code,APR MDC Description,APR Severity of Illness Code,APR Severity of Illness Description,APR Risk of Mortality,APR Medical Surgical Description,Payment Typology 1,Payment Typology 2,Payment Typology 3,Birth Weight,Abortion Edit Indicator,Emergency Department Indicator,Total Charges,Total Costs
New York City,Manhattan,7002054,001458,New York-Presbyterian Hospital - New York Weill Cornell Center,0 to 17,113,F,Other Race,Not Span/Hispanic,37,Newborn,Home or Self Care,2020,PNL001,LIVEBORN,CAR024,VENOUS AND ARTERIAL CATHETER PLACEMENT,607,NEONATE BWT 1250-1499G W RESP DIST SYND/OTH MAJ RESP OR MAJ ANOM,15,NEWBORNS AND OTHER NEONATES WITH CONDITIONS ORIGINATING IN THE PERINATAL PERIOD,3,Major,Minor,Medical,Private Health Insurance,,,01300,,N,786332.77,164054.21
New York City,Manhattan,7002054,001458,New York-Presbyterian Hospital - New York Weill Cornell Center,0 to 17,113,M,Other Race,Spanish/Hispanic,61,Newborn,Home or Self Care,2020,PNL001,LIVEBORN,ESA003,MECHANICAL VENTILATION,607,NEONATE BWT 1250-1499G W RESP DIST SYND/OTH MAJ RESP OR MAJ ANOM,15,NEWBORNS AND OTHER NEONATES WITH CONDITIONS ORIGINATING IN THE PERINATAL PERIOD,3,Major,Moderate,Medical,"Managed Care, Unspecified",Medicaid,Self-Pay,01400,,N,1289810.16,268657.37
New York City,Manhattan,7002054,001458,New York-Presbyterian Hospital - New York Weill Cornell Center,0 to 17,104,M,Black/African American,Not Span/Hispanic,55,Newborn,Home or Self Care,2020,PNL001,LIVEBORN,ESA003,MECHANICAL VENTILATION,607,NEONATE BWT 1250-1499G W RESP DIST SYND/OTH MAJ RESP OR MAJ ANOM,15,NEWBORNS AND OTHER NEONATES WITH CONDITIONS ORIGINATING IN THE PERINATAL PERIOD,3,Major,Major,Medical,Medicaid,Self-Pay,,01400,,N,1171894.15,244114.96
New York City,Manhattan,7002054,001458,New York-Presbyterian Hospital - New York Weill Cornell Center,0 to 17,112,M,Black/African American,Not Span/Hispanic,115,Newborn,Home or Self Care,2020,PNL001,LIVEBORN,CAR010,LIGATION AND EMBOLIZATION OF VESSELS,607,NEONATE BWT 1250-1499G W RESP DIST SYND/OTH MAJ RESP OR MAJ ANOM,15,NEWBORNS AND OTHER NEONATES WITH CONDITIONS ORIGINATING IN THE PERINATAL PERIOD,4,Extreme,Major,Medical,Medicaid,Self-Pay,,01200,,N,2703541.73,586261.15
New York City,Kings,7002053,001304,NYU Langone Hospital-Brooklyn,0 to 17,112,M,White,Not Span/Hispanic,32,Emergency,Home or Self Care,2020,PNL001,LIVEBORN,CAR024,VENOUS AND ARTERIAL CATHETER PLACEMENT,607,NEONATE BWT 1250-1499G W RESP DIST SYND/OTH MAJ RESP OR MAJ ANOM,15,NEWBORNS AND OTHER NEONATES WITH CONDITIONS ORIGINATING IN THE PERINATAL PERIOD,3,Major,Moderate,Medical,Medicaid,,,01400,,Y,414433.98,141545.72
New York City,Bronx,7000001,001178,BronxCare Hospital Center,0 to 17,104,F,Other Race,Spanish/Hispanic,70,Newborn,Home or Self Care,2020,PNL001,LIVEBORN,ADM001,TRANSFUSION OF BLOOD AND BLOOD PRODUCTS,607,NEONATE BWT 1250-1499G W RESP DIST SYND/OTH MAJ RESP OR MAJ ANOM,15,NEWBORNS AND OTHER NEONATES WITH CONDITIONS ORIGINATING IN THE PERINATAL PERIOD,3,Major,Moderate,Medical,Medicaid,,,01300,,N,227757.42,289305.66
Capital/Adirond,Albany,0101000,000001,Albany Medical Center Hospital,0 to 17,121,F,Other Race,Unknown,43,Urgent,Home or Self Care,2020,PNL002,SHORT GESTATION; LOW BIRTH WEIGHT; AND FETAL GROWTH RETARDATION,ESA003,MECHANICAL VENTILATION,607,NEONATE BWT 1250-1499G W RESP DIST SYND/OTH MAJ RESP OR MAJ ANOM,15,NEWBORNS AND OTHER NEONATES WITH CONDITIONS ORIGINATING IN THE PERINATAL PERIOD,3,Major,Minor,Medical,"Managed Care, Unspecified",,,01300,,N,392912.53,88473.38
Capital/Adirond,Albany,0101000,000001,Albany Medical Center Hospital,0 to 17,122,F,Other Race,Unknown,40,Newborn,Home or Self Care,2020,PNL001,LIVEBORN,,,607,NEONATE BWT 1250-1499G W RESP DIST SYND/OTH MAJ RESP OR MAJ ANOM,15,NEWBORNS AND OTHER NEONATES WITH CONDITIONS ORIGINATING IN THE PERINATAL PERIOD,3,Major,Minor,Medical,Medicaid,,,01300,,N,365530.58,82860.39
Capital/Adirond,Albany,0101000,000001,Albany Medical Center Hospital,0 to 17,121,F,Other Race,Unknown,30,Newborn,Home or Self Care,2020,PNL001,LIVEBORN,ADM010,VACCINATIONS,607,NEONATE BWT 1250-1499G W RESP DIST SYND/OTH MAJ RESP OR MAJ ANOM,15,NEWBORNS AND OTHER NEONATES WITH CONDITIONS ORIGINATING IN THE PERINATAL PERIOD,2,Moderate,Minor,Medical,"Managed Care, Unspecified",,,01200,,N,248943.35,55861.48
New York City,Bronx,7000006,003058,Montefiore Med Center - Jack D Weiler Hosp of A Einstein College Div,0 to 17,104,M,Other Race,Spanish/Hispanic,68,Newborn,Home or Self Care,2020,PNL001,LIVEBORN,ADM010,VACCINATIONS,607,NEONATE BWT 1250-1499G W RESP DIST SYND/OTH MAJ RESP OR MAJ ANOM,15,NEWBORNS AND OTHER NEONATES WITH CONDITIONS ORIGINATING IN THE PERINATAL PERIOD,3,Major,Moderate,Medical,Medicaid,,,01300,,N,1373792.02,168680.16
Long Island,Nassau,2908000,000511,NYU Langone Hospital-Long Island,0 to 17,117,F,White,Not Span/Hispanic,44,Newborn,Home or Self Care,2020,PNL001,LIVEBORN,RES005,CHEST TUBE PLACEMENT AND THERAPEUTIC THORACENTESIS,607,NEONATE BWT 1250-1499G W RESP DIST SYND/OTH MAJ RESP OR MAJ ANOM,15,NEWBORNS AND OTHER NEONATES WITH CONDITIONS ORIGINATING IN THE PERINATAL PERIOD,3,Major,Moderate,Medical,Blue Cross/Blue Shield,,,01200,,N,666161.89,208545.9
Central NY,Onondaga,3301008,000636,Crouse Hospital,0 to 17,134,F,Other Race,Not Span/Hispanic,64,Newborn,Short-term Hospital,2020,PNL001,LIVEBORN,ESA003,MECHANICAL VENTILATION,607,NEONATE BWT 1250-1499G W RESP DIST SYND/OTH MAJ RESP OR MAJ ANOM,15,NEWBORNS AND OTHER NEONATES WITH CONDITIONS ORIGINATING IN THE PERINATAL PERIOD,4,Extreme,Moderate,Medical,Private Health Insurance,,,01200,,N,228282.05,103647.86
Central NY,Onondaga,3301008,000636,Crouse Hospital,0 to 17,138,M,White,Not Span/Hispanic,52,Newborn,Home or Self Care,2020,PNL001,LIVEBORN,EST002,PHOTOTHERAPY,607,NEONATE BWT 1250-1499G W RESP DIST SYND/OTH MAJ RESP OR MAJ ANOM,15,NEWBORNS AND OTHER NEONATES WITH CONDITIONS ORIGINATING IN THE PERINATAL PERIOD,3,Major,Minor,Medical,Medicaid,,,01300,,N,164417.19,75098
Western NY,Erie,1401014,000208,John R. Oishei Children's Hospital,0 to 17,142,M,Black/African American,Not Span/Hispanic,64,Newborn,Home w/ Home Health Services,2020,PNL001,LIVEBORN,ESA004,NON-INVASIVE VENTILATION,607,NEONATE BWT 1250-1499G W RESP DIST SYND/OTH MAJ RESP OR MAJ ANOM,15,NEWBORNS AND OTHER NEONATES WITH CONDITIONS ORIGINATING IN THE PERINATAL PERIOD,4,Extreme,Major,Medical,Medicaid,Self-Pay,,01400,,Y,627398.58,144320.41
Western NY,Erie,1401014,000208,John R. Oishei Children's Hospital,0 to 17,141,F,White,Not Span/Hispanic,34,Newborn,Home or Self Care,2020,PNL001,LIVEBORN,ESA003,MECHANICAL VENTILATION,607,NEONATE BWT 1250-1499G W RESP DIST SYND/OTH MAJ RESP OR MAJ ANOM,15,NEWBORNS AND OTHER NEONATES WITH CONDITIONS ORIGINATING IN THE PERINATAL PERIOD,3,Major,Moderate,Medical,Private Health Insurance,Self-Pay,,01400,,N,287278.2,63664.4
New York City,Manhattan,7002054,001464,New York-Presbyterian Hospital - Columbia Presbyterian Center,0 to 17,109,M,White,Not Span/Hispanic,120 +,Newborn,Cancer Center or Children's Hospital,2020,PNL001,LIVEBORN,ESA003,MECHANICAL VENTILATION,607,NEONATE BWT 1250-1499G W RESP DIST SYND/OTH MAJ RESP OR MAJ ANOM,15,NEWBORNS AND OTHER NEONATES WITH CONDITIONS ORIGINATING IN THE PERINATAL PERIOD,4,Extreme,Extreme,Medical,Medicaid,Medicaid,Self-Pay,01200,,N,4978654.41,1257718.69
New York City,Manhattan,7002054,001458,New York-Presbyterian Hospital - New York Weill Cornell Center,0 to 17,100,M,Other Race,Not Span/Hispanic,56,Newborn,Home or Self Care,2020,PNL001,LIVEBORN,ADM015,ADMINISTRATION OF ANTIBIOTICS,607,NEONATE BWT 1250-1499G W RESP DIST SYND/OTH MAJ RESP OR MAJ ANOM,15,NEWBORNS AND OTHER NEONATES WITH CONDITIONS ORIGINATING IN THE PERINATAL PERIOD,2,Moderate,Minor,Medical,Private Health Insurance,,,01400,,N,1224227.93,256494.22
New York City,Queens,7003010,001637,New York - Presbyterian/Queens,0 to 17,113,M,Other Race,Not Span/Hispanic,74,Newborn,Short-term Hospital,2020,PNL001,LIVEBORN,ESA003,MECHANICAL VENTILATION,607,NEONATE BWT 1250-1499G W RESP DIST SYND/OTH MAJ RESP OR MAJ ANOM,15,NEWBORNS AND OTHER NEONATES WITH CONDITIONS ORIGINATING IN THE PERINATAL PERIOD,3,Major,Moderate,Medical,"Managed Care, Unspecified",Medicaid,Self-Pay,01300,,N,967657.13,162212.31
New York City,Kings,7001021,001306,New York - Presbyterian Brooklyn Methodist Hospital,0 to 17,112,M,Other Race,Not Span/Hispanic,52,Newborn,Home or Self Care,2020,PNL001,LIVEBORN,MRS001,CIRCUMCISION,607,NEONATE BWT 1250-1499G W RESP DIST SYND/OTH MAJ RESP OR MAJ ANOM,15,NEWBORNS AND OTHER NEONATES WITH CONDITIONS ORIGINATING IN THE PERINATAL PERIOD,3,Major,Moderate,Medical,Private Health Insurance,Self-Pay,,01200,,N,642193.12,164710.45
New York City,Kings,7001021,001306,New York - Presbyterian Brooklyn Methodist Hospital,0 to 17,112,F,Other Race,Not Span/Hispanic,120 +,Newborn,Home or Self Care,2020,PNL001,LIVEBORN,ADM017,ADMINISTRATION OF NUTRITIONAL AND ELECTROLYTIC SUBSTANCES,607,NEONATE BWT 1250-1499G W RESP DIST SYND/OTH MAJ RESP OR MAJ ANOM,15,NEWBORNS AND OTHER NEONATES WITH CONDITIONS ORIGINATING IN THE PERINATAL PERIOD,3,Major,Minor,Medical,"Managed Care, Unspecified",Medicaid,Self-Pay,01300,,N,1363104.37,350388.12
New York City,Manhattan,7002054,001458,New York-Presbyterian Hospital - New York Weill Cornell Center,0 to 17,,F,White,Not Span/Hispanic,29,Newborn,Home or Self Care,2020,PNL001,LIVEBORN,ESA004,NON-INVASIVE VENTILATION,607,NEONATE BWT 1250-1499G W RESP DIST SYND/OTH MAJ RESP OR MAJ ANOM,15,NEWBORNS AND OTHER NEONATES WITH CONDITIONS ORIGINATING IN THE PERINATAL PERIOD,2,Moderate,Minor,Medical,Private Health Insurance,Private Health Insurance,,01300,,N,602878.24,125333.52
New York City,Manhattan,7002024,001456,Mount Sinai Hospital,0 to 17,100,F,Black/African American,Unknown,40,Newborn,Home or Self Care,2020,PNL001,LIVEBORN,ESA004,NON-INVASIVE VENTILATION,607,NEONATE BWT 1250-1499G W RESP DIST SYND/OTH MAJ RESP OR MAJ ANOM,15,NEWBORNS AND OTHER NEONATES WITH CONDITIONS ORIGINATING IN THE PERINATAL PERIOD,2,Moderate,Minor,Medical,Medicaid,Self-Pay,,01200,,N,848514.66,212911.43
New York City,Kings,7002053,001304,NYU Langone Hospital-Brooklyn,0 to 17,112,M,Other Race,Not Span/Hispanic,49,Newborn,Home or Self Care,2020,PNL001,LIVEBORN,ADM010,VACCINATIONS,607,NEONATE BWT 1250-1499G W RESP DIST SYND/OTH MAJ RESP OR MAJ ANOM,15,NEWBORNS AND OTHER NEONATES WITH CONDITIONS ORIGINATING IN THE PERINATAL PERIOD,3,Major,Minor,Medical,Medicaid,,,01400,,N,599380.48,211514.04
New York City,Bronx,7000006,003058,Montefiore Med Center - Jack D Weiler Hosp of A Einstein College Div,0 to 17,104,F,Other Race,Unknown,35,Newborn,Home w/ Home Health Services,2020,PNL001,LIVEBORN,ESA004,NON-INVASIVE VENTILATION,607,NEONATE BWT 1250-1499G W RESP DIST SYND/OTH MAJ RESP OR MAJ ANOM,15,NEWBORNS AND OTHER NEONATES WITH CONDITIONS ORIGINATING IN THE PERINATAL PERIOD,2,Moderate,Minor,Medical,Private Health Insurance,,,01400,,N,709323.85,87902.56
New York City,Bronx,7000006,001168,Montefiore Medical Center-Wakefield Hospital,0 to 17,104,M,Other Race,Unknown,32,Newborn,Home w/ Home Health Services,2020,PNL001,LIVEBORN,ESA004,NON-INVASIVE VENTILATION,607,NEONATE BWT 1250-1499G W RESP DIST SYND/OTH MAJ RESP OR MAJ ANOM,15,NEWBORNS AND OTHER NEONATES WITH CONDITIONS ORIGINATING IN THE PERINATAL PERIOD,3,Major,Moderate,Medical,Medicaid,,,01400,,N,656689.61,81607.14
Capital/Adirond,Albany,0101000,000001,Albany Medical Center Hospital,0 to 17,OOS,M,Other Race,Unknown,43,Newborn,Home or Self Care,2020,PNL001,LIVEBORN,GNR002,ABDOMINAL WALL REPAIR (INCLUDING HERNIA),607,NEONATE BWT 1250-1499G W RESP DIST SYND/OTH MAJ RESP OR MAJ ANOM,15,NEWBORNS AND OTHER NEONATES WITH CONDITIONS ORIGINATING IN THE PERINATAL PERIOD,3,Major,Moderate,Medical,Medicaid,,,01400,,N,381695.58,87106
New York City,Bronx,7000006,003058,Montefiore Med Center - Jack D Weiler Hosp of A Einstein College Div,0 to 17,104,M,Other Race,Unknown,52,Newborn,Home or Self Care,2020,PNL001,LIVEBORN,ESA004,NON-INVASIVE VENTILATION,607,NEONATE BWT 1250-1499G W RESP DIST SYND/OTH MAJ RESP OR MAJ ANOM,15,NEWBORNS AND OTHER NEONATES WITH CONDITIONS ORIGINATING IN THE PERINATAL PERIOD,3,Major,Moderate,Medical,Private Health Insurance,,,01200,,N,1064506.69,130785.61
New York City,Richmond,7004003,001740,Staten Island University Hosp-North,0 to 17,103,M,White,Not Span/Hispanic,41,Newborn,Home or Self Care,2020,PNL001,LIVEBORN,CAR024,VENOUS AND ARTERIAL CATHETER PLACEMENT,607,NEONATE BWT 1250-1499G W RESP DIST SYND/OTH MAJ RESP OR MAJ ANOM,15,NEWBORNS AND OTHER NEONATES WITH CONDITIONS ORIGINATING IN THE PERINATAL PERIOD,3,Major,Minor,Medical,Private Health Insurance,Private Health Insurance,,01300,,N,154779.55,92683.91
New York City,Richmond,7004003,001740,Staten Island University Hosp-North,0 to 17,103,M,White,Not Span/Hispanic,83,Newborn,Home or Self Care,2020,PNL001,LIVEBORN,CAR024,VENOUS AND ARTERIAL CATHETER PLACEMENT,607,NEONATE BWT 1250-1499G W RESP DIST SYND/OTH MAJ RESP OR MAJ ANOM,15,NEWBORNS AND OTHER NEONATES WITH CONDITIONS ORIGINATING IN THE PERINATAL PERIOD,4,Extreme,Minor,Medical,Medicaid,Medicaid,,01300,,N,341147.18,194536.6
New York City,Bronx,7000006,003058,Montefiore Med Center - Jack D Weiler Hosp of A Einstein College Div,0 to 17,104,M,Other Race,Unknown,65,Newborn,Home or Self Care,2020,PNL001,LIVEBORN,ESA004,NON-INVASIVE VENTILATION,607,NEONATE BWT 1250-1499G W RESP DIST SYND/OTH MAJ RESP OR MAJ ANOM,15,NEWBORNS AND OTHER NEONATES WITH CONDITIONS ORIGINATING IN THE PERINATAL PERIOD,4,Extreme,Moderate,Medical,Private Health Insurance,,,01200,,N,1292900.34,160048.54
New York City,Manhattan,7002032,001466,Mount Sinai West,0 to 17,OOS,M,Other Race,Not Span/Hispanic,69,Newborn,Home or Self Care,2020,PNL001,LIVEBORN,RES007,AIRWAY INTUBATION,607,NEONATE BWT 1250-1499G W RESP DIST SYND/OTH MAJ RESP OR MAJ ANOM,15,NEWBORNS AND OTHER NEONATES WITH CONDITIONS ORIGINATING IN THE PERINATAL PERIOD,3,Major,Moderate,Medical,Private Health Insurance,Self-Pay,,01300,,N,1487319.3,232705.72
New York City,Manhattan,7002017,001450,Lenox Hill Hospital,0 to 17,104,F,Other Race,Spanish/Hispanic,73,Newborn,Home or Self Care,2020,PNL001,LIVEBORN,ESA003,MECHANICAL VENTILATION,607,NEONATE BWT 1250-1499G W RESP DIST SYND/OTH MAJ RESP OR MAJ ANOM,15,NEWBORNS AND OTHER NEONATES WITH CONDITIONS ORIGINATING IN THE PERINATAL PERIOD,3,Major,Minor,Medical,Medicaid,Medicaid,,01400,,N,1162442.2,177220.67
New York City,Manhattan,7002017,001450,Lenox Hill Hospital,0 to 17,104,F,Black/African American,Not Span/Hispanic,61,Newborn,Home or Self Care,2020,PNL001,LIVEBORN,CAR024,VENOUS AND ARTERIAL CATHETER PLACEMENT,607,NEONATE BWT 1250-1499G W RESP DIST SYND/OTH MAJ RESP OR MAJ ANOM,15,NEWBORNS AND OTHER NEONATES WITH CONDITIONS ORIGINATING IN THE PERINATAL PERIOD,2,Moderate,Minor,Medical,Private Health Insurance,Self-Pay,,01400,,N,983883.61,150161.16
New York City,Kings,7001003,001288,Brooklyn Hospital Center - Downtown Campus,0 to 17,112,M,Other Race,Not Span/Hispanic,26,Newborn,Home or Self Care,2020,PNL001,LIVEBORN,EST002,PHOTOTHERAPY,607,NEONATE BWT 1250-1499G W RESP DIST SYND/OTH MAJ RESP OR MAJ ANOM,15,NEWBORNS AND OTHER NEONATES WITH CONDITIONS ORIGINATING IN THE PERINATAL PERIOD,2,Moderate,Moderate,Medical,Medicaid,Medicaid,Self-Pay,01300,,N,318484.42,37595.23
Capital/Adirond,Albany,0101004,000005,St. Peter's Hospital,0 to 17,122,M,White,Not Span/Hispanic,40,Newborn,Home or Self Care,2020,PNL001,LIVEBORN,ESA004,NON-INVASIVE VENTILATION,607,NEONATE BWT 1250-1499G W RESP DIST SYND/OTH MAJ RESP OR MAJ ANOM,15,NEWBORNS AND OTHER NEONATES WITH CONDITIONS ORIGINATING IN THE PERINATAL PERIOD,2,Moderate,Moderate,Medical,Self-Pay,,,01400,,N,259755.4,76222.98
Long Island,Nassau,2951001,000541,North Shore University Hospital,0 to 17,114,F,Black/African American,Not Span/Hispanic,20,Newborn,Home or Self Care,2020,PNL001,LIVEBORN,ADM021,"ADMINISTRATION OF THERAPEUTIC SUBSTANCES, NEC",607,NEONATE BWT 1250-1499G W RESP DIST SYND/OTH MAJ RESP OR MAJ ANOM,15,NEWBORNS AND OTHER NEONATES WITH CONDITIONS ORIGINATING IN THE PERINATAL PERIOD,2,Moderate,Minor,Medical,Private Health Insurance,,,01400,,N,326448.88,45654.89
New York City,Bronx,7000001,001178,BronxCare Hospital Center,0 to 17,104,F,Other Race,Spanish/Hispanic,40,Newborn,Home or Self Care,2020,PNL001,LIVEBORN,ADM010,VACCINATIONS,607,NEONATE BWT 1250-1499G W RESP DIST SYND/OTH MAJ RESP OR MAJ ANOM,15,NEWBORNS AND OTHER NEONATES WITH CONDITIONS ORIGINATING IN THE PERINATAL PERIOD,4,Extreme,Major,Medical,Medicaid,,,01400,,N,138072.72,173036.69
Long Island,Suffolk,5151001,000245,Stony Brook University Hospital,0 to 17,117,M,White,Not Span/Hispanic,74,Newborn,Home or Self Care,2020,PNL001,LIVEBORN,RES007,AIRWAY INTUBATION,607,NEONATE BWT 1250-1499G W RESP DIST SYND/OTH MAJ RESP OR MAJ ANOM,15,NEWBORNS AND OTHER NEONATES WITH CONDITIONS ORIGINATING IN THE PERINATAL PERIOD,4,Extreme,Moderate,Medical,Blue Cross/Blue Shield,,,01300,,N,946161.9,223868.61
Long Island,Nassau,2950001,000527,Mount Sinai South Nassau,0 to 17,117,M,White,Not Span/Hispanic,41,Newborn,Home or Self Care,2020,PNL001,LIVEBORN,ESA003,MECHANICAL VENTILATION,607,NEONATE BWT 1250-1499G W RESP DIST SYND/OTH MAJ RESP OR MAJ ANOM,15,NEWBORNS AND OTHER NEONATES WITH CONDITIONS ORIGINATING IN THE PERINATAL PERIOD,3,Major,Moderate,Medical,Medicaid,Medicaid,,01400,,N,375707.67,35403.77
Long Island,Nassau,2908000,000511,NYU Langone Hospital-Long Island,0 to 17,114,F,Black/African American,Unknown,28,Newborn,Home or Self Care,2020,PNL001,LIVEBORN,ESA004,NON-INVASIVE VENTILATION,607,NEONATE BWT 1250-1499G W RESP DIST SYND/OTH MAJ RESP OR MAJ ANOM,15,NEWBORNS AND OTHER NEONATES WITH CONDITIONS ORIGINATING IN THE PERINATAL PERIOD,3,Major,Moderate,Medical,Private Health Insurance,Medicaid,,01300,,N,383665.65,125796.31
Long Island,Nassau,2908000,000511,NYU Langone Hospital-Long Island,0 to 17,114,F,Other Race,Not Span/Hispanic,70,Newborn,Home or Self Care,2020,PNL001,LIVEBORN,ESA003,MECHANICAL VENTILATION,607,NEONATE BWT 1250-1499G W RESP DIST SYND/OTH MAJ RESP OR MAJ ANOM,15,NEWBORNS AND OTHER NEONATES WITH CONDITIONS ORIGINATING IN THE PERINATAL PERIOD,4,Extreme,Major,Medical,Medicaid,,,01300,,N,1005882.69,318948.53
Long Island,Nassau,2908000,000511,NYU Langone Hospital-Long Island,0 to 17,115,M,White,Spanish/Hispanic,47,Newborn,Home or Self Care,2020,PNL001,LIVEBORN,GNR003,INGUINAL AND FEMORAL HERNIA REPAIR,607,NEONATE BWT 1250-1499G W RESP DIST SYND/OTH MAJ RESP OR MAJ ANOM,15,NEWBORNS AND OTHER NEONATES WITH CONDITIONS ORIGINATING IN THE PERINATAL PERIOD,3,Major,Major,Medical,Medicaid,,,01300,,N,641851.78,211799.42
Hudson Valley,Westchester,5957001,001139,Westchester Medical Center,0 to 17,127,M,White,Not Span/Hispanic,56,Newborn,Home w/ Home Health Services,2020,PNL001,LIVEBORN,EST002,PHOTOTHERAPY,607,NEONATE BWT 1250-1499G W RESP DIST SYND/OTH MAJ RESP OR MAJ ANOM,15,NEWBORNS AND OTHER NEONATES WITH CONDITIONS ORIGINATING IN THE PERINATAL PERIOD,3,Major,Minor,Medical,Private Health Insurance,Self-Pay,,01300,,N,1388173.55,147240.05
Hudson Valley,Westchester,5957001,001139,Westchester Medical Center,0 to 17,OOS,M,Other Race,Unknown,29,Urgent,Short-term Hospital,2020,PNL002,SHORT GESTATION; LOW BIRTH WEIGHT; AND FETAL GROWTH RETARDATION,ESA003,MECHANICAL VENTILATION,607,NEONATE BWT 1250-1499G W RESP DIST SYND/OTH MAJ RESP OR MAJ ANOM,15,NEWBORNS AND OTHER NEONATES WITH CONDITIONS ORIGINATING IN THE PERINATAL PERIOD,3,Major,Minor,Medical,Medicaid,,,01300,,N,773348.9,82998.89
New York City,Bronx,7000006,003058,Montefiore Med Center - Jack D Weiler Hosp of A Einstein College Div,0 to 17,104,M,Other Race,Unknown,76,Newborn,Home or Self Care,2020,PNL001,LIVEBORN,ESA004,NON-INVASIVE VENTILATION,607,NEONATE BWT 1250-1499G W RESP DIST SYND/OTH MAJ RESP OR MAJ ANOM,15,NEWBORNS AND OTHER NEONATES WITH CONDITIONS ORIGINATING IN THE PERINATAL PERIOD,4,Extreme,Moderate,Medical,Medicaid,,,01300,,N,1572635.13,196080.75
New York City,Queens,7003004,003376,Cohen Children's Medical Center,0 to 17,114,M,Other Race,Not Span/Hispanic,30,Newborn,Home or Self Care,2020,PNL001,LIVEBORN,MRS001,CIRCUMCISION,607,NEONATE BWT 1250-1499G W RESP DIST SYND/OTH MAJ RESP OR MAJ ANOM,15,NEWBORNS AND OTHER NEONATES WITH CONDITIONS ORIGINATING IN THE PERINATAL PERIOD,3,Major,Minor,Medical,Medicaid,Medicaid,Self-Pay,01300,,N,479939.15,61521.7
New York City,Queens,7001024,001635,St Johns Episcopal Hospital So Shore,0 to 17,116,F,Other Race,Unknown,38,Newborn,Home or Self Care,2020,PNL001,LIVEBORN,ESA004,NON-INVASIVE VENTILATION,607,NEONATE BWT 1250-1499G W RESP DIST SYND/OTH MAJ RESP OR MAJ ANOM,15,NEWBORNS AND OTHER NEONATES WITH CONDITIONS ORIGINATING IN THE PERINATAL PERIOD,1,Minor,Minor,Medical,Medicaid,Medicaid,,01300,,N,125103.58,45560.14
New York City,Queens,7003004,003376,Cohen Children's Medical Center,0 to 17,110,F,Other Race,Not Span/Hispanic,38,Newborn,Home or Self Care,2020,PNL001,LIVEBORN,ESA004,NON-INVASIVE VENTILATION,607,NEONATE BWT 1250-1499G W RESP DIST SYND/OTH MAJ RESP OR MAJ ANOM,15,NEWBORNS AND OTHER NEONATES WITH CONDITIONS ORIGINATING IN THE PERINATAL PERIOD,2,Moderate,Moderate,Medical,Medicaid,Medicaid,Self-Pay,01400,,N,627216.09,78186.36
New York City,Manhattan,7002053,001463,NYU Langone Hospitals,0 to 17,100,F,White,Not Span/Hispanic,27,Newborn,Home or Self Care,2020,PNL001,LIVEBORN,ADM010,VACCINATIONS,607,NEONATE BWT 1250-1499G W RESP DIST SYND/OTH MAJ RESP OR MAJ ANOM,15,NEWBORNS AND OTHER NEONATES WITH CONDITIONS ORIGINATING IN THE PERINATAL PERIOD,4,Extreme,Minor,Medical,Private Health Insurance,,,01400,,N,314807.78,107540.36
Central NY,Onondaga,3301008,000636,Crouse Hospital,0 to 17,136,M,White,Not Span/Hispanic,89,Newborn,Short-term Hospital,2020,PNL001,LIVEBORN,EST002,PHOTOTHERAPY,607,NEONATE BWT 1250-1499G W RESP DIST SYND/OTH MAJ RESP OR MAJ ANOM,15,NEWBORNS AND OTHER NEONATES WITH CONDITIONS ORIGINATING IN THE PERINATAL PERIOD,3,Major,Minor,Medical,Medicaid,,,01300,,N,253135.94,116754.27
Western NY,Erie,1401014,000208,John R. Oishei Children's Hospital,0 to 17,140,F,White,Not Span/Hispanic,53,Newborn,Home w/ Home Health Services,2020,PNL001,LIVEBORN,CAR024,VENOUS AND ARTERIAL CATHETER PLACEMENT,607,NEONATE BWT 1250-1499G W RESP DIST SYND/OTH MAJ RESP OR MAJ ANOM,15,NEWBORNS AND OTHER NEONATES WITH CONDITIONS ORIGINATING IN THE PERINATAL PERIOD,3,Major,Moderate,Medical,Medicaid,Self-Pay,,01200,,N,435794.18,97106.35
Western NY,Erie,1401014,000208,John R. Oishei Children's Hospital,0 to 17,142,F,Other Race,Not Span/Hispanic,54,Newborn,Home w/ Home Health Services,2020,PNL001,LIVEBORN,RES007,AIRWAY INTUBATION,607,NEONATE BWT 1250-1499G W RESP DIST SYND/OTH MAJ RESP OR MAJ ANOM,15,NEWBORNS AND OTHER NEONATES WITH CONDITIONS ORIGINATING IN THE PERINATAL PERIOD,3,Major,Major,Medical,Medicaid,Self-Pay,,01400,,N,495153.92,111761.21
Western NY,Erie,1401014,000208,John R. Oishei Children's Hospital,0 to 17,,F,White,Spanish/Hispanic,42,Newborn,Home w/ Home Health Services,2020,PNL001,LIVEBORN,ESA003,MECHANICAL VENTILATION,607,NEONATE BWT 1250-1499G W RESP DIST SYND/OTH MAJ RESP OR MAJ ANOM,15,NEWBORNS AND OTHER NEONATES WITH CONDITIONS ORIGINATING IN THE PERINATAL PERIOD,3,Major,Moderate,Medical,Medicaid,Self-Pay,,01400,,N,352172.87,77836.16
Western NY,Erie,1401014,000208,John R. Oishei Children's Hospital,0 to 17,142,M,White,Spanish/Hispanic,33,Newborn,Home w/ Home Health Services,2020,PNL001,LIVEBORN,ESA004,NON-INVASIVE VENTILATION,607,NEONATE BWT 1250-1499G W RESP DIST SYND/OTH MAJ RESP OR MAJ ANOM,15,NEWBORNS AND OTHER NEONATES WITH CONDITIONS ORIGINATING IN THE PERINATAL PERIOD,3,Major,Major,Medical,Medicaid,Self-Pay,,01300,,N,277143.41,61214.57