Hospital Service Area,Hospital County,Operating Certificate Number,Permanent Facility Id,Facility Name,Age Group,Zip Code - 3 digits,Gender,Race,Ethnicity,Length of Stay,Type of Admission,Patient Disposition,Discharge Year,CCS Diagnosis Code,CCS Diagnosis Description,CCS Procedure Code,CCS Procedure Description,APR DRG Code,APR DRG Description,APR MDC Code,APR MDC Description,APR Severity of Illness Code,APR Severity of Illness Description,APR Risk of Mortality,APR Medical Surgical Description,Payment Typology 1,Payment Typology 2,Payment Typology 3,Birth Weight,Abortion Edit Indicator,Emergency Department Indicator,Total Charges,Total Costs
New York City,Manhattan,7002054,001458,New York-Presbyterian Hospital - New York Weill Cornell Center,0 to 17,112,M,White,Not Span/Hispanic,33,Newborn,Home or Self Care,2018,PNL001,LIVEBORN,CAR024,VENOUS AND ARTERIAL CATHETER PLACEMENT,612,NEONATE BWT 1500-1999G W RESP DIST SYND/OTH MAJ RESP COND,15,NEWBORNS AND OTHER NEONATES WITH CONDITIONS ORIGINATING IN THE PERINATAL PERIOD,2,Moderate,Minor,Medical,"Managed Care, Unspecified",Medicaid,Self-Pay,01800,,false,666835.93,137178.25
Hudson Valley,Westchester,5902001,001045,White Plains Hospital Center,0 to 17,107,M,Other Race,Not Span/Hispanic,8,Newborn,Home or Self Care,2018,PNL001,LIVEBORN,ESA004,NON-INVASIVE VENTILATION,612,NEONATE BWT 1500-1999G W RESP DIST SYND/OTH MAJ RESP COND,15,NEWBORNS AND OTHER NEONATES WITH CONDITIONS ORIGINATING IN THE PERINATAL PERIOD,2,Moderate,Minor,Medical,Private Health Insurance,,,01900,,false,77874,25012.44
New York City,Queens,7003007,001633,Queens Hospital Center,0 to 17,113,M,Other Race,Unknown,13,Newborn,Home or Self Care,2018,PNL001,LIVEBORN,ESA004,NON-INVASIVE VENTILATION,612,NEONATE BWT 1500-1999G W RESP DIST SYND/OTH MAJ RESP COND,15,NEWBORNS AND OTHER NEONATES WITH CONDITIONS ORIGINATING IN THE PERINATAL PERIOD,1,Minor,Minor,Medical,Medicaid,Medicaid,,01800,,false,76484.87,40840.55
New York City,Manhattan,7002054,001464,New York-Presbyterian Hospital - Columbia Presbyterian Center,0 to 17,104,F,Other Race,Not Span/Hispanic,25,Newborn,Home or Self Care,2018,PNL001,LIVEBORN,ESA004,NON-INVASIVE VENTILATION,612,NEONATE BWT 1500-1999G W RESP DIST SYND/OTH MAJ RESP COND,15,NEWBORNS AND OTHER NEONATES WITH CONDITIONS ORIGINATING IN THE PERINATAL PERIOD,1,Minor,Minor,Medical,Medicaid,Medicaid,Self-Pay,01700,,false,486448.86,97544.47
New York City,Kings,7001035,001318,Wyckoff Heights Medical Center,0 to 17,113,F,Other Race,Not Span/Hispanic,39,Newborn,Home or Self Care,2018,PNL001,LIVEBORN,ESA004,NON-INVASIVE VENTILATION,612,NEONATE BWT 1500-1999G W RESP DIST SYND/OTH MAJ RESP COND,15,NEWBORNS AND OTHER NEONATES WITH CONDITIONS ORIGINATING IN THE PERINATAL PERIOD,2,Moderate,Moderate,Medical,Medicaid,Miscellaneous/Other,,01700,,false,138217.72,51932
New York City,Manhattan,7002054,001464,New York-Presbyterian Hospital - Columbia Presbyterian Center,0 to 17,100,F,Other Race,Spanish/Hispanic,15,Newborn,Home or Self Care,2018,PNL001,LIVEBORN,ESA004,NON-INVASIVE VENTILATION,612,NEONATE BWT 1500-1999G W RESP DIST SYND/OTH MAJ RESP COND,15,NEWBORNS AND OTHER NEONATES WITH CONDITIONS ORIGINATING IN THE PERINATAL PERIOD,1,Minor,Minor,Medical,Blue Cross/Blue Shield,Self-Pay,,01500,,false,290280.91,57739.66
New York City,Manhattan,7002054,001464,New York-Presbyterian Hospital - Columbia Presbyterian Center,0 to 17,104,F,White,Not Span/Hispanic,36,Newborn,Home or Self Care,2018,PNL001,LIVEBORN,ADM017,ADMINISTRATION OF NUTRITIONAL AND ELECTROLYTIC SUBSTANCES,612,NEONATE BWT 1500-1999G W RESP DIST SYND/OTH MAJ RESP COND,15,NEWBORNS AND OTHER NEONATES WITH CONDITIONS ORIGINATING IN THE PERINATAL PERIOD,2,Moderate,Minor,Medical,Blue Cross/Blue Shield,Self-Pay,,01700,,false,695305.54,138888.73
New York City,Manhattan,7002054,001464,New York-Presbyterian Hospital - Columbia Presbyterian Center,0 to 17,104,F,White,Not Span/Hispanic,42,Newborn,Home or Self Care,2018,PNL001,LIVEBORN,ENT004,DIAGNOSTIC AUDIOLOGY,612,NEONATE BWT 1500-1999G W RESP DIST SYND/OTH MAJ RESP COND,15,NEWBORNS AND OTHER NEONATES WITH CONDITIONS ORIGINATING IN THE PERINATAL PERIOD,2,Moderate,Minor,Medical,Blue Cross/Blue Shield,Self-Pay,,01800,,false,813845.61,162085.7
New York City,Manhattan,7002054,001458,New York-Presbyterian Hospital - New York Weill Cornell Center,0 to 17,100,M,Other Race,Not Span/Hispanic,32,Newborn,Home or Self Care,2018,PNL001,LIVEBORN,ESA004,NON-INVASIVE VENTILATION,612,NEONATE BWT 1500-1999G W RESP DIST SYND/OTH MAJ RESP COND,15,NEWBORNS AND OTHER NEONATES WITH CONDITIONS ORIGINATING IN THE PERINATAL PERIOD,2,Moderate,Minor,Medical,"Managed Care, Unspecified",Medicaid,Self-Pay,01800,,false,657417.98,142898.73
Hudson Valley,Orange,3523000,000699,Garnet Health Medical Center,0 to 17,127,M,White,Not Span/Hispanic,10,Newborn,Short-term Hospital,2018,PNL001,LIVEBORN,ESA004,NON-INVASIVE VENTILATION,612,NEONATE BWT 1500-1999G W RESP DIST SYND/OTH MAJ RESP COND,15,NEWBORNS AND OTHER NEONATES WITH CONDITIONS ORIGINATING IN THE PERINATAL PERIOD,3,Major,Moderate,Medical,Blue Cross/Blue Shield,,,01500,,false,94373.52,25263.78
New York City,Queens,7003003,001629,Jamaica Hospital Medical Center,0 to 17,114,F,Other Race,Not Span/Hispanic,18,Newborn,Home or Self Care,2018,PNL001,LIVEBORN,ESA004,NON-INVASIVE VENTILATION,612,NEONATE BWT 1500-1999G W RESP DIST SYND/OTH MAJ RESP COND,15,NEWBORNS AND OTHER NEONATES WITH CONDITIONS ORIGINATING IN THE PERINATAL PERIOD,1,Minor,Minor,Medical,Medicaid,,,01800,,false,63654,27545.48
New York City,Manhattan,7002032,001466,Mount Sinai West,0 to 17,112,M,Other Race,Unknown,6,Newborn,Home w/ Home Health Services,2018,PNL001,LIVEBORN,ESA004,NON-INVASIVE VENTILATION,612,NEONATE BWT 1500-1999G W RESP DIST SYND/OTH MAJ RESP COND,15,NEWBORNS AND OTHER NEONATES WITH CONDITIONS ORIGINATING IN THE PERINATAL PERIOD,1,Minor,Minor,Medical,Blue Cross/Blue Shield,Self-Pay,,01900,,false,89453.1,23044.86
Southern Tier,Broome,0303001,000058,United Health Services Hospitals Inc. - Wilson Medical Center,0 to 17,137,M,White,Not Span/Hispanic,23,Newborn,Home or Self Care,2018,PNL001,LIVEBORN,ESA004,NON-INVASIVE VENTILATION,612,NEONATE BWT 1500-1999G W RESP DIST SYND/OTH MAJ RESP COND,15,NEWBORNS AND OTHER NEONATES WITH CONDITIONS ORIGINATING IN THE PERINATAL PERIOD,2,Moderate,Minor,Medical,Blue Cross/Blue Shield,,,01600,,false,50458.5,18147.91
Western NY,Erie,1401014,000208,John R. Oishei Children's Hospital,0 to 17,142,M,White,Not Span/Hispanic,26,Newborn,Home w/ Home Health Services,2018,PNL001,LIVEBORN,ESA003,MECHANICAL VENTILATION,612,NEONATE BWT 1500-1999G W RESP DIST SYND/OTH MAJ RESP COND,15,NEWBORNS AND OTHER NEONATES WITH CONDITIONS ORIGINATING IN THE PERINATAL PERIOD,4,Extreme,Major,Medical,Medicaid,Self-Pay,,01600,,false,225026.21,58041.04
Western NY,Erie,1401014,000208,John R. Oishei Children's Hospital,0 to 17,142,F,Black/African American,Not Span/Hispanic,17,Newborn,Home w/ Home Health Services,2018,PNL001,LIVEBORN,ESA004,NON-INVASIVE VENTILATION,612,NEONATE BWT 1500-1999G W RESP DIST SYND/OTH MAJ RESP COND,15,NEWBORNS AND OTHER NEONATES WITH CONDITIONS ORIGINATING IN THE PERINATAL PERIOD,3,Major,Moderate,Medical,Medicaid,Self-Pay,,01500,,false,127194.67,28968.21
New York City,Queens,7003001,001628,Flushing Hospital Medical Center,0 to 17,114,F,Black/African American,Not Span/Hispanic,16,Newborn,Home or Self Care,2018,PNL001,LIVEBORN,ESA003,MECHANICAL VENTILATION,612,NEONATE BWT 1500-1999G W RESP DIST SYND/OTH MAJ RESP COND,15,NEWBORNS AND OTHER NEONATES WITH CONDITIONS ORIGINATING IN THE PERINATAL PERIOD,3,Major,Minor,Medical,Medicaid,,,01800,,false,93003,30043.6
Long Island,Nassau,2908000,000511,NYU Langone Hospital-Long Island,0 to 17,112,M,Other Race,Spanish/Hispanic,30,Newborn,Home or Self Care,2018,PNL001,LIVEBORN,CAR024,VENOUS AND ARTERIAL CATHETER PLACEMENT,612,NEONATE BWT 1500-1999G W RESP DIST SYND/OTH MAJ RESP COND,15,NEWBORNS AND OTHER NEONATES WITH CONDITIONS ORIGINATING IN THE PERINATAL PERIOD,4,Extreme,Minor,Medical,Blue Cross/Blue Shield,,,01600,,false,353128.93,49297.93
Capital/Adirond,Schenectady,4601001,000848,Ellis Hospital - Bellevue Woman's Care Center Division,0 to 17,121,M,White,Not Span/Hispanic,14,Newborn,Home or Self Care,2018,PNL001,LIVEBORN,ESA003,MECHANICAL VENTILATION,612,NEONATE BWT 1500-1999G W RESP DIST SYND/OTH MAJ RESP COND,15,NEWBORNS AND OTHER NEONATES WITH CONDITIONS ORIGINATING IN THE PERINATAL PERIOD,3,Major,Minor,Medical,Private Health Insurance,,,01700,,false,49619.09,47046.02
New York City,Kings,7002053,001304,NYU Langone Hospital-Brooklyn,0 to 17,112,F,Other Race,Spanish/Hispanic,20,Newborn,Home or Self Care,2018,PNL001,LIVEBORN,EST003,ULTRAVIOLET LIGHT THERAPY,612,NEONATE BWT 1500-1999G W RESP DIST SYND/OTH MAJ RESP COND,15,NEWBORNS AND OTHER NEONATES WITH CONDITIONS ORIGINATING IN THE PERINATAL PERIOD,2,Moderate,Minor,Medical,Medicaid,,,01900,,false,253783.06,103189.4
New York City,Manhattan,7002054,001464,New York-Presbyterian Hospital - Columbia Presbyterian Center,0 to 17,109,M,Other Race,Not Span/Hispanic,34,Newborn,Home or Self Care,2018,PNL001,LIVEBORN,EST002,PHOTOTHERAPY,612,NEONATE BWT 1500-1999G W RESP DIST SYND/OTH MAJ RESP COND,15,NEWBORNS AND OTHER NEONATES WITH CONDITIONS ORIGINATING IN THE PERINATAL PERIOD,2,Moderate,Minor,Medical,Medicaid,Medicaid,Self-Pay,01600,,false,663407.89,133354.06
New York City,Queens,7003004,003376,Cohen Children's Medical Center,0 to 17,110,F,White,Not Span/Hispanic,32,Newborn,Home or Self Care,2018,PNL001,LIVEBORN,CAR024,VENOUS AND ARTERIAL CATHETER PLACEMENT,612,NEONATE BWT 1500-1999G W RESP DIST SYND/OTH MAJ RESP COND,15,NEWBORNS AND OTHER NEONATES WITH CONDITIONS ORIGINATING IN THE PERINATAL PERIOD,2,Moderate,Minor,Medical,Medicaid,Medicaid,Self-Pay,01600,,false,481876,91667.19
New York City,Manhattan,7002054,001464,New York-Presbyterian Hospital - Columbia Presbyterian Center,0 to 17,114,F,White,Spanish/Hispanic,33,Newborn,Home or Self Care,2018,PNL001,LIVEBORN,ADM017,ADMINISTRATION OF NUTRITIONAL AND ELECTROLYTIC SUBSTANCES,612,NEONATE BWT 1500-1999G W RESP DIST SYND/OTH MAJ RESP COND,15,NEWBORNS AND OTHER NEONATES WITH CONDITIONS ORIGINATING IN THE PERINATAL PERIOD,2,Moderate,Minor,Medical,Medicaid,Self-Pay,,01600,,false,636780.29,127320.98
Hudson Valley,Westchester,5922000,001122,New York - Presbyterian Hospital,0 to 17,104,M,Black/African American,Not Span/Hispanic,25,Elective,Home w/ Home Health Services,2018,PNL001,LIVEBORN,MRS001,CIRCUMCISION,612,NEONATE BWT 1500-1999G W RESP DIST SYND/OTH MAJ RESP COND,15,NEWBORNS AND OTHER NEONATES WITH CONDITIONS ORIGINATING IN THE PERINATAL PERIOD,2,Moderate,Minor,Medical,Private Health Insurance,,,UNKN,,false,440359.96,262685.48
Central NY,Onondaga,3301008,000636,Crouse Hospital,0 to 17,136,M,Other Race,Not Span/Hispanic,44,Newborn,Short-term Hospital,2018,PNL001,LIVEBORN,RES007,AIRWAY INTUBATION,612,NEONATE BWT 1500-1999G W RESP DIST SYND/OTH MAJ RESP COND,15,NEWBORNS AND OTHER NEONATES WITH CONDITIONS ORIGINATING IN THE PERINATAL PERIOD,4,Extreme,Moderate,Medical,Blue Cross/Blue Shield,,,01500,,false,150338.09,72208.88
New York City,Queens,7003003,001629,Jamaica Hospital Medical Center,0 to 17,112,M,Black/African American,Not Span/Hispanic,11,Newborn,Home w/ Home Health Services,2018,PNL001,LIVEBORN,ESA004,NON-INVASIVE VENTILATION,612,NEONATE BWT 1500-1999G W RESP DIST SYND/OTH MAJ RESP COND,15,NEWBORNS AND OTHER NEONATES WITH CONDITIONS ORIGINATING IN THE PERINATAL PERIOD,1,Minor,Minor,Medical,Medicaid,,,01800,,false,42444,17732.03
Central NY,Onondaga,3301008,000636,Crouse Hospital,0 to 17,134,F,Other Race,Not Span/Hispanic,52,Newborn,Home w/ Home Health Services,2018,PNL001,LIVEBORN,ESA003,MECHANICAL VENTILATION,612,NEONATE BWT 1500-1999G W RESP DIST SYND/OTH MAJ RESP COND,15,NEWBORNS AND OTHER NEONATES WITH CONDITIONS ORIGINATING IN THE PERINATAL PERIOD,4,Extreme,Major,Medical,Private Health Insurance,,,01700,,false,158427.84,76076.93
New York City,Manhattan,7002054,001437,New York-Presbyterian/Lower Manhattan Hospital,0 to 17,112,M,White,Not Span/Hispanic,14,Newborn,Home or Self Care,2018,PNL001,LIVEBORN,ESA004,NON-INVASIVE VENTILATION,612,NEONATE BWT 1500-1999G W RESP DIST SYND/OTH MAJ RESP COND,15,NEWBORNS AND OTHER NEONATES WITH CONDITIONS ORIGINATING IN THE PERINATAL PERIOD,2,Moderate,Minor,Medical,Blue Cross/Blue Shield,Self-Pay,,01800,,false,289375.88,58802.5
Central NY,Onondaga,3301008,000636,Crouse Hospital,0 to 17,134,F,White,Not Span/Hispanic,19,Newborn,Short-term Hospital,2018,PNL001,LIVEBORN,ESA004,NON-INVASIVE VENTILATION,612,NEONATE BWT 1500-1999G W RESP DIST SYND/OTH MAJ RESP COND,15,NEWBORNS AND OTHER NEONATES WITH CONDITIONS ORIGINATING IN THE PERINATAL PERIOD,4,Extreme,Moderate,Medical,Private Health Insurance,Blue Cross/Blue Shield,,01800,,false,75903.63,36010.91
New York City,Manhattan,7002054,001464,New York-Presbyterian Hospital - Columbia Presbyterian Center,0 to 17,100,F,Black/African American,Not Span/Hispanic,19,Newborn,Home or Self Care,2018,PNL001,LIVEBORN,ESA004,NON-INVASIVE VENTILATION,612,NEONATE BWT 1500-1999G W RESP DIST SYND/OTH MAJ RESP COND,15,NEWBORNS AND OTHER NEONATES WITH CONDITIONS ORIGINATING IN THE PERINATAL PERIOD,2,Moderate,Minor,Medical,Self-Pay,,,01600,,false,375563.88,76393.6
New York City,Richmond,7004003,001740,Staten Island University Hosp-North,0 to 17,103,M,Other Race,Spanish/Hispanic,15,Newborn,Home or Self Care,2018,PNL001,LIVEBORN,ADM001,TRANSFUSION OF BLOOD AND BLOOD PRODUCTS,612,NEONATE BWT 1500-1999G W RESP DIST SYND/OTH MAJ RESP COND,15,NEWBORNS AND OTHER NEONATES WITH CONDITIONS ORIGINATING IN THE PERINATAL PERIOD,3,Major,Major,Medical,Private Health Insurance,,,01900,,false,56257.85,44074.92
New York City,Manhattan,7002053,001463,NYU Langone Hospitals,0 to 17,OOS,M,Other Race,Unknown,16,Newborn,Home or Self Care,2018,PNL001,LIVEBORN,ESA004,NON-INVASIVE VENTILATION,612,NEONATE BWT 1500-1999G W RESP DIST SYND/OTH MAJ RESP COND,15,NEWBORNS AND OTHER NEONATES WITH CONDITIONS ORIGINATING IN THE PERINATAL PERIOD,3,Major,Minor,Medical,Private Health Insurance,,,01600,,false,219274.89,101518.4
New York City,Kings,7001021,001306,New York - Presbyterian Brooklyn Methodist Hospital,0 to 17,112,F,White,Spanish/Hispanic,22,Newborn,Home or Self Care,2018,PNL001,LIVEBORN,EST002,PHOTOTHERAPY,612,NEONATE BWT 1500-1999G W RESP DIST SYND/OTH MAJ RESP COND,15,NEWBORNS AND OTHER NEONATES WITH CONDITIONS ORIGINATING IN THE PERINATAL PERIOD,2,Moderate,Minor,Medical,"Managed Care, Unspecified",Medicaid,Self-Pay,01700,,false,218367.99,50924.41
New York City,Kings,7001021,001306,New York - Presbyterian Brooklyn Methodist Hospital,0 to 17,112,M,Other Race,Not Span/Hispanic,10,Newborn,Home or Self Care,2018,PNL001,LIVEBORN,ESA004,NON-INVASIVE VENTILATION,612,NEONATE BWT 1500-1999G W RESP DIST SYND/OTH MAJ RESP COND,15,NEWBORNS AND OTHER NEONATES WITH CONDITIONS ORIGINATING IN THE PERINATAL PERIOD,2,Moderate,Minor,Medical,"Managed Care, Unspecified",Medicaid,Self-Pay,01900,,false,107563.3,24710.81
New York City,Manhattan,7002024,001456,Mount Sinai Hospital,0 to 17,109,F,White,Not Span/Hispanic,46,Newborn,Home or Self Care,2018,PNL001,LIVEBORN,ESA004,NON-INVASIVE VENTILATION,612,NEONATE BWT 1500-1999G W RESP DIST SYND/OTH MAJ RESP COND,15,NEWBORNS AND OTHER NEONATES WITH CONDITIONS ORIGINATING IN THE PERINATAL PERIOD,4,Extreme,Extreme,Medical,Medicaid,Self-Pay,,01600,,false,651664,127139.06
Capital/Adirond,Albany,0101000,000001,Albany Medical Center Hospital,0 to 17,133,F,Other Race,Unknown,29,Newborn,Home or Self Care,2018,PNL001,LIVEBORN,ESA004,NON-INVASIVE VENTILATION,612,NEONATE BWT 1500-1999G W RESP DIST SYND/OTH MAJ RESP COND,15,NEWBORNS AND OTHER NEONATES WITH CONDITIONS ORIGINATING IN THE PERINATAL PERIOD,2,Moderate,Minor,Medical,"Managed Care, Unspecified",,,01900,,false,234807.6,64386.03
New York City,Bronx,7000024,001186,North Central Bronx Hospital,0 to 17,104,M,Other Race,Spanish/Hispanic,24,Newborn,Home or Self Care,2018,PNL001,LIVEBORN,ADM010,VACCINATIONS,612,NEONATE BWT 1500-1999G W RESP DIST SYND/OTH MAJ RESP COND,15,NEWBORNS AND OTHER NEONATES WITH CONDITIONS ORIGINATING IN THE PERINATAL PERIOD,2,Moderate,Minor,Medical,Medicaid,Medicaid,,01600,,false,140972.8,84627.24
New York City,Bronx,7000002,001165,Jacobi Medical Center,0 to 17,105,F,Other Race,Unknown,35,Newborn,Home or Self Care,2018,PNL001,LIVEBORN,ESA003,MECHANICAL VENTILATION,612,NEONATE BWT 1500-1999G W RESP DIST SYND/OTH MAJ RESP COND,15,NEWBORNS AND OTHER NEONATES WITH CONDITIONS ORIGINATING IN THE PERINATAL PERIOD,3,Major,Moderate,Medical,Blue Cross/Blue Shield,,,01600,,false,207141.22,122555.1
New York City,Kings,7001003,001288,Brooklyn Hospital Center - Downtown Campus,0 to 17,112,M,Black/African American,Not Span/Hispanic,29,Newborn,Home or Self Care,2018,PNL001,LIVEBORN,ESA004,NON-INVASIVE VENTILATION,612,NEONATE BWT 1500-1999G W RESP DIST SYND/OTH MAJ RESP COND,15,NEWBORNS AND OTHER NEONATES WITH CONDITIONS ORIGINATING IN THE PERINATAL PERIOD,2,Moderate,Minor,Medical,Medicaid,Medicaid,Self-Pay,01500,,false,306461.01,33661.8
New York City,Queens,7003004,003376,Cohen Children's Medical Center,0 to 17,113,F,White,Not Span/Hispanic,17,Newborn,Home or Self Care,2018,PNL001,LIVEBORN,EST002,PHOTOTHERAPY,612,NEONATE BWT 1500-1999G W RESP DIST SYND/OTH MAJ RESP COND,15,NEWBORNS AND OTHER NEONATES WITH CONDITIONS ORIGINATING IN THE PERINATAL PERIOD,2,Moderate,Minor,Medical,Medicaid,Medicaid,Self-Pay,01800,,false,259100.15,49085.87
Western NY,Erie,1401014,000208,John R. Oishei Children's Hospital,0 to 17,142,F,White,Not Span/Hispanic,30,Newborn,Home w/ Home Health Services,2018,PNL001,LIVEBORN,ADM017,ADMINISTRATION OF NUTRITIONAL AND ELECTROLYTIC SUBSTANCES,612,NEONATE BWT 1500-1999G W RESP DIST SYND/OTH MAJ RESP COND,15,NEWBORNS AND OTHER NEONATES WITH CONDITIONS ORIGINATING IN THE PERINATAL PERIOD,3,Major,Moderate,Medical,Blue Cross/Blue Shield,Self-Pay,,01800,,false,225989.8,53007.34
Hudson Valley,Westchester,5904001,001072,Montefiore New Rochelle Hospital,0 to 17,105,F,White,Unknown,24,Newborn,Home or Self Care,2018,PNL001,LIVEBORN,ESA004,NON-INVASIVE VENTILATION,612,NEONATE BWT 1500-1999G W RESP DIST SYND/OTH MAJ RESP COND,15,NEWBORNS AND OTHER NEONATES WITH CONDITIONS ORIGINATING IN THE PERINATAL PERIOD,2,Moderate,Moderate,Medical,Medicaid,Self-Pay,,01600,,false,140097.07,148096.37
New York City,Bronx,7000006,003058,Montefiore Med Center - Jack D Weiler Hosp of A Einstein College Div,0 to 17,105,M,Other Race,Unknown,22,Newborn,Home w/ Home Health Services,2018,PNL001,LIVEBORN,MRS001,CIRCUMCISION,612,NEONATE BWT 1500-1999G W RESP DIST SYND/OTH MAJ RESP COND,15,NEWBORNS AND OTHER NEONATES WITH CONDITIONS ORIGINATING IN THE PERINATAL PERIOD,3,Major,Major,Medical,Medicaid,,,01800,,false,365207.3,44725.24
New York City,Manhattan,7002054,001458,New York-Presbyterian Hospital - New York Weill Cornell Center,0 to 17,100,M,White,Not Span/Hispanic,32,Newborn,Home w/ Home Health Services,2018,PNL001,LIVEBORN,ESA003,MECHANICAL VENTILATION,612,NEONATE BWT 1500-1999G W RESP DIST SYND/OTH MAJ RESP COND,15,NEWBORNS AND OTHER NEONATES WITH CONDITIONS ORIGINATING IN THE PERINATAL PERIOD,2,Moderate,Minor,Medical,Private Health Insurance,,,01700,,false,649544.64,132601.18
New York City,Manhattan,7002024,001456,Mount Sinai Hospital,0 to 17,112,F,White,Unknown,18,Newborn,Home or Self Care,2018,PNL001,LIVEBORN,RES007,AIRWAY INTUBATION,612,NEONATE BWT 1500-1999G W RESP DIST SYND/OTH MAJ RESP COND,15,NEWBORNS AND OTHER NEONATES WITH CONDITIONS ORIGINATING IN THE PERINATAL PERIOD,2,Moderate,Minor,Medical,"Managed Care, Unspecified",Medicaid,Self-Pay,01800,,false,360245.98,67090.26
New York City,Kings,7001021,001306,New York - Presbyterian Brooklyn Methodist Hospital,0 to 17,112,F,Black/African American,Not Span/Hispanic,12,Newborn,Home or Self Care,2018,PNL001,LIVEBORN,ENT004,DIAGNOSTIC AUDIOLOGY,612,NEONATE BWT 1500-1999G W RESP DIST SYND/OTH MAJ RESP COND,15,NEWBORNS AND OTHER NEONATES WITH CONDITIONS ORIGINATING IN THE PERINATAL PERIOD,2,Moderate,Minor,Medical,"Managed Care, Unspecified",Medicaid,Self-Pay,01900,,false,121648.38,28533.14
New York City,Kings,7001020,001305,Maimonides Medical Center,0 to 17,112,F,White,Not Span/Hispanic,15,Newborn,Home or Self Care,2018,PNL001,LIVEBORN,ESA004,NON-INVASIVE VENTILATION,612,NEONATE BWT 1500-1999G W RESP DIST SYND/OTH MAJ RESP COND,15,NEWBORNS AND OTHER NEONATES WITH CONDITIONS ORIGINATING IN THE PERINATAL PERIOD,1,Minor,Minor,Medical,Private Health Insurance,Self-Pay,,01700,,false,174042,24320.88
New York City,Kings,7001020,001305,Maimonides Medical Center,0 to 17,112,M,Other Race,Not Span/Hispanic,14,Newborn,Home or Self Care,2018,PNL001,LIVEBORN,ESA004,NON-INVASIVE VENTILATION,612,NEONATE BWT 1500-1999G W RESP DIST SYND/OTH MAJ RESP COND,15,NEWBORNS AND OTHER NEONATES WITH CONDITIONS ORIGINATING IN THE PERINATAL PERIOD,1,Minor,Minor,Medical,Medicaid,Medicaid,Self-Pay,01800,,false,158699,22252.93
Central NY,Onondaga,3301008,000636,Crouse Hospital,0 to 17,135,M,White,Not Span/Hispanic,13,Urgent,Home or Self Care,2018,PNL002,SHORT GESTATION; LOW BIRTH WEIGHT; AND FETAL GROWTH RETARDATION,ESA003,MECHANICAL VENTILATION,612,NEONATE BWT 1500-1999G W RESP DIST SYND/OTH MAJ RESP COND,15,NEWBORNS AND OTHER NEONATES WITH CONDITIONS ORIGINATING IN THE PERINATAL PERIOD,3,Major,Minor,Medical,Medicaid,,,01700,,false,50195.7,23760.82
New York City,Queens,7003004,003376,Cohen Children's Medical Center,0 to 17,116,F,White,Not Span/Hispanic,44,Newborn,Home w/ Home Health Services,2018,PNL001,LIVEBORN,RES007,AIRWAY INTUBATION,612,NEONATE BWT 1500-1999G W RESP DIST SYND/OTH MAJ RESP COND,15,NEWBORNS AND OTHER NEONATES WITH CONDITIONS ORIGINATING IN THE PERINATAL PERIOD,3,Major,Minor,Medical,Blue Cross/Blue Shield,Self-Pay,,01600,,false,675846.95,129009.01
New York City,Manhattan,7002053,001463,NYU Langone Hospitals,0 to 17,100,M,White,Unknown,28,Newborn,Home or Self Care,2018,PNL001,LIVEBORN,ADM010,VACCINATIONS,612,NEONATE BWT 1500-1999G W RESP DIST SYND/OTH MAJ RESP COND,15,NEWBORNS AND OTHER NEONATES WITH CONDITIONS ORIGINATING IN THE PERINATAL PERIOD,2,Moderate,Minor,Medical,Private Health Insurance,,,01500,,false,271624.65,113105.12
New York City,Manhattan,7002054,001437,New York-Presbyterian/Lower Manhattan Hospital,0 to 17,100,M,Black/African American,Not Span/Hispanic,14,Newborn,Home or Self Care,2018,PNL001,LIVEBORN,ENT004,DIAGNOSTIC AUDIOLOGY,612,NEONATE BWT 1500-1999G W RESP DIST SYND/OTH MAJ RESP COND,15,NEWBORNS AND OTHER NEONATES WITH CONDITIONS ORIGINATING IN THE PERINATAL PERIOD,1,Minor,Minor,Medical,Medicaid,Self-Pay,,01700,,false,281449.52,56833.71
New York City,Manhattan,7002032,001466,Mount Sinai West,0 to 17,,F,White,Unknown,8,Newborn,Home or Self Care,2018,PNL001,LIVEBORN,ESA004,NON-INVASIVE VENTILATION,612,NEONATE BWT 1500-1999G W RESP DIST SYND/OTH MAJ RESP COND,15,NEWBORNS AND OTHER NEONATES WITH CONDITIONS ORIGINATING IN THE PERINATAL PERIOD,1,Minor,Minor,Medical,Blue Cross/Blue Shield,Self-Pay,,01800,,false,120176.95,31241.26
Long Island,Nassau,2908000,000511,NYU Langone Hospital-Long Island,0 to 17,115,M,White,Spanish/Hispanic,25,Newborn,Home w/ Home Health Services,2018,PNL002,SHORT GESTATION; LOW BIRTH WEIGHT; AND FETAL GROWTH RETARDATION,ESA004,NON-INVASIVE VENTILATION,612,NEONATE BWT 1500-1999G W RESP DIST SYND/OTH MAJ RESP COND,15,NEWBORNS AND OTHER NEONATES WITH CONDITIONS ORIGINATING IN THE PERINATAL PERIOD,1,Minor,Minor,Medical,Medicaid,Medicaid,,01700,,false,306634.37,42572.65
New York City,Manhattan,7002024,001456,Mount Sinai Hospital,0 to 17,100,M,White,Not Span/Hispanic,47,Newborn,Home or Self Care,2018,PNL001,LIVEBORN,ESA004,NON-INVASIVE VENTILATION,612,NEONATE BWT 1500-1999G W RESP DIST SYND/OTH MAJ RESP COND,15,NEWBORNS AND OTHER NEONATES WITH CONDITIONS ORIGINATING IN THE PERINATAL PERIOD,3,Major,Moderate,Medical,Private Health Insurance,Self-Pay,,01800,,false,691364.48,124954.62