Hospital Service Area,Hospital County,Operating Certificate Number,Permanent Facility Id,Facility Name,Age Group,Zip Code - 3 digits,Gender,Race,Ethnicity,Length of Stay,Type of Admission,Patient Disposition,Discharge Year,CCS Diagnosis Code,CCS Diagnosis Description,CCS Procedure Code,CCS Procedure Description,APR DRG Code,APR DRG Description,APR MDC Code,APR MDC Description,APR Severity of Illness Code,APR Severity of Illness Description,APR Risk of Mortality,APR Medical Surgical Description,Payment Typology 1,Payment Typology 2,Payment Typology 3,Birth Weight,Abortion Edit Indicator,Emergency Department Indicator,Total Charges,Total Costs
New York City,Manhattan,7002024,001456,Mount Sinai Hospital,0 to 17,104,M,Other Race,Not Span/Hispanic,20,Newborn,Home or Self Care,2017,218,Liveborn,216,RESP INTUB/MECH VENTIL,621,Neonate bwt 2000-2499g w major anomaly,15,Newborns and Other Neonates with Conditions Originating in the Perinatal Period,3,Major,Moderate,Medical,Medicaid,Medicaid,Self-Pay,02200,N,N,213770.86,89779.95
New York City,Bronx,7000006,001168,Montefiore Medical Center-Wakefield Hospital,0 to 17,104,M,Other Race,Not Span/Hispanic,9,Newborn,Home or Self Care,2017,218,Liveborn,228,PROPHYLACTIC VAC/INOCUL,621,Neonate bwt 2000-2499g w major anomaly,15,Newborns and Other Neonates with Conditions Originating in the Perinatal Period,1,Minor,Minor,Medical,Medicaid,,,02100,N,N,130698.93,18198.40
New York City,Bronx,7000006,003058,Montefiore Med Center - Jack D Weiler Hosp of A Einstein College Div,0 to 17,107,F,Other Race,Not Span/Hispanic,31,Newborn,Home w/ Home Health Services,2017,218,Liveborn,228,PROPHYLACTIC VAC/INOCUL,621,Neonate bwt 2000-2499g w major anomaly,15,Newborns and Other Neonates with Conditions Originating in the Perinatal Period,3,Major,Major,Medical,Blue Cross/Blue Shield,,,02000,N,N,451248.64,62029.36
New York City,Manhattan,7002032,001466,Mount Sinai West,0 to 17,OOS,M,White,Not Span/Hispanic,9,Newborn,Home w/ Home Health Services,2017,218,Liveborn,228,PROPHYLACTIC VAC/INOCUL,621,Neonate bwt 2000-2499g w major anomaly,15,Newborns and Other Neonates with Conditions Originating in the Perinatal Period,2,Moderate,Minor,Medical,Blue Cross/Blue Shield,Self-Pay,,02200,N,N,97096.05,42323.87
New York City,Bronx,7000006,001168,Montefiore Medical Center-Wakefield Hospital,0 to 17,104,F,Other Race,Not Span/Hispanic,13,Newborn,Home or Self Care,2017,218,Liveborn,231,OTHER THERAPEUTIC PRCS,621,Neonate bwt 2000-2499g w major anomaly,15,Newborns and Other Neonates with Conditions Originating in the Perinatal Period,1,Minor,Minor,Medical,Medicaid,,,02000,N,N,194725.45,28099.46
New York City,Bronx,7000006,003058,Montefiore Med Center - Jack D Weiler Hosp of A Einstein College Div,0 to 17,100,F,Other Race,Not Span/Hispanic,5,Newborn,Home or Self Care,2017,218,Liveborn,192,DX ULTRASOUND HEAD/NECK,621,Neonate bwt 2000-2499g w major anomaly,15,Newborns and Other Neonates with Conditions Originating in the Perinatal Period,2,Moderate,Minor,Medical,Medicaid,,,02300,N,N,24459.39,4698.48
New York City,Bronx,7000006,003058,Montefiore Med Center - Jack D Weiler Hosp of A Einstein College Div,0 to 17,104,F,Other Race,Not Span/Hispanic,2,Newborn,Home or Self Care,2017,218,Liveborn,228,PROPHYLACTIC VAC/INOCUL,621,Neonate bwt 2000-2499g w major anomaly,15,Newborns and Other Neonates with Conditions Originating in the Perinatal Period,1,Minor,Minor,Medical,Medicaid,,,02300,N,N,11129.22,2041.61
New York City,Kings,7001037,001320,University Hospital of Brooklyn,0 to 17,112,M,Black/African American,Not Span/Hispanic,17,Newborn,Home or Self Care,2017,218,Liveborn,231,OTHER THERAPEUTIC PRCS,621,Neonate bwt 2000-2499g w major anomaly,15,Newborns and Other Neonates with Conditions Originating in the Perinatal Period,3,Major,Major,Medical,Medicaid,Medicaid,Self-Pay,02300,N,N,114880.18,87867.43
New York City,Kings,7001037,001320,University Hospital of Brooklyn,0 to 17,112,M,Black/African American,Not Span/Hispanic,4,Newborn,Home or Self Care,2017,218,Liveborn,228,PROPHYLACTIC VAC/INOCUL,621,Neonate bwt 2000-2499g w major anomaly,15,Newborns and Other Neonates with Conditions Originating in the Perinatal Period,1,Minor,Minor,Medical,Medicaid,Self-Pay,,02400,N,N,10194.00,8073.10
Long Island,Nassau,2950002,000528,Nassau University Medical Center,0 to 17,117,F,Black/African American,Not Span/Hispanic,20,Newborn,Home or Self Care,2017,218,Liveborn,231,OTHER THERAPEUTIC PRCS,621,Neonate bwt 2000-2499g w major anomaly,15,Newborns and Other Neonates with Conditions Originating in the Perinatal Period,3,Major,Major,Medical,Blue Cross/Blue Shield,Self-Pay,,02100,N,N,123972.88,69099.21
New York City,Kings,7001021,001306,New York - Presbyterian Brooklyn Methodist Hospital,0 to 17,103,M,White,Not Span/Hispanic,20,Newborn,Home or Self Care,2017,218,Liveborn,115,CIRCUMCISION,621,Neonate bwt 2000-2499g w major anomaly,15,Newborns and Other Neonates with Conditions Originating in the Perinatal Period,3,Major,Minor,Medical,Blue Cross/Blue Shield,Self-Pay,,02200,N,N,190616.22,54654.02
New York City,Kings,7001021,001306,New York - Presbyterian Brooklyn Methodist Hospital,0 to 17,112,F,Black/African American,Not Span/Hispanic,7,Newborn,Home or Self Care,2017,218,Liveborn,164,OT OR THER PRC MUSC/SKL,621,Neonate bwt 2000-2499g w major anomaly,15,Newborns and Other Neonates with Conditions Originating in the Perinatal Period,2,Moderate,Minor,Medical,Medicaid,Medicaid,Self-Pay,02300,N,N,72965.51,19643.18
New York City,Manhattan,7002054,001458,New York Presbyterian Hospital - New York Weill Cornell Center,0 to 17,112,F,White,Not Span/Hispanic,44,Newborn,Home w/ Home Health Services,2017,218,Liveborn,217,OTHER RESP THERAPY,621,Neonate bwt 2000-2499g w major anomaly,15,Newborns and Other Neonates with Conditions Originating in the Perinatal Period,2,Moderate,Minor,Medical,Private Health Insurance,Self-Pay,,02000,N,N,574706.18,179733.80
New York City,Manhattan,7002054,001458,New York Presbyterian Hospital - New York Weill Cornell Center,0 to 17,,F,Other Race,Not Span/Hispanic,3,Newborn,Home or Self Care,2017,218,Liveborn,220,OPHTHALM-/OT-OLOGIC DX,621,Neonate bwt 2000-2499g w major anomaly,15,Newborns and Other Neonates with Conditions Originating in the Perinatal Period,1,Minor,Minor,Medical,Private Health Insurance,Self-Pay,,02200,N,N,45387.96,13210.30
New York City,Queens,7003010,001637,New York - Presbyterian/Queens,0 to 17,113,M,White,Spanish/Hispanic,19,Newborn,Home w/ Home Health Services,2017,218,Liveborn,228,PROPHYLACTIC VAC/INOCUL,621,Neonate bwt 2000-2499g w major anomaly,15,Newborns and Other Neonates with Conditions Originating in the Perinatal Period,2,Moderate,Minor,Medical,Medicaid,Medicaid,Self-Pay,02000,N,N,204101.29,42512.82
Central NY,Onondaga,3301008,000636,Crouse Hospital,0 to 17,132,F,White,Not Span/Hispanic,34,Newborn,Home w/ Home Health Services,2017,218,Liveborn,099,OT OR GI THER PRCS,621,Neonate bwt 2000-2499g w major anomaly,15,Newborns and Other Neonates with Conditions Originating in the Perinatal Period,4,Extreme,Minor,Medical,Medicaid,,,02000,N,N,128242.28,59465.39
Central NY,Onondaga,3301008,000636,Crouse Hospital,0 to 17,132,M,White,Not Span/Hispanic,5,Newborn,Home w/ Home Health Services,2017,218,Liveborn,231,OTHER THERAPEUTIC PRCS,621,Neonate bwt 2000-2499g w major anomaly,15,Newborns and Other Neonates with Conditions Originating in the Perinatal Period,1,Minor,Minor,Medical,Private Health Insurance,,,02100,N,N,8960.20,4064.88
Central NY,Onondaga,3301008,000636,Crouse Hospital,0 to 17,135,F,Other Race,Not Span/Hispanic,2,Newborn,Home or Self Care,2017,218,Liveborn,000,NO PROC,621,Neonate bwt 2000-2499g w major anomaly,15,Newborns and Other Neonates with Conditions Originating in the Perinatal Period,1,Minor,Minor,Medical,Medicaid,,,02300,N,N,4070.81,1778.58
Hudson Valley,Sullivan,5263000,000971,Catskill Regional Medical Center,0 to 17,127,F,White,Not Span/Hispanic,2,Newborn,Home or Self Care,2017,218,Liveborn,000,NO PROC,621,Neonate bwt 2000-2499g w major anomaly,15,Newborns and Other Neonates with Conditions Originating in the Perinatal Period,1,Minor,Minor,Medical,Medicaid,,,02300,N,N,5468.44,1737.27
New York City,Bronx,7000001,001178,Bronx-Lebanon Hospital Center - Concourse Division,0 to 17,104,M,Other Race,Unknown,23,Newborn,Home or Self Care,2017,218,Liveborn,094,OT OR UP GI THER PRCS,621,Neonate bwt 2000-2499g w major anomaly,15,Newborns and Other Neonates with Conditions Originating in the Perinatal Period,3,Major,Moderate,Medical,Medicaid,Medicaid,,02000,N,N,75580.14,78500.06
New York City,Bronx,7000001,001178,Bronx-Lebanon Hospital Center - Concourse Division,0 to 17,104,M,Other Race,Spanish/Hispanic,22,Newborn,Home or Self Care,2017,218,Liveborn,228,PROPHYLACTIC VAC/INOCUL,621,Neonate bwt 2000-2499g w major anomaly,15,Newborns and Other Neonates with Conditions Originating in the Perinatal Period,1,Minor,Moderate,Medical,Medicaid,Medicaid,,02400,N,N,71186.22,74596.62
Western NY,Erie,1401014,000208,Women And Children's Hospital Of Buffalo,0 to 17,140,M,White,Not Span/Hispanic,29,Newborn,Home w/ Home Health Services,2017,218,Liveborn,099,OT OR GI THER PRCS,621,Neonate bwt 2000-2499g w major anomaly,15,Newborns and Other Neonates with Conditions Originating in the Perinatal Period,3,Major,Moderate,Medical,Medicaid,Self-Pay,,02400,N,N,218902.79,63491.99
Western NY,Erie,1401014,000208,Women And Children's Hospital Of Buffalo,0 to 17,143,F,White,Not Span/Hispanic,22,Newborn,Home w/ Home Health Services,2017,218,Liveborn,231,OTHER THERAPEUTIC PRCS,621,Neonate bwt 2000-2499g w major anomaly,15,Newborns and Other Neonates with Conditions Originating in the Perinatal Period,2,Moderate,Minor,Medical,Self-Pay,Self-Pay,,02300,N,N,140546.86,39047.46
Capital/Adirond,Rensselaer,4102004,009250,The Burdett Care Center,0 to 17,121,M,White,Not Span/Hispanic,4,Newborn,Home or Self Care,2017,218,Liveborn,115,CIRCUMCISION,621,Neonate bwt 2000-2499g w major anomaly,15,Newborns and Other Neonates with Conditions Originating in the Perinatal Period,1,Minor,Minor,Medical,Blue Cross/Blue Shield,Self-Pay,Self-Pay,02300,N,N,7877.50,4338.19
New York City,Bronx,7000006,001168,Montefiore Medical Center-Wakefield Hospital,0 to 17,105,M,Other Race,Unknown,2,Newborn,Home or Self Care,2017,218,Liveborn,115,CIRCUMCISION,621,Neonate bwt 2000-2499g w major anomaly,15,Newborns and Other Neonates with Conditions Originating in the Perinatal Period,1,Minor,Minor,Medical,Medicaid,,,02200,N,N,11401.51,2122.81
New York City,Bronx,7000006,003058,Montefiore Med Center - Jack D Weiler Hosp of A Einstein College Div,0 to 17,104,F,Other Race,Unknown,2,Newborn,Home or Self Care,2017,218,Liveborn,228,PROPHYLACTIC VAC/INOCUL,621,Neonate bwt 2000-2499g w major anomaly,15,Newborns and Other Neonates with Conditions Originating in the Perinatal Period,1,Minor,Minor,Medical,Medicaid,,,02100,N,N,12238.42,2192.08
New York City,Manhattan,7002024,001456,Mount Sinai Hospital,0 to 17,100,F,Black/African American,Not Span/Hispanic,3,Newborn,Home or Self Care,2017,218,Liveborn,216,RESP INTUB/MECH VENTIL,621,Neonate bwt 2000-2499g w major anomaly,15,Newborns and Other Neonates with Conditions Originating in the Perinatal Period,2,Moderate,Minor,Medical,Medicaid,Self-Pay,,02400,N,N,23578.33,7066.04
New York City,Richmond,7004003,001740,Staten Island University Hosp-North,0 to 17,103,F,Other Race,Spanish/Hispanic,1,Newborn,Expired,2017,218,Liveborn,000,NO PROC,621,Neonate bwt 2000-2499g w major anomaly,15,Newborns and Other Neonates with Conditions Originating in the Perinatal Period,1,Minor,Extreme,Medical,Medicaid,,,02200,N,N,4300.00,1796.95
Capital/Adirond,Schenectady,4601001,000848,Ellis Hospital - Bellevue Woman's Care Center Division,0 to 17,123,F,White,Not Span/Hispanic,2,Newborn,Home or Self Care,2017,218,Liveborn,000,NO PROC,621,Neonate bwt 2000-2499g w major anomaly,15,Newborns and Other Neonates with Conditions Originating in the Perinatal Period,1,Minor,Minor,Medical,Private Health Insurance,,,02300,N,N,3363.85,5324.09
New York City,Kings,7001037,001320,University Hospital of Brooklyn,0 to 17,112,M,Black/African American,Not Span/Hispanic,14,Newborn,Home or Self Care,2017,218,Liveborn,193,DX ULTRASOUND HEART,621,Neonate bwt 2000-2499g w major anomaly,15,Newborns and Other Neonates with Conditions Originating in the Perinatal Period,3,Major,Moderate,Medical,Medicaid,Medicaid,Self-Pay,02400,N,N,92187.00,70495.75
New York City,Manhattan,7002024,001456,Mount Sinai Hospital,0 to 17,112,F,White,Not Span/Hispanic,3,Newborn,Home or Self Care,2017,218,Liveborn,220,OPHTHALM-/OT-OLOGIC DX,621,Neonate bwt 2000-2499g w major anomaly,15,Newborns and Other Neonates with Conditions Originating in the Perinatal Period,2,Moderate,Minor,Medical,Private Health Insurance,Medicaid,Self-Pay,02400,N,N,34331.33,11413.33
New York City,Manhattan,7002053,001463,NYU Langone Hospitals,0 to 17,104,F,Other Race,Not Span/Hispanic,17,Urgent,Home or Self Care,2017,213,Cardiac and circulatory congenital anomalies,056,OT VASCULAR BYP/SHUNT,621,Neonate bwt 2000-2499g w major anomaly,15,Newborns and Other Neonates with Conditions Originating in the Perinatal Period,1,Minor,Minor,Medical,Private Health Insurance,,,02000,N,N,425584.82,144247.33
Hudson Valley,Rockland,4324000,000776,Nyack Hospital,0 to 17,109,M,White,Spanish/Hispanic,24,Newborn,Home or Self Care,2017,218,Liveborn,231,OTHER THERAPEUTIC PRCS,621,Neonate bwt 2000-2499g w major anomaly,15,Newborns and Other Neonates with Conditions Originating in the Perinatal Period,3,Major,Moderate,Medical,Private Health Insurance,Medicaid,,02000,N,N,207119.22,43889.79
New York City,Kings,7001020,001305,Maimonides Medical Center,0 to 17,112,M,White,Spanish/Hispanic,5,Newborn,Home or Self Care,2017,218,Liveborn,220,OPHTHALM-/OT-OLOGIC DX,621,Neonate bwt 2000-2499g w major anomaly,15,Newborns and Other Neonates with Conditions Originating in the Perinatal Period,2,Moderate,Minor,Medical,Medicaid,,Self-Pay,02400,N,N,34004.00,5270.54
New York City,Kings,7001021,001306,New York - Presbyterian Brooklyn Methodist Hospital,0 to 17,112,M,Black/African American,Not Span/Hispanic,11,Newborn,Home or Self Care,2017,218,Liveborn,220,OPHTHALM-/OT-OLOGIC DX,621,Neonate bwt 2000-2499g w major anomaly,15,Newborns and Other Neonates with Conditions Originating in the Perinatal Period,1,Minor,Minor,Medical,Blue Cross/Blue Shield,Medicaid,Self-Pay,02400,N,N,103747.34,28596.05
New York City,Kings,7001021,001306,New York - Presbyterian Brooklyn Methodist Hospital,0 to 17,112,F,Black/African American,Not Span/Hispanic,5,Newborn,Home or Self Care,2017,218,Liveborn,228,PROPHYLACTIC VAC/INOCUL,621,Neonate bwt 2000-2499g w major anomaly,15,Newborns and Other Neonates with Conditions Originating in the Perinatal Period,1,Minor,Minor,Medical,Medicaid,Medicaid,Self-Pay,02200,N,N,18226.18,2914.60
New York City,Manhattan,7002024,001456,Mount Sinai Hospital,0 to 17,OOS,F,White,Not Span/Hispanic,17,Newborn,Home or Self Care,2017,218,Liveborn,216,RESP INTUB/MECH VENTIL,621,Neonate bwt 2000-2499g w major anomaly,15,Newborns and Other Neonates with Conditions Originating in the Perinatal Period,1,Minor,Minor,Medical,Private Health Insurance,Self-Pay,,02200,N,N,183355.27,76624.75
New York City,Manhattan,7002054,001458,New York Presbyterian Hospital - New York Weill Cornell Center,0 to 17,104,M,Black/African American,Not Span/Hispanic,34,Newborn,Home or Self Care,2017,218,Liveborn,231,OTHER THERAPEUTIC PRCS,621,Neonate bwt 2000-2499g w major anomaly,15,Newborns and Other Neonates with Conditions Originating in the Perinatal Period,3,Major,Moderate,Medical,Medicaid,Medicaid,Self-Pay,02300,N,N,631149.74,206538.39
New York City,Manhattan,7002054,001458,New York Presbyterian Hospital - New York Weill Cornell Center,0 to 17,113,F,White,Not Span/Hispanic,4,Newborn,Home or Self Care,2017,218,Liveborn,220,OPHTHALM-/OT-OLOGIC DX,621,Neonate bwt 2000-2499g w major anomaly,15,Newborns and Other Neonates with Conditions Originating in the Perinatal Period,2,Moderate,Minor,Medical,Private Health Insurance,Private Health Insurance,,02000,N,N,28221.05,2483.73
New York City,Manhattan,7002054,001464,New York Presbyterian Hospital - Columbia Presbyterian Center,0 to 17,104,M,Black/African American,Not Span/Hispanic,8,Newborn,Home or Self Care,2017,218,Liveborn,220,OPHTHALM-/OT-OLOGIC DX,621,Neonate bwt 2000-2499g w major anomaly,15,Newborns and Other Neonates with Conditions Originating in the Perinatal Period,1,Minor,Minor,Medical,Medicaid,Medicaid,Self-Pay,02000,N,N,86749.02,20609.43
New York City,Manhattan,7002054,001464,New York Presbyterian Hospital - Columbia Presbyterian Center,0 to 17,100,M,Other Race,Multi-ethnic,14,Newborn,Home or Self Care,2017,218,Liveborn,216,RESP INTUB/MECH VENTIL,621,Neonate bwt 2000-2499g w major anomaly,15,Newborns and Other Neonates with Conditions Originating in the Perinatal Period,2,Moderate,Minor,Medical,Medicaid,Medicaid,Self-Pay,02300,N,N,262011.81,86185.56
New York City,Manhattan,7002054,001464,New York Presbyterian Hospital - Columbia Presbyterian Center,0 to 17,119,M,Other Race,Not Span/Hispanic,5,Emergency,Home or Self Care,2017,213,Cardiac and circulatory congenital anomalies,228,PROPHYLACTIC VAC/INOCUL,621,Neonate bwt 2000-2499g w major anomaly,15,Newborns and Other Neonates with Conditions Originating in the Perinatal Period,1,Minor,Minor,Medical,Private Health Insurance,Self-Pay,,02200,N,N,94648.56,30561.96
Long Island,Nassau,2950002,000528,Nassau University Medical Center,0 to 17,115,M,Other Race,Spanish/Hispanic,11,Newborn,Home or Self Care,2017,218,Liveborn,216,RESP INTUB/MECH VENTIL,621,Neonate bwt 2000-2499g w major anomaly,15,Newborns and Other Neonates with Conditions Originating in the Perinatal Period,1,Minor,Minor,Medical,Private Health Insurance,Medicaid,Self-Pay,02300,N,N,71119.69,46639.36
Western NY,Erie,1401008,000213,Mercy Hospital of Buffalo,0 to 17,142,M,White,Not Span/Hispanic,3,Newborn,Home or Self Care,2017,218,Liveborn,228,PROPHYLACTIC VAC/INOCUL,621,Neonate bwt 2000-2499g w major anomaly,15,Newborns and Other Neonates with Conditions Originating in the Perinatal Period,1,Minor,Moderate,Medical,Private Health Insurance,,,02400,N,N,4994.58,2295.68
Central NY,Onondaga,3301008,000636,Crouse Hospital,0 to 17,130,M,Other Race,Not Span/Hispanic,24,Newborn,Home w/ Home Health Services,2017,218,Liveborn,231,OTHER THERAPEUTIC PRCS,621,Neonate bwt 2000-2499g w major anomaly,15,Newborns and Other Neonates with Conditions Originating in the Perinatal Period,3,Major,Minor,Medical,Medicaid,,,02200,N,N,68326.24,30320.31
New York City,Bronx,7000001,001178,Bronx-Lebanon Hospital Center - Concourse Division,0 to 17,104,F,Other Race,Unknown,39,Newborn,Home or Self Care,2017,218,Liveborn,094,OT OR UP GI THER PRCS,621,Neonate bwt 2000-2499g w major anomaly,15,Newborns and Other Neonates with Conditions Originating in the Perinatal Period,3,Major,Moderate,Medical,Medicaid,Medicaid,,02100,N,N,123189.05,129448.46
New York City,Bronx,7000006,003058,Montefiore Med Center - Jack D Weiler Hosp of A Einstein College Div,0 to 17,104,M,Other Race,Unknown,76,Newborn,Inpatient Rehabilitation Facility,2017,218,Liveborn,216,RESP INTUB/MECH VENTIL,621,Neonate bwt 2000-2499g w major anomaly,15,Newborns and Other Neonates with Conditions Originating in the Perinatal Period,4,Extreme,Major,Medical,Medicaid,,,02200,N,Y,1185367.39,177290.33
New York City,Bronx,7000006,003058,Montefiore Med Center - Jack D Weiler Hosp of A Einstein College Div,0 to 17,104,F,Other Race,Not Span/Hispanic,28,Newborn,Home or Self Care,2017,218,Liveborn,193,DX ULTRASOUND HEART,621,Neonate bwt 2000-2499g w major anomaly,15,Newborns and Other Neonates with Conditions Originating in the Perinatal Period,3,Major,Moderate,Medical,Medicaid,,,02300,N,N,427382.17,59633.96
New York City,Bronx,7000006,003058,Montefiore Med Center - Jack D Weiler Hosp of A Einstein College Div,0 to 17,104,M,Other Race,Not Span/Hispanic,14,Newborn,Home w/ Home Health Services,2017,218,Liveborn,216,RESP INTUB/MECH VENTIL,621,Neonate bwt 2000-2499g w major anomaly,15,Newborns and Other Neonates with Conditions Originating in the Perinatal Period,3,Major,Moderate,Medical,Medicaid,,,02400,N,N,199941.60,27750.17
New York City,Kings,7001016,001301,Kings County Hospital Center,0 to 17,112,M,Black/African American,Not Span/Hispanic,7,Newborn,Home or Self Care,2017,218,Liveborn,220,OPHTHALM-/OT-OLOGIC DX,621,Neonate bwt 2000-2499g w major anomaly,15,Newborns and Other Neonates with Conditions Originating in the Perinatal Period,2,Moderate,Minor,Medical,Self-Pay,,,02300,N,N,45558.97,27384.45
New York City,Manhattan,7002001,001438,Bellevue Hospital Center,0 to 17,113,M,Other Race,Not Span/Hispanic,5,Newborn,Home or Self Care,2017,218,Liveborn,220,OPHTHALM-/OT-OLOGIC DX,621,Neonate bwt 2000-2499g w major anomaly,15,Newborns and Other Neonates with Conditions Originating in the Perinatal Period,1,Minor,Minor,Medical,Medicaid,Medicaid,,02300,N,N,19770.75,12747.15
New York City,Manhattan,7002002,001439,Mount Sinai Beth Israel,0 to 17,112,M,White,Not Span/Hispanic,3,Newborn,Home w/ Home Health Services,2017,219,Short gestation; low birth weight; and fetal growth retardation,220,OPHTHALM-/OT-OLOGIC DX,621,Neonate bwt 2000-2499g w major anomaly,15,Newborns and Other Neonates with Conditions Originating in the Perinatal Period,1,Minor,Minor,Medical,Blue Cross/Blue Shield,Self-Pay,,02300,N,N,35507.75,3689.10
New York City,Manhattan,7002009,001445,Harlem Hospital Center,0 to 17,100,F,Black/African American,Not Span/Hispanic,27,Newborn,Home w/ Home Health Services,2017,218,Liveborn,216,RESP INTUB/MECH VENTIL,621,Neonate bwt 2000-2499g w major anomaly,15,Newborns and Other Neonates with Conditions Originating in the Perinatal Period,3,Major,Minor,Medical,Medicaid,Medicaid,,02300,N,N,154066.80,119801.57
Long Island,Suffolk,5151001,000245,University Hospital,0 to 17,117,M,White,Not Span/Hispanic,10,Newborn,Home or Self Care,2017,218,Liveborn,216,RESP INTUB/MECH VENTIL,621,Neonate bwt 2000-2499g w major anomaly,15,Newborns and Other Neonates with Conditions Originating in the Perinatal Period,3,Major,Major,Medical,Blue Cross/Blue Shield,,,02200,N,N,115959.08,31484.35
Long Island,Suffolk,5151001,000245,University Hospital,0 to 17,117,M,White,Not Span/Hispanic,2,Newborn,Home or Self Care,2017,218,Liveborn,000,NO PROC,621,Neonate bwt 2000-2499g w major anomaly,15,Newborns and Other Neonates with Conditions Originating in the Perinatal Period,1,Minor,Minor,Medical,Self-Pay,,,02300,N,N,11703.68,2515.13
Long Island,Nassau,2951001,000541,North Shore University Hospital,0 to 17,113,M,White,Not Span/Hispanic,3,Newborn,Home or Self Care,2017,218,Liveborn,000,NO PROC,621,Neonate bwt 2000-2499g w major anomaly,15,Newborns and Other Neonates with Conditions Originating in the Perinatal Period,2,Moderate,Minor,Medical,Private Health Insurance,,,02000,N,N,35663.42,6041.32
Long Island,Suffolk,5154000,000924,Southside Hospital,0 to 17,117,F,Other Race,Spanish/Hispanic,17,Newborn,Home or Self Care,2017,218,Liveborn,216,RESP INTUB/MECH VENTIL,621,Neonate bwt 2000-2499g w major anomaly,15,Newborns and Other Neonates with Conditions Originating in the Perinatal Period,2,Moderate,Minor,Medical,Medicaid,Medicaid,,02200,N,N,186271.18,41701.56
Southern Tier,Broome,0303001,000058,United Health Services Hospitals Inc. - Wilson Medical Center,0 to 17,139,M,Other Race,Not Span/Hispanic,29,Urgent,Critical Access Hospital,2017,224,Other perinatal conditions,004,DIAGNOSTIC SPINAL TAP,621,Neonate bwt 2000-2499g w major anomaly,15,Newborns and Other Neonates with Conditions Originating in the Perinatal Period,2,Moderate,Moderate,Medical,Medicaid,,,02200,N,N,70665.56,21608.57