Hospital Service Area,Hospital County,Operating Certificate Number,Permanent Facility Id,Facility Name,Age Group,Zip Code - 3 digits,Gender,Race,Ethnicity,Length of Stay,Type of Admission,Patient Disposition,Discharge Year,CCS Diagnosis Code,CCS Diagnosis Description,CCS Procedure Code,CCS Procedure Description,APR DRG Code,APR DRG Description,APR MDC Code,APR MDC Description,APR Severity of Illness Code,APR Severity of Illness Description,APR Risk of Mortality,APR Medical Surgical Description,Payment Typology 1,Payment Typology 2,Payment Typology 3,Birth Weight,Abortion Edit Indicator,Emergency Department Indicator,Total Charges,Total Costs
New York City,Manhattan,7002053,001463,NYU Langone Hospitals,0 to 17,100,F,Other Race,Unknown,2,Newborn,Home or Self Care,2020,PNL001,LIVEBORN,ADM010,VACCINATIONS,621,NEONATE BWT 2000-2499G W MAJOR ANOMALY,15,NEWBORNS AND OTHER NEONATES WITH CONDITIONS ORIGINATING IN THE PERINATAL PERIOD,1,Minor,Minor,Medical,Blue Cross/Blue Shield,,,02200,,N,23584.79,7794.79
New York City,Manhattan,7002053,001463,NYU Langone Hospitals,0 to 17,114,M,Other Race,Unknown,3,Newborn,Home or Self Care,2020,PNL001,LIVEBORN,ESA004,NON-INVASIVE VENTILATION,621,NEONATE BWT 2000-2499G W MAJOR ANOMALY,15,NEWBORNS AND OTHER NEONATES WITH CONDITIONS ORIGINATING IN THE PERINATAL PERIOD,2,Moderate,Minor,Medical,Private Health Insurance,,,02300,,N,39848.62,12512.53
New York City,Manhattan,7002053,001463,NYU Langone Hospitals,0 to 17,OOS,F,White,Not Span/Hispanic,2,Newborn,Home or Self Care,2020,PNL001,LIVEBORN,ADM010,VACCINATIONS,621,NEONATE BWT 2000-2499G W MAJOR ANOMALY,15,NEWBORNS AND OTHER NEONATES WITH CONDITIONS ORIGINATING IN THE PERINATAL PERIOD,1,Minor,Minor,Medical,Private Health Insurance,,,02000,,N,23154.36,7766.61
New York City,Manhattan,7002053,001463,NYU Langone Hospitals,0 to 17,104,F,Other Race,Not Span/Hispanic,2,Newborn,Home or Self Care,2020,PNL001,LIVEBORN,ADM010,VACCINATIONS,621,NEONATE BWT 2000-2499G W MAJOR ANOMALY,15,NEWBORNS AND OTHER NEONATES WITH CONDITIONS ORIGINATING IN THE PERINATAL PERIOD,1,Minor,Minor,Medical,Blue Cross/Blue Shield,,,02400,,N,23198.62,7754.39
New York City,Manhattan,7002053,001463,NYU Langone Hospitals,0 to 17,100,M,White,Unknown,2,Newborn,Home or Self Care,2020,PNL001,LIVEBORN,,,621,NEONATE BWT 2000-2499G W MAJOR ANOMALY,15,NEWBORNS AND OTHER NEONATES WITH CONDITIONS ORIGINATING IN THE PERINATAL PERIOD,1,Minor,Minor,Medical,Blue Cross/Blue Shield,,,02000,,N,22352.74,7099.39
New York City,Manhattan,7002053,001463,NYU Langone Hospitals,0 to 17,113,M,White,Unknown,93,Newborn,Home or Self Care,2020,PNL001,LIVEBORN,CAR011,ANEURYSM REPAIR PROCEDURES,621,NEONATE BWT 2000-2499G W MAJOR ANOMALY,15,NEWBORNS AND OTHER NEONATES WITH CONDITIONS ORIGINATING IN THE PERINATAL PERIOD,4,Extreme,Major,Medical,Medicaid,,,02400,,N,2576785.73,715638.65
New York City,Manhattan,7002053,001463,NYU Langone Hospitals,0 to 17,112,M,Other Race,Unknown,12,Emergency,Home or Self Care,2020,MAL001,CARDIAC AND CIRCULATORY CONGENITAL ANOMALIES,ADM010,VACCINATIONS,621,NEONATE BWT 2000-2499G W MAJOR ANOMALY,15,NEWBORNS AND OTHER NEONATES WITH CONDITIONS ORIGINATING IN THE PERINATAL PERIOD,4,Extreme,Major,Medical,Medicaid,,,02300,,N,185283.01,54722.33
New York City,Manhattan,7002053,001463,NYU Langone Hospitals,0 to 17,112,F,Other Race,Unknown,2,Newborn,Home or Self Care,2020,PNL001,LIVEBORN,EST002,PHOTOTHERAPY,621,NEONATE BWT 2000-2499G W MAJOR ANOMALY,15,NEWBORNS AND OTHER NEONATES WITH CONDITIONS ORIGINATING IN THE PERINATAL PERIOD,1,Minor,Minor,Medical,Blue Cross/Blue Shield,,,02400,,N,28369.31,8910.05
New York City,Manhattan,7002053,001463,NYU Langone Hospitals,0 to 17,112,M,White,Not Span/Hispanic,1,Newborn,Home or Self Care,2020,PNL001,LIVEBORN,,,621,NEONATE BWT 2000-2499G W MAJOR ANOMALY,15,NEWBORNS AND OTHER NEONATES WITH CONDITIONS ORIGINATING IN THE PERINATAL PERIOD,2,Moderate,Minor,Medical,Medicaid,,,02200,,N,26034.83,5231.04
New York City,Manhattan,7002053,001463,NYU Langone Hospitals,0 to 17,112,M,White,Unknown,1,Newborn,Home or Self Care,2020,PNL001,LIVEBORN,,,621,NEONATE BWT 2000-2499G W MAJOR ANOMALY,15,NEWBORNS AND OTHER NEONATES WITH CONDITIONS ORIGINATING IN THE PERINATAL PERIOD,1,Minor,Minor,Medical,Medicaid,,,02100,,N,13629.59,3768.89
New York City,Manhattan,7002053,001463,NYU Langone Hospitals,0 to 17,100,F,White,Not Span/Hispanic,2,Newborn,Home or Self Care,2020,PNL001,LIVEBORN,ADM010,VACCINATIONS,621,NEONATE BWT 2000-2499G W MAJOR ANOMALY,15,NEWBORNS AND OTHER NEONATES WITH CONDITIONS ORIGINATING IN THE PERINATAL PERIOD,1,Minor,Minor,Medical,Private Health Insurance,,,02300,,N,23441.52,7779.8
New York City,Manhattan,7002053,001463,NYU Langone Hospitals,0 to 17,100,M,Other Race,Unknown,19,Newborn,Home or Self Care,2020,PNL001,LIVEBORN,ESA003,MECHANICAL VENTILATION,621,NEONATE BWT 2000-2499G W MAJOR ANOMALY,15,NEWBORNS AND OTHER NEONATES WITH CONDITIONS ORIGINATING IN THE PERINATAL PERIOD,4,Extreme,Major,Medical,Medicaid,,,02400,,N,268419.64,85933.94
New York City,Manhattan,7002053,001463,NYU Langone Hospitals,0 to 17,112,F,White,Not Span/Hispanic,2,Newborn,Home or Self Care,2020,PNL001,LIVEBORN,ADM010,VACCINATIONS,621,NEONATE BWT 2000-2499G W MAJOR ANOMALY,15,NEWBORNS AND OTHER NEONATES WITH CONDITIONS ORIGINATING IN THE PERINATAL PERIOD,2,Moderate,Major,Medical,Medicaid,,,02300,,N,25335.18,8029.72
New York City,Manhattan,7002053,001463,NYU Langone Hospitals,0 to 17,OOS,F,White,Not Span/Hispanic,2,Newborn,Home or Self Care,2020,PNL001,LIVEBORN,ADM010,VACCINATIONS,621,NEONATE BWT 2000-2499G W MAJOR ANOMALY,15,NEWBORNS AND OTHER NEONATES WITH CONDITIONS ORIGINATING IN THE PERINATAL PERIOD,1,Minor,Minor,Medical,Private Health Insurance,,,02200,,N,26088.51,8812.99
New York City,Manhattan,7002053,001463,NYU Langone Hospitals,0 to 17,OOS,F,Other Race,Unknown,16,Newborn,Home or Self Care,2020,PNL001,LIVEBORN,ADM010,VACCINATIONS,621,NEONATE BWT 2000-2499G W MAJOR ANOMALY,15,NEWBORNS AND OTHER NEONATES WITH CONDITIONS ORIGINATING IN THE PERINATAL PERIOD,2,Moderate,Moderate,Medical,Private Health Insurance,,,02400,,N,234375.78,81613.97
New York City,Manhattan,7002053,001463,NYU Langone Hospitals,0 to 17,112,M,White,Not Span/Hispanic,37,Newborn,Home w/ Home Health Services,2020,PNL001,LIVEBORN,ESA004,NON-INVASIVE VENTILATION,621,NEONATE BWT 2000-2499G W MAJOR ANOMALY,15,NEWBORNS AND OTHER NEONATES WITH CONDITIONS ORIGINATING IN THE PERINATAL PERIOD,3,Major,Major,Medical,Private Health Insurance,,,02000,,N,529224.9,181846.73
New York City,Manhattan,7002053,001463,NYU Langone Hospitals,0 to 17,100,M,Other Race,Unknown,13,Urgent,Home or Self Care,2020,PNL009,PERINATAL INFECTIONS,OTR004,ISOLATION PROCEDURES,621,NEONATE BWT 2000-2499G W MAJOR ANOMALY,15,NEWBORNS AND OTHER NEONATES WITH CONDITIONS ORIGINATING IN THE PERINATAL PERIOD,3,Major,Major,Medical,Medicaid,,,02200,,N,243362.74,70041.86
New York City,Manhattan,7002053,001463,NYU Langone Hospitals,0 to 17,112,F,White,Unknown,1,Newborn,Home or Self Care,2020,PNL001,LIVEBORN,,,621,NEONATE BWT 2000-2499G W MAJOR ANOMALY,15,NEWBORNS AND OTHER NEONATES WITH CONDITIONS ORIGINATING IN THE PERINATAL PERIOD,1,Minor,Minor,Medical,Medicaid,,,02200,,N,21454.13,4621.91
New York City,Manhattan,7002053,001463,NYU Langone Hospitals,0 to 17,109,F,White,Unknown,19,Emergency,Home or Self Care,2020,MAL004,NERVOUS SYSTEM CONGENITAL ANOMALIES,ENT014,FRENECTOMY,621,NEONATE BWT 2000-2499G W MAJOR ANOMALY,15,NEWBORNS AND OTHER NEONATES WITH CONDITIONS ORIGINATING IN THE PERINATAL PERIOD,2,Moderate,Moderate,Medical,Medicaid,,,02300,,N,289634.16,96884.16
New York City,Manhattan,7002053,001463,NYU Langone Hospitals,0 to 17,112,F,White,Unknown,2,Newborn,Home or Self Care,2020,PNL001,LIVEBORN,,,621,NEONATE BWT 2000-2499G W MAJOR ANOMALY,15,NEWBORNS AND OTHER NEONATES WITH CONDITIONS ORIGINATING IN THE PERINATAL PERIOD,1,Minor,Minor,Medical,Medicaid,,,02400,,N,24845.15,8081.21
New York City,Manhattan,7002053,001463,NYU Langone Hospitals,0 to 17,112,F,White,Unknown,2,Newborn,Home or Self Care,2020,PNL001,LIVEBORN,ENT004,DIAGNOSTIC AUDIOLOGY,621,NEONATE BWT 2000-2499G W MAJOR ANOMALY,15,NEWBORNS AND OTHER NEONATES WITH CONDITIONS ORIGINATING IN THE PERINATAL PERIOD,1,Minor,Minor,Medical,Medicaid,,,02200,,N,27550.74,8389.66
New York City,Manhattan,7002053,001463,NYU Langone Hospitals,0 to 17,112,M,White,Unknown,2,Newborn,Home or Self Care,2020,PNL001,LIVEBORN,ENT004,DIAGNOSTIC AUDIOLOGY,621,NEONATE BWT 2000-2499G W MAJOR ANOMALY,15,NEWBORNS AND OTHER NEONATES WITH CONDITIONS ORIGINATING IN THE PERINATAL PERIOD,2,Moderate,Minor,Medical,Medicaid,,,02000,,N,26686.26,8299.22
New York City,Manhattan,7002053,001463,NYU Langone Hospitals,0 to 17,112,F,White,Unknown,1,Newborn,Home or Self Care,2020,PNL001,LIVEBORN,ENT004,DIAGNOSTIC AUDIOLOGY,621,NEONATE BWT 2000-2499G W MAJOR ANOMALY,15,NEWBORNS AND OTHER NEONATES WITH CONDITIONS ORIGINATING IN THE PERINATAL PERIOD,1,Minor,Minor,Medical,Medicaid,,,02200,,N,15019.34,4272.67
New York City,Manhattan,7002053,001463,NYU Langone Hospitals,0 to 17,112,M,White,Not Span/Hispanic,1,Newborn,Home or Self Care,2020,PNL001,LIVEBORN,ADM010,VACCINATIONS,621,NEONATE BWT 2000-2499G W MAJOR ANOMALY,15,NEWBORNS AND OTHER NEONATES WITH CONDITIONS ORIGINATING IN THE PERINATAL PERIOD,1,Minor,Minor,Medical,Private Health Insurance,,,02400,,N,15825.1,4958.08
New York City,Manhattan,7002053,001463,NYU Langone Hospitals,0 to 17,112,M,Black/African American,Unknown,6,Newborn,Home or Self Care,2020,PNL001,LIVEBORN,ADM017,ADMINISTRATION OF NUTRITIONAL AND ELECTROLYTIC SUBSTANCES,621,NEONATE BWT 2000-2499G W MAJOR ANOMALY,15,NEWBORNS AND OTHER NEONATES WITH CONDITIONS ORIGINATING IN THE PERINATAL PERIOD,1,Minor,Minor,Medical,Private Health Insurance,,,02100,,N,92867.09,31474.19
New York City,Manhattan,7002053,001463,NYU Langone Hospitals,0 to 17,104,M,Black/African American,Unknown,2,Newborn,Home or Self Care,2020,PNL001,LIVEBORN,ADM010,VACCINATIONS,621,NEONATE BWT 2000-2499G W MAJOR ANOMALY,15,NEWBORNS AND OTHER NEONATES WITH CONDITIONS ORIGINATING IN THE PERINATAL PERIOD,1,Minor,Minor,Medical,Medicaid,,,02400,,N,28778.59,9301.38
New York City,Manhattan,7002053,001463,NYU Langone Hospitals,0 to 17,115,F,Other Race,Unknown,3,Newborn,Home or Self Care,2020,PNL001,LIVEBORN,ADM010,VACCINATIONS,621,NEONATE BWT 2000-2499G W MAJOR ANOMALY,15,NEWBORNS AND OTHER NEONATES WITH CONDITIONS ORIGINATING IN THE PERINATAL PERIOD,1,Minor,Minor,Medical,Private Health Insurance,,,02400,,N,36592.95,12712.54
New York City,Manhattan,7002053,001463,NYU Langone Hospitals,0 to 17,115,F,Other Race,Unknown,3,Newborn,Home or Self Care,2020,PNL001,LIVEBORN,ADM010,VACCINATIONS,621,NEONATE BWT 2000-2499G W MAJOR ANOMALY,15,NEWBORNS AND OTHER NEONATES WITH CONDITIONS ORIGINATING IN THE PERINATAL PERIOD,1,Minor,Minor,Medical,Private Health Insurance,,,02000,,N,36543.26,12686.75
New York City,Manhattan,7002053,001463,NYU Langone Hospitals,0 to 17,112,F,White,Not Span/Hispanic,1,Newborn,Home or Self Care,2020,PNL001,LIVEBORN,,,621,NEONATE BWT 2000-2499G W MAJOR ANOMALY,15,NEWBORNS AND OTHER NEONATES WITH CONDITIONS ORIGINATING IN THE PERINATAL PERIOD,1,Minor,Minor,Medical,Self-Pay,,,02400,,N,14255.96,4192.8
New York City,Manhattan,7002053,001463,NYU Langone Hospitals,0 to 17,111,M,Other Race,Unknown,2,Newborn,Home or Self Care,2020,PNL001,LIVEBORN,ESA004,NON-INVASIVE VENTILATION,621,NEONATE BWT 2000-2499G W MAJOR ANOMALY,15,NEWBORNS AND OTHER NEONATES WITH CONDITIONS ORIGINATING IN THE PERINATAL PERIOD,1,Minor,Minor,Medical,Medicaid,Private Health Insurance,,02400,,N,26654.57,9053.79
New York City,Manhattan,7002053,001463,NYU Langone Hospitals,0 to 17,100,F,Other Race,Unknown,1,Newborn,Expired,2020,PNL001,LIVEBORN,CAR024,VENOUS AND ARTERIAL CATHETER PLACEMENT,621,NEONATE BWT 2000-2499G W MAJOR ANOMALY,15,NEWBORNS AND OTHER NEONATES WITH CONDITIONS ORIGINATING IN THE PERINATAL PERIOD,4,Extreme,Extreme,Medical,Blue Cross/Blue Shield,,,02000,,N,114767.4,11537.92
New York City,Manhattan,7002053,001463,NYU Langone Hospitals,0 to 17,104,F,Other Race,Unknown,1,Newborn,Expired,2020,PNL001,LIVEBORN,,,621,NEONATE BWT 2000-2499G W MAJOR ANOMALY,15,NEWBORNS AND OTHER NEONATES WITH CONDITIONS ORIGINATING IN THE PERINATAL PERIOD,3,Major,Major,Medical,Medicaid,,,02200,,N,12552.78,4093.85
