Hospital Service Area,Hospital County,Operating Certificate Number,Permanent Facility Id,Facility Name,Age Group,Zip Code - 3 digits,Gender,Race,Ethnicity,Length of Stay,Type of Admission,Patient Disposition,Discharge Year,CCS Diagnosis Code,CCS Diagnosis Description,CCS Procedure Code,CCS Procedure Description,APR DRG Code,APR DRG Description,APR MDC Code,APR MDC Description,APR Severity of Illness Code,APR Severity of Illness Description,APR Risk of Mortality,APR Medical Surgical Description,Payment Typology 1,Payment Typology 2,Payment Typology 3,Birth Weight,Abortion Edit Indicator,Emergency Department Indicator,Total Charges,Total Costs
New York City,Kings,7001035,001318,Wyckoff Heights Medical Center,0 to 17,112,M,Other Race,Not Span/Hispanic,3,Newborn,Home or Self Care,2019,PNL001,LIVEBORN,ADM010,VACCINATIONS,623,NEONATE BWT 2000-2499G W CONGENITAL/PERINATAL INFECTION,15,NEWBORNS AND OTHER NEONATES WITH CONDITIONS ORIGINATING IN THE PERINATAL PERIOD,1,Minor,Minor,Medical,Medicaid,Miscellaneous/Other,,02100,,false,7765.27,3151.18
New York City,Queens,7003010,001637,New York - Presbyterian/Queens,0 to 17,113,M,Other Race,Not Span/Hispanic,6,Newborn,Home or Self Care,2019,PNL001,LIVEBORN,ESA004,NON-INVASIVE VENTILATION,623,NEONATE BWT 2000-2499G W CONGENITAL/PERINATAL INFECTION,15,NEWBORNS AND OTHER NEONATES WITH CONDITIONS ORIGINATING IN THE PERINATAL PERIOD,1,Minor,Minor,Medical,"Managed Care, Unspecified",Medicaid,Self-Pay,02400,,false,76202.2,14257.02
New York City,Bronx,7000024,001186,North Central Bronx Hospital,0 to 17,104,M,Other Race,Unknown,12,Newborn,Home or Self Care,2019,PNL001,LIVEBORN,ADM010,VACCINATIONS,623,NEONATE BWT 2000-2499G W CONGENITAL/PERINATAL INFECTION,15,NEWBORNS AND OTHER NEONATES WITH CONDITIONS ORIGINATING IN THE PERINATAL PERIOD,2,Moderate,Minor,Medical,Self-Pay,,,02200,,false,606.77,364.25
New York City,Bronx,7000024,001186,North Central Bronx Hospital,0 to 17,104,F,Other Race,Spanish/Hispanic,2,Urgent,Home or Self Care,2019,PNL007,HEMOLYTIC JAUNDICE AND PERINATAL JAUNDICE,EST002,PHOTOTHERAPY,623,NEONATE BWT 2000-2499G W CONGENITAL/PERINATAL INFECTION,15,NEWBORNS AND OTHER NEONATES WITH CONDITIONS ORIGINATING IN THE PERINATAL PERIOD,1,Minor,Minor,Medical,Medicaid,Medicaid,,02400,,false,12437.13,7466.12
New York City,Manhattan,7002024,001456,Mount Sinai Hospital,0 to 17,124,M,White,Not Span/Hispanic,3,Newborn,Home or Self Care,2019,PNL001,LIVEBORN,ADM010,VACCINATIONS,623,NEONATE BWT 2000-2499G W CONGENITAL/PERINATAL INFECTION,15,NEWBORNS AND OTHER NEONATES WITH CONDITIONS ORIGINATING IN THE PERINATAL PERIOD,1,Minor,Minor,Medical,Medicaid,Medicaid,Self-Pay,02100,,false,33371.97,4709.4
New York City,Manhattan,7002054,001464,New York-Presbyterian Hospital - Columbia Presbyterian Center,0 to 17,100,M,Other Race,Spanish/Hispanic,6,Newborn,Home or Self Care,2019,PNL001,LIVEBORN,ADM010,VACCINATIONS,623,NEONATE BWT 2000-2499G W CONGENITAL/PERINATAL INFECTION,15,NEWBORNS AND OTHER NEONATES WITH CONDITIONS ORIGINATING IN THE PERINATAL PERIOD,2,Moderate,Minor,Medical,Medicaid,Medicaid,Self-Pay,02300,,false,120800.74,23784.53
Hudson Valley,Westchester,5922000,001122,New York - Presbyterian Hospital,0 to 17,104,M,Other Race,Not Span/Hispanic,7,Newborn,Home w/ Home Health Services,2019,PNL001,LIVEBORN,MRS001,CIRCUMCISION,623,NEONATE BWT 2000-2499G W CONGENITAL/PERINATAL INFECTION,15,NEWBORNS AND OTHER NEONATES WITH CONDITIONS ORIGINATING IN THE PERINATAL PERIOD,1,Minor,Minor,Medical,Private Health Insurance,,,UNKN,,false,88392.79,115693.56
New York City,Kings,7001037,001320,University Hospital of Brooklyn,0 to 17,112,M,Black/African American,Not Span/Hispanic,7,Newborn,Home or Self Care,2019,PNL001,LIVEBORN,ESA004,NON-INVASIVE VENTILATION,623,NEONATE BWT 2000-2499G W CONGENITAL/PERINATAL INFECTION,15,NEWBORNS AND OTHER NEONATES WITH CONDITIONS ORIGINATING IN THE PERINATAL PERIOD,1,Minor,Minor,Medical,Medicaid,Medicaid,Self-Pay,02000,,false,46897,32295.71
New York City,Richmond,7004003,001740,Staten Island University Hosp-North,0 to 17,103,M,White,Not Span/Hispanic,8,Newborn,Home or Self Care,2019,PNL001,LIVEBORN,ESA004,NON-INVASIVE VENTILATION,623,NEONATE BWT 2000-2499G W CONGENITAL/PERINATAL INFECTION,15,NEWBORNS AND OTHER NEONATES WITH CONDITIONS ORIGINATING IN THE PERINATAL PERIOD,2,Moderate,Minor,Medical,Medicaid,,,02400,,false,28671.55,23140.77
Long Island,Nassau,2908000,000511,NYU Langone Hospital-Long Island,0 to 17,115,F,White,Spanish/Hispanic,8,Newborn,Home or Self Care,2019,PNL001,LIVEBORN,CNS002,LUMBAR PUNCTURE,623,NEONATE BWT 2000-2499G W CONGENITAL/PERINATAL INFECTION,15,NEWBORNS AND OTHER NEONATES WITH CONDITIONS ORIGINATING IN THE PERINATAL PERIOD,2,Moderate,Minor,Medical,Private Health Insurance,,,02400,,false,92829.29,12634.64
New York City,Richmond,7004003,001740,Staten Island University Hosp-North,0 to 17,103,M,Black/African American,Not Span/Hispanic,8,Newborn,Home or Self Care,2019,PNL001,LIVEBORN,ADM017,ADMINISTRATION OF NUTRITIONAL AND ELECTROLYTIC SUBSTANCES,623,NEONATE BWT 2000-2499G W CONGENITAL/PERINATAL INFECTION,15,NEWBORNS AND OTHER NEONATES WITH CONDITIONS ORIGINATING IN THE PERINATAL PERIOD,1,Minor,Minor,Medical,Private Health Insurance,,,02400,,false,33932.61,24207.41
New York City,Queens,7003001,001628,Flushing Hospital Medical Center,0 to 17,114,M,Other Race,Not Span/Hispanic,3,Emergency,Home or Self Care,2019,PNL009,PERINATAL INFECTIONS,CNS002,LUMBAR PUNCTURE,623,NEONATE BWT 2000-2499G W CONGENITAL/PERINATAL INFECTION,15,NEWBORNS AND OTHER NEONATES WITH CONDITIONS ORIGINATING IN THE PERINATAL PERIOD,1,Minor,Minor,Medical,Medicaid,,,02400,,true,17701,5807.52
New York City,Queens,7003010,001637,New York - Presbyterian/Queens,0 to 17,113,F,Other Race,Not Span/Hispanic,18,Newborn,Home w/ Home Health Services,2019,PNL001,LIVEBORN,ESA004,NON-INVASIVE VENTILATION,623,NEONATE BWT 2000-2499G W CONGENITAL/PERINATAL INFECTION,15,NEWBORNS AND OTHER NEONATES WITH CONDITIONS ORIGINATING IN THE PERINATAL PERIOD,1,Minor,Minor,Medical,Private Health Insurance,Self-Pay,,02200,,false,228586.31,42548.61
New York City,Queens,7003004,003376,Cohen Children's Medical Center,0 to 17,113,F,White,Not Span/Hispanic,15,Urgent,Home or Self Care,2019,PNL009,PERINATAL INFECTIONS,CNS002,LUMBAR PUNCTURE,623,NEONATE BWT 2000-2499G W CONGENITAL/PERINATAL INFECTION,15,NEWBORNS AND OTHER NEONATES WITH CONDITIONS ORIGINATING IN THE PERINATAL PERIOD,1,Minor,Minor,Medical,Medicaid,Medicaid,Self-Pay,02300,,true,272802.19,48383.09
New York City,Bronx,7000002,001165,Jacobi Medical Center,0 to 17,104,M,Other Race,Not Span/Hispanic,9,Newborn,Home or Self Care,2019,PNL001,LIVEBORN,ADM010,VACCINATIONS,623,NEONATE BWT 2000-2499G W CONGENITAL/PERINATAL INFECTION,15,NEWBORNS AND OTHER NEONATES WITH CONDITIONS ORIGINATING IN THE PERINATAL PERIOD,1,Minor,Minor,Medical,Self-Pay,,,02100,,false,49948.32,29551.92
New York City,Kings,7001020,001305,Maimonides Medical Center,0 to 17,112,F,White,Not Span/Hispanic,5,Newborn,Home or Self Care,2019,PNL001,LIVEBORN,ADM010,VACCINATIONS,623,NEONATE BWT 2000-2499G W CONGENITAL/PERINATAL INFECTION,15,NEWBORNS AND OTHER NEONATES WITH CONDITIONS ORIGINATING IN THE PERINATAL PERIOD,2,Moderate,Minor,Medical,Medicaid,Medicaid,Self-Pay,02300,,false,58781,8398.75
New York City,Bronx,7000006,003058,Montefiore Med Center - Jack D Weiler Hosp of A Einstein College Div,0 to 17,104,F,Other Race,Unknown,11,Newborn,Home or Self Care,2019,PNL001,LIVEBORN,CNS002,LUMBAR PUNCTURE,623,NEONATE BWT 2000-2499G W CONGENITAL/PERINATAL INFECTION,15,NEWBORNS AND OTHER NEONATES WITH CONDITIONS ORIGINATING IN THE PERINATAL PERIOD,1,Minor,Minor,Medical,Medicaid,,,02000,,false,178142.8,21553.26
New York City,Manhattan,7002054,001464,New York-Presbyterian Hospital - Columbia Presbyterian Center,0 to 17,112,F,Other Race,Not Span/Hispanic,3,Urgent,Home or Self Care,2019,PNL009,PERINATAL INFECTIONS,MST003,"SUBCUTANEOUS TISSUE, FASCIA, AND MUSCLE BIOPSY",623,NEONATE BWT 2000-2499G W CONGENITAL/PERINATAL INFECTION,15,NEWBORNS AND OTHER NEONATES WITH CONDITIONS ORIGINATING IN THE PERINATAL PERIOD,2,Moderate,Minor,Medical,Medicaid,Medicaid,Self-Pay,02400,,false,55089.23,13759.64
Western NY,Erie,1401014,000208,John R. Oishei Children's Hospital,0 to 17,142,F,White,Not Span/Hispanic,54,Newborn,Home w/ Home Health Services,2019,PNL001,LIVEBORN,EST002,PHOTOTHERAPY,623,NEONATE BWT 2000-2499G W CONGENITAL/PERINATAL INFECTION,15,NEWBORNS AND OTHER NEONATES WITH CONDITIONS ORIGINATING IN THE PERINATAL PERIOD,3,Major,Moderate,Medical,Medicaid,Self-Pay,,02100,,false,405320,93640.64
New York City,Queens,7003003,001629,Jamaica Hospital Medical Center,0 to 17,114,F,White,Spanish/Hispanic,8,Newborn,Home w/ Home Health Services,2019,PNL001,LIVEBORN,ESA004,NON-INVASIVE VENTILATION,623,NEONATE BWT 2000-2499G W CONGENITAL/PERINATAL INFECTION,15,NEWBORNS AND OTHER NEONATES WITH CONDITIONS ORIGINATING IN THE PERINATAL PERIOD,2,Moderate,Minor,Medical,Medicaid,,,02100,,false,33396,13477.79
New York City,Queens,7003001,001628,Flushing Hospital Medical Center,0 to 17,113,M,White,Spanish/Hispanic,7,Newborn,Home or Self Care,2019,PNL001,LIVEBORN,ENT004,DIAGNOSTIC AUDIOLOGY,623,NEONATE BWT 2000-2499G W CONGENITAL/PERINATAL INFECTION,15,NEWBORNS AND OTHER NEONATES WITH CONDITIONS ORIGINATING IN THE PERINATAL PERIOD,1,Minor,Minor,Medical,Medicaid,,,02300,,false,37682,12053.52
New York City,Queens,7003001,001628,Flushing Hospital Medical Center,0 to 17,113,M,White,Spanish/Hispanic,10,Newborn,Home or Self Care,2019,PNL001,LIVEBORN,ADM010,VACCINATIONS,623,NEONATE BWT 2000-2499G W CONGENITAL/PERINATAL INFECTION,15,NEWBORNS AND OTHER NEONATES WITH CONDITIONS ORIGINATING IN THE PERINATAL PERIOD,1,Minor,Minor,Medical,Medicaid,,,02300,,false,55068,17759.57
New York City,Kings,7001020,001305,Maimonides Medical Center,0 to 17,112,M,White,Not Span/Hispanic,13,Newborn,Home or Self Care,2019,PNL001,LIVEBORN,EST003,ULTRAVIOLET LIGHT THERAPY,623,NEONATE BWT 2000-2499G W CONGENITAL/PERINATAL INFECTION,15,NEWBORNS AND OTHER NEONATES WITH CONDITIONS ORIGINATING IN THE PERINATAL PERIOD,1,Minor,Minor,Medical,Medicaid,Medicaid,Self-Pay,02200,,false,157533.29,22907.72
New York City,Queens,7003001,001628,Flushing Hospital Medical Center,0 to 17,114,F,Other Race,Not Span/Hispanic,7,Newborn,Home or Self Care,2019,PNL001,LIVEBORN,ADM010,VACCINATIONS,623,NEONATE BWT 2000-2499G W CONGENITAL/PERINATAL INFECTION,15,NEWBORNS AND OTHER NEONATES WITH CONDITIONS ORIGINATING IN THE PERINATAL PERIOD,1,Minor,Minor,Medical,Medicaid,,,02200,,false,36624,11654.65
Hudson Valley,Rockland,4324000,000776,Montefiore Nyack,0 to 17,109,M,Black/African American,Not Span/Hispanic,12,Newborn,Home or Self Care,2019,PNL001,LIVEBORN,MRS001,CIRCUMCISION,623,NEONATE BWT 2000-2499G W CONGENITAL/PERINATAL INFECTION,15,NEWBORNS AND OTHER NEONATES WITH CONDITIONS ORIGINATING IN THE PERINATAL PERIOD,2,Moderate,Minor,Medical,Medicaid,,,02000,,false,113962.05,23899.14
New York City,Kings,7001003,001288,Brooklyn Hospital Center - Downtown Campus,0 to 17,112,F,Black/African American,Unknown,17,Newborn,Home or Self Care,2019,PNL001,LIVEBORN,CNS002,LUMBAR PUNCTURE,623,NEONATE BWT 2000-2499G W CONGENITAL/PERINATAL INFECTION,15,NEWBORNS AND OTHER NEONATES WITH CONDITIONS ORIGINATING IN THE PERINATAL PERIOD,2,Moderate,Minor,Medical,Medicaid,Medicaid,Self-Pay,02100,,false,206172.62,23361.92
Long Island,Nassau,2950001,000527,Mount Sinai South Nassau,0 to 17,117,M,White,Not Span/Hispanic,6,Newborn,Home or Self Care,2019,PNL001,LIVEBORN,EST002,PHOTOTHERAPY,623,NEONATE BWT 2000-2499G W CONGENITAL/PERINATAL INFECTION,15,NEWBORNS AND OTHER NEONATES WITH CONDITIONS ORIGINATING IN THE PERINATAL PERIOD,2,Moderate,Minor,Medical,Medicaid,Medicaid,,02300,,false,59916.32,7877.36
Hudson Valley,Rockland,4324000,000776,Montefiore Nyack,0 to 17,109,M,Other Race,Not Span/Hispanic,8,Newborn,Home or Self Care,2019,PNL001,LIVEBORN,MRS001,CIRCUMCISION,623,NEONATE BWT 2000-2499G W CONGENITAL/PERINATAL INFECTION,15,NEWBORNS AND OTHER NEONATES WITH CONDITIONS ORIGINATING IN THE PERINATAL PERIOD,1,Minor,Minor,Medical,Medicaid,,,02100,,false,78351.34,16651.51
New York City,Bronx,7000006,001168,Montefiore Medical Center-Wakefield Hospital,0 to 17,104,M,Other Race,Unknown,12,Newborn,Home or Self Care,2019,PNL001,LIVEBORN,ESA004,NON-INVASIVE VENTILATION,623,NEONATE BWT 2000-2499G W CONGENITAL/PERINATAL INFECTION,15,NEWBORNS AND OTHER NEONATES WITH CONDITIONS ORIGINATING IN THE PERINATAL PERIOD,1,Minor,Minor,Medical,Medicaid,,,02300,,false,202261.29,24599.47
Long Island,Nassau,2909000,000513,Mercy Hospital,0 to 17,114,F,Other Race,Not Span/Hispanic,14,Newborn,Home or Self Care,2019,PNL001,LIVEBORN,ESA004,NON-INVASIVE VENTILATION,623,NEONATE BWT 2000-2499G W CONGENITAL/PERINATAL INFECTION,15,NEWBORNS AND OTHER NEONATES WITH CONDITIONS ORIGINATING IN THE PERINATAL PERIOD,2,Moderate,Minor,Medical,Private Health Insurance,,,02000,,false,95939,29404.28
New York City,Bronx,7000002,001165,Jacobi Medical Center,0 to 17,104,M,Other Race,Unknown,11,Newborn,Home w/ Home Health Services,2019,PNL001,LIVEBORN,ADM010,VACCINATIONS,623,NEONATE BWT 2000-2499G W CONGENITAL/PERINATAL INFECTION,15,NEWBORNS AND OTHER NEONATES WITH CONDITIONS ORIGINATING IN THE PERINATAL PERIOD,2,Moderate,Minor,Medical,Medicaid,Medicaid,,02200,,false,64662.94,38257.83
Hudson Valley,Rockland,4324000,000776,Montefiore Nyack,0 to 17,109,M,Black/African American,Not Span/Hispanic,12,Newborn,Home or Self Care,2019,PNL001,LIVEBORN,MRS001,CIRCUMCISION,623,NEONATE BWT 2000-2499G W CONGENITAL/PERINATAL INFECTION,15,NEWBORNS AND OTHER NEONATES WITH CONDITIONS ORIGINATING IN THE PERINATAL PERIOD,2,Moderate,Minor,Medical,Medicaid,,,02000,,false,117289.05,24235.48
Hudson Valley,Rockland,4324000,000776,Montefiore Nyack,0 to 17,109,F,White,Not Span/Hispanic,7,Newborn,Home or Self Care,2019,PNL001,LIVEBORN,,,623,NEONATE BWT 2000-2499G W CONGENITAL/PERINATAL INFECTION,15,NEWBORNS AND OTHER NEONATES WITH CONDITIONS ORIGINATING IN THE PERINATAL PERIOD,1,Minor,Minor,Medical,Medicaid,,,02200,,false,61981.53,12689.4
New York City,Kings,7001020,001305,Maimonides Medical Center,0 to 17,112,M,Black/African American,Not Span/Hispanic,3,Emergency,Home or Self Care,2019,PNL009,PERINATAL INFECTIONS,CNS002,LUMBAR PUNCTURE,623,NEONATE BWT 2000-2499G W CONGENITAL/PERINATAL INFECTION,15,NEWBORNS AND OTHER NEONATES WITH CONDITIONS ORIGINATING IN THE PERINATAL PERIOD,1,Minor,Minor,Medical,Private Health Insurance,Self-Pay,,02300,,true,40793,7105.29
Long Island,Nassau,2909000,000513,Mercy Hospital,0 to 17,115,M,Black/African American,Not Span/Hispanic,31,Newborn,Home or Self Care,2019,PNL001,LIVEBORN,EST002,PHOTOTHERAPY,623,NEONATE BWT 2000-2499G W CONGENITAL/PERINATAL INFECTION,15,NEWBORNS AND OTHER NEONATES WITH CONDITIONS ORIGINATING IN THE PERINATAL PERIOD,2,Moderate,Minor,Medical,Private Health Insurance,,,02000,,false,236252,68219.09
Finger Lakes,Chemung,0701000,000116,Arnot Ogden Medical Center,0 to 17,OOS,F,Black/African American,Not Span/Hispanic,25,Emergency,Home or Self Care,2019,PNL009,PERINATAL INFECTIONS,,,623,NEONATE BWT 2000-2499G W CONGENITAL/PERINATAL INFECTION,15,NEWBORNS AND OTHER NEONATES WITH CONDITIONS ORIGINATING IN THE PERINATAL PERIOD,1,Minor,Minor,Medical,Medicaid,,,02300,,false,52043.71,20177.48
New York City,Kings,7001002,001286,Brookdale Hospital Medical Center,0 to 17,112,F,Black/African American,Not Span/Hispanic,8,Newborn,Home or Self Care,2019,PNL001,LIVEBORN,ADM017,ADMINISTRATION OF NUTRITIONAL AND ELECTROLYTIC SUBSTANCES,623,NEONATE BWT 2000-2499G W CONGENITAL/PERINATAL INFECTION,15,NEWBORNS AND OTHER NEONATES WITH CONDITIONS ORIGINATING IN THE PERINATAL PERIOD,2,Moderate,Minor,Medical,Medicaid,,,02400,,false,37363.2,19633.27
New York City,Kings,7001002,001286,Brookdale Hospital Medical Center,0 to 17,112,F,Black/African American,Not Span/Hispanic,5,Newborn,Home or Self Care,2019,PNL001,LIVEBORN,ESA004,NON-INVASIVE VENTILATION,623,NEONATE BWT 2000-2499G W CONGENITAL/PERINATAL INFECTION,15,NEWBORNS AND OTHER NEONATES WITH CONDITIONS ORIGINATING IN THE PERINATAL PERIOD,2,Moderate,Minor,Medical,Medicaid,,,02200,,false,24707.31,12804.78
New York City,Kings,7001002,001286,Brookdale Hospital Medical Center,0 to 17,112,M,Black/African American,Not Span/Hispanic,13,Newborn,Home or Self Care,2019,PNL001,LIVEBORN,ESA004,NON-INVASIVE VENTILATION,623,NEONATE BWT 2000-2499G W CONGENITAL/PERINATAL INFECTION,15,NEWBORNS AND OTHER NEONATES WITH CONDITIONS ORIGINATING IN THE PERINATAL PERIOD,2,Moderate,Minor,Medical,Medicaid,,,02200,,false,62493.5,32533.11
New York City,Kings,7001002,001286,Brookdale Hospital Medical Center,0 to 17,112,F,Black/African American,Unknown,6,Newborn,Home or Self Care,2019,PNL001,LIVEBORN,ADM010,VACCINATIONS,623,NEONATE BWT 2000-2499G W CONGENITAL/PERINATAL INFECTION,15,NEWBORNS AND OTHER NEONATES WITH CONDITIONS ORIGINATING IN THE PERINATAL PERIOD,1,Minor,Minor,Medical,Medicaid,,,02400,,false,26480.77,14209.6
New York City,Kings,7001002,001286,Brookdale Hospital Medical Center,0 to 17,112,F,Black/African American,Not Span/Hispanic,7,Newborn,Home or Self Care,2019,PNL001,LIVEBORN,ADM010,VACCINATIONS,623,NEONATE BWT 2000-2499G W CONGENITAL/PERINATAL INFECTION,15,NEWBORNS AND OTHER NEONATES WITH CONDITIONS ORIGINATING IN THE PERINATAL PERIOD,1,Minor,Minor,Medical,Medicaid,,,02000,,false,32089.26,17053.24
New York City,Kings,7001002,001286,Brookdale Hospital Medical Center,0 to 17,112,F,Black/African American,Unknown,4,Newborn,Home or Self Care,2019,PNL001,LIVEBORN,ADM010,VACCINATIONS,623,NEONATE BWT 2000-2499G W CONGENITAL/PERINATAL INFECTION,15,NEWBORNS AND OTHER NEONATES WITH CONDITIONS ORIGINATING IN THE PERINATAL PERIOD,1,Minor,Minor,Medical,Medicaid,,,02300,,false,17907.56,9481.62
Finger Lakes,Monroe,2701005,000413,Strong Memorial Hospital,0 to 17,146,M,White,Not Span/Hispanic,3,Newborn,Home or Self Care,2019,PNL001,LIVEBORN,,,623,NEONATE BWT 2000-2499G W CONGENITAL/PERINATAL INFECTION,15,NEWBORNS AND OTHER NEONATES WITH CONDITIONS ORIGINATING IN THE PERINATAL PERIOD,1,Minor,Minor,Medical,Medicaid,,,02300,,false,18888.92,7863.27
New York City,Queens,7003004,003376,Cohen Children's Medical Center,0 to 17,115,F,White,Not Span/Hispanic,17,Newborn,Home or Self Care,2019,PNL001,LIVEBORN,,,623,NEONATE BWT 2000-2499G W CONGENITAL/PERINATAL INFECTION,15,NEWBORNS AND OTHER NEONATES WITH CONDITIONS ORIGINATING IN THE PERINATAL PERIOD,2,Moderate,Minor,Medical,Private Health Insurance,Private Health Insurance,Self-Pay,02100,,false,271537.86,51467.66
New York City,Kings,7001002,001286,Brookdale Hospital Medical Center,0 to 17,112,M,Black/African American,Not Span/Hispanic,3,Newborn,Home or Self Care,2019,PNL001,LIVEBORN,ADM010,VACCINATIONS,623,NEONATE BWT 2000-2499G W CONGENITAL/PERINATAL INFECTION,15,NEWBORNS AND OTHER NEONATES WITH CONDITIONS ORIGINATING IN THE PERINATAL PERIOD,1,Minor,Minor,Medical,Medicaid,,,02200,,false,14770.33,7484.32
New York City,Kings,7001035,001318,Wyckoff Heights Medical Center,0 to 17,112,M,Black/African American,Not Span/Hispanic,9,Newborn,Home or Self Care,2019,PNL001,LIVEBORN,MRS001,CIRCUMCISION,623,NEONATE BWT 2000-2499G W CONGENITAL/PERINATAL INFECTION,15,NEWBORNS AND OTHER NEONATES WITH CONDITIONS ORIGINATING IN THE PERINATAL PERIOD,1,Minor,Minor,Medical,Medicaid,Miscellaneous/Other,,02200,,false,28651.83,11731.38
Southern Tier,Broome,0303001,000058,United Health Services Hospitals Inc. - Wilson Medical Center,0 to 17,139,F,Black/African American,Not Span/Hispanic,16,Newborn,Home or Self Care,2019,PNL001,LIVEBORN,ADM015,ADMINISTRATION OF ANTIBIOTICS,623,NEONATE BWT 2000-2499G W CONGENITAL/PERINATAL INFECTION,15,NEWBORNS AND OTHER NEONATES WITH CONDITIONS ORIGINATING IN THE PERINATAL PERIOD,1,Minor,Minor,Medical,Medicare,Medicaid,,02000,,false,36235.4,12857.91
New York City,Bronx,7000002,001165,Jacobi Medical Center,0 to 17,104,M,Other Race,Unknown,2,Newborn,Home or Self Care,2019,PNL001,LIVEBORN,MRS001,CIRCUMCISION,623,NEONATE BWT 2000-2499G W CONGENITAL/PERINATAL INFECTION,15,NEWBORNS AND OTHER NEONATES WITH CONDITIONS ORIGINATING IN THE PERINATAL PERIOD,1,Minor,Minor,Medical,Medicaid,Medicaid,,02300,,false,5626.15,3328.71
Hudson Valley,Westchester,5904001,001072,Montefiore New Rochelle Hospital,0 to 17,104,F,Other Race,Unknown,24,Emergency,Home or Self Care,2019,PNL004,NEONATAL CEREBRAL DISORDERS,ADM017,ADMINISTRATION OF NUTRITIONAL AND ELECTROLYTIC SUBSTANCES,623,NEONATE BWT 2000-2499G W CONGENITAL/PERINATAL INFECTION,15,NEWBORNS AND OTHER NEONATES WITH CONDITIONS ORIGINATING IN THE PERINATAL PERIOD,3,Major,Minor,Medical,Medicaid,Medicaid,Self-Pay,02000,,false,130840.14,146289.86
New York City,Manhattan,7002032,001466,Mount Sinai West,0 to 17,100,M,Other Race,Not Span/Hispanic,24,Newborn,Home or Self Care,2019,PNL001,LIVEBORN,ADM017,ADMINISTRATION OF NUTRITIONAL AND ELECTROLYTIC SUBSTANCES,623,NEONATE BWT 2000-2499G W CONGENITAL/PERINATAL INFECTION,15,NEWBORNS AND OTHER NEONATES WITH CONDITIONS ORIGINATING IN THE PERINATAL PERIOD,2,Moderate,Minor,Medical,Medicaid,Medicaid,Self-Pay,02100,,false,448892.74,115115.61
New York City,Bronx,7000006,003058,Montefiore Med Center - Jack D Weiler Hosp of A Einstein College Div,0 to 17,104,F,Other Race,Unknown,7,Newborn,Home or Self Care,2019,PNL001,LIVEBORN,CNS002,LUMBAR PUNCTURE,623,NEONATE BWT 2000-2499G W CONGENITAL/PERINATAL INFECTION,15,NEWBORNS AND OTHER NEONATES WITH CONDITIONS ORIGINATING IN THE PERINATAL PERIOD,1,Minor,Minor,Medical,Medicaid,,,02300,,false,121634.41,14167.65
New York City,Queens,7003010,001637,New York - Presbyterian/Queens,0 to 17,113,M,Other Race,Not Span/Hispanic,6,Newborn,Home w/ Home Health Services,2019,PNL001,LIVEBORN,ADM021,"ADMINISTRATION OF THERAPEUTIC SUBSTANCES, NEC",623,NEONATE BWT 2000-2499G W CONGENITAL/PERINATAL INFECTION,15,NEWBORNS AND OTHER NEONATES WITH CONDITIONS ORIGINATING IN THE PERINATAL PERIOD,2,Moderate,Minor,Medical,"Managed Care, Unspecified",Medicaid,Self-Pay,02300,,false,91881.84,17351.85
Western NY,Erie,1401013,000218,Sisters of Charity Hospital,0 to 17,142,F,Black/African American,Not Span/Hispanic,13,Newborn,Home or Self Care,2019,PNL001,LIVEBORN,ESA004,NON-INVASIVE VENTILATION,623,NEONATE BWT 2000-2499G W CONGENITAL/PERINATAL INFECTION,15,NEWBORNS AND OTHER NEONATES WITH CONDITIONS ORIGINATING IN THE PERINATAL PERIOD,2,Moderate,Minor,Medical,Medicaid,Medicaid,,02200,,false,49115,13781.99
New York City,Kings,7001016,001301,Kings County Hospital Center,0 to 17,112,F,Black/African American,Not Span/Hispanic,5,Newborn,Home or Self Care,2019,PNL001,LIVEBORN,ADM010,VACCINATIONS,623,NEONATE BWT 2000-2499G W CONGENITAL/PERINATAL INFECTION,15,NEWBORNS AND OTHER NEONATES WITH CONDITIONS ORIGINATING IN THE PERINATAL PERIOD,2,Moderate,Moderate,Medical,Medicaid,Medicaid,,02300,,false,20874.73,14828.59
Long Island,Nassau,2951001,000541,North Shore University Hospital,0 to 17,115,F,Other Race,Spanish/Hispanic,14,Newborn,Home or Self Care,2019,PNL001,LIVEBORN,ESA004,NON-INVASIVE VENTILATION,623,NEONATE BWT 2000-2499G W CONGENITAL/PERINATAL INFECTION,15,NEWBORNS AND OTHER NEONATES WITH CONDITIONS ORIGINATING IN THE PERINATAL PERIOD,1,Minor,Minor,Medical,Medicaid,Medicaid,,02400,,false,224338.42,36911.21
Hudson Valley,Rockland,4324000,000776,Montefiore Nyack,0 to 17,109,F,Other Race,Not Span/Hispanic,3,Emergency,Home or Self Care,2019,PNL013,OTHER SPECIFIED AND UNSPECIFIED PERINATAL CONDITIONS,,,623,NEONATE BWT 2000-2499G W CONGENITAL/PERINATAL INFECTION,15,NEWBORNS AND OTHER NEONATES WITH CONDITIONS ORIGINATING IN THE PERINATAL PERIOD,1,Minor,Minor,Medical,Medicaid,,,02300,,false,30180.69,5771.74
New York City,Kings,7001035,001318,Wyckoff Heights Medical Center,0 to 17,113,F,Other Race,Not Span/Hispanic,12,Newborn,Home or Self Care,2019,PNL001,LIVEBORN,ESA004,NON-INVASIVE VENTILATION,623,NEONATE BWT 2000-2499G W CONGENITAL/PERINATAL INFECTION,15,NEWBORNS AND OTHER NEONATES WITH CONDITIONS ORIGINATING IN THE PERINATAL PERIOD,1,Minor,Minor,Medical,Medicaid,Miscellaneous/Other,,02200,,false,47896.29,16992.25