Hospital Service Area,Hospital County,Operating Certificate Number,Permanent Facility Id,Facility Name,Age Group,Zip Code - 3 digits,Gender,Race,Ethnicity,Length of Stay,Type of Admission,Patient Disposition,Discharge Year,CCS Diagnosis Code,CCS Diagnosis Description,CCS Procedure Code,CCS Procedure Description,APR DRG Code,APR DRG Description,APR MDC Code,APR MDC Description,APR Severity of Illness Code,APR Severity of Illness Description,APR Risk of Mortality,APR Medical Surgical Description,Payment Typology 1,Payment Typology 2,Payment Typology 3,Birth Weight,Abortion Edit Indicator,Emergency Department Indicator,Total Charges,Total Costs
New York City,Manhattan,7002053,001463,NYU Langone Hospitals,0 to 17,105,F,White,Unknown,10,Newborn,Home or Self Care,2019,PNL001,LIVEBORN,ESA004,NON-INVASIVE VENTILATION,625,NEONATE BWT 2000-2499G W OTHER SIGNIFICANT CONDITION,15,NEWBORNS AND OTHER NEONATES WITH CONDITIONS ORIGINATING IN THE PERINATAL PERIOD,1,Minor,Minor,Medical,Private Health Insurance,,,02000,,false,126869.61,52236.66
New York City,Manhattan,7002053,001463,NYU Langone Hospitals,0 to 17,112,M,White,Not Span/Hispanic,4,Newborn,Home or Self Care,2019,PNL001,LIVEBORN,EST002,PHOTOTHERAPY,625,NEONATE BWT 2000-2499G W OTHER SIGNIFICANT CONDITION,15,NEWBORNS AND OTHER NEONATES WITH CONDITIONS ORIGINATING IN THE PERINATAL PERIOD,1,Minor,Minor,Medical,Medicaid,,,02300,,false,56784.12,21304.18
New York City,Manhattan,7002053,001463,NYU Langone Hospitals,0 to 17,100,M,Other Race,Not Span/Hispanic,6,Newborn,Home or Self Care,2019,PNL001,LIVEBORN,ESA004,NON-INVASIVE VENTILATION,625,NEONATE BWT 2000-2499G W OTHER SIGNIFICANT CONDITION,15,NEWBORNS AND OTHER NEONATES WITH CONDITIONS ORIGINATING IN THE PERINATAL PERIOD,2,Moderate,Minor,Medical,Private Health Insurance,,,02400,,false,87006.9,32791.96
New York City,Manhattan,7002053,001463,NYU Langone Hospitals,0 to 17,111,M,White,Unknown,4,Newborn,Home or Self Care,2019,PNL001,LIVEBORN,ESA004,NON-INVASIVE VENTILATION,625,NEONATE BWT 2000-2499G W OTHER SIGNIFICANT CONDITION,15,NEWBORNS AND OTHER NEONATES WITH CONDITIONS ORIGINATING IN THE PERINATAL PERIOD,1,Minor,Moderate,Medical,Self-Pay,,,02400,,false,52861.64,20126.27
New York City,Manhattan,7002053,001463,NYU Langone Hospitals,0 to 17,100,M,White,Unknown,9,Newborn,Home or Self Care,2019,PNL001,LIVEBORN,CNS002,LUMBAR PUNCTURE,625,NEONATE BWT 2000-2499G W OTHER SIGNIFICANT CONDITION,15,NEWBORNS AND OTHER NEONATES WITH CONDITIONS ORIGINATING IN THE PERINATAL PERIOD,1,Minor,Minor,Medical,Blue Cross/Blue Shield,,,02400,,false,160863.4,47174.7
New York City,Manhattan,7002053,001463,NYU Langone Hospitals,0 to 17,112,F,White,Not Span/Hispanic,9,Newborn,Home or Self Care,2019,PNL001,LIVEBORN,ENT004,DIAGNOSTIC AUDIOLOGY,625,NEONATE BWT 2000-2499G W OTHER SIGNIFICANT CONDITION,15,NEWBORNS AND OTHER NEONATES WITH CONDITIONS ORIGINATING IN THE PERINATAL PERIOD,1,Minor,Minor,Medical,Private Health Insurance,,,02200,,false,111163.14,46664.59
New York City,Manhattan,7002053,001463,NYU Langone Hospitals,0 to 17,110,M,White,Unknown,8,Newborn,Home or Self Care,2019,PNL001,LIVEBORN,ADM010,VACCINATIONS,625,NEONATE BWT 2000-2499G W OTHER SIGNIFICANT CONDITION,15,NEWBORNS AND OTHER NEONATES WITH CONDITIONS ORIGINATING IN THE PERINATAL PERIOD,1,Minor,Minor,Medical,Private Health Insurance,,,02000,,false,103046.71,41481.05
New York City,Manhattan,7002053,001463,NYU Langone Hospitals,0 to 17,112,F,White,Not Span/Hispanic,2,Newborn,Home or Self Care,2019,PNL001,LIVEBORN,ADM017,ADMINISTRATION OF NUTRITIONAL AND ELECTROLYTIC SUBSTANCES,625,NEONATE BWT 2000-2499G W OTHER SIGNIFICANT CONDITION,15,NEWBORNS AND OTHER NEONATES WITH CONDITIONS ORIGINATING IN THE PERINATAL PERIOD,3,Major,Moderate,Medical,Medicaid,,,02100,,false,32663.73,11508.43
New York City,Manhattan,7002053,001463,NYU Langone Hospitals,0 to 17,112,M,Other Race,Unknown,17,Newborn,Home or Self Care,2019,PNL001,LIVEBORN,MRS001,CIRCUMCISION,625,NEONATE BWT 2000-2499G W OTHER SIGNIFICANT CONDITION,15,NEWBORNS AND OTHER NEONATES WITH CONDITIONS ORIGINATING IN THE PERINATAL PERIOD,1,Minor,Minor,Medical,Blue Cross/Blue Shield,,,02100,,false,215212.26,89170.49
New York City,Manhattan,7002053,001463,NYU Langone Hospitals,0 to 17,OOS,F,Other Race,Not Span/Hispanic,5,Newborn,Home or Self Care,2019,PNL001,LIVEBORN,ENT004,DIAGNOSTIC AUDIOLOGY,625,NEONATE BWT 2000-2499G W OTHER SIGNIFICANT CONDITION,15,NEWBORNS AND OTHER NEONATES WITH CONDITIONS ORIGINATING IN THE PERINATAL PERIOD,1,Minor,Minor,Medical,Private Health Insurance,Private Health Insurance,,02100,,false,61861.7,25700.95
New York City,Manhattan,7002053,001463,NYU Langone Hospitals,0 to 17,112,F,Other Race,Unknown,48,Newborn,Home or Self Care,2019,PNL001,LIVEBORN,ADM017,ADMINISTRATION OF NUTRITIONAL AND ELECTROLYTIC SUBSTANCES,625,NEONATE BWT 2000-2499G W OTHER SIGNIFICANT CONDITION,15,NEWBORNS AND OTHER NEONATES WITH CONDITIONS ORIGINATING IN THE PERINATAL PERIOD,2,Moderate,Minor,Medical,Private Health Insurance,,,02100,,false,572257.16,242261.72
New York City,Manhattan,7002053,001463,NYU Langone Hospitals,0 to 17,,F,White,Unknown,3,Newborn,Home or Self Care,2019,PNL001,LIVEBORN,ENT004,DIAGNOSTIC AUDIOLOGY,625,NEONATE BWT 2000-2499G W OTHER SIGNIFICANT CONDITION,15,NEWBORNS AND OTHER NEONATES WITH CONDITIONS ORIGINATING IN THE PERINATAL PERIOD,2,Moderate,Minor,Medical,Private Health Insurance,,,02400,,false,32324.14,13019.83
New York City,Manhattan,7002053,001463,NYU Langone Hospitals,0 to 17,112,M,White,Not Span/Hispanic,3,Newborn,Home or Self Care,2019,PNL001,LIVEBORN,ESA004,NON-INVASIVE VENTILATION,625,NEONATE BWT 2000-2499G W OTHER SIGNIFICANT CONDITION,15,NEWBORNS AND OTHER NEONATES WITH CONDITIONS ORIGINATING IN THE PERINATAL PERIOD,2,Moderate,Moderate,Medical,Private Health Insurance,,,02000,,false,40902.58,17765.58
New York City,Manhattan,7002053,001463,NYU Langone Hospitals,0 to 17,112,M,White,Unknown,21,Newborn,Home or Self Care,2019,PNL001,LIVEBORN,ADM010,VACCINATIONS,625,NEONATE BWT 2000-2499G W OTHER SIGNIFICANT CONDITION,15,NEWBORNS AND OTHER NEONATES WITH CONDITIONS ORIGINATING IN THE PERINATAL PERIOD,3,Major,Minor,Medical,Blue Cross/Blue Shield,,,02200,,false,279845.46,109790.59
New York City,Manhattan,7002053,001463,NYU Langone Hospitals,0 to 17,112,F,White,Unknown,4,Newborn,Home or Self Care,2019,PNL001,LIVEBORN,ENT004,DIAGNOSTIC AUDIOLOGY,625,NEONATE BWT 2000-2499G W OTHER SIGNIFICANT CONDITION,15,NEWBORNS AND OTHER NEONATES WITH CONDITIONS ORIGINATING IN THE PERINATAL PERIOD,1,Minor,Minor,Medical,Medicaid,,,02300,,false,54498.42,21330.38
New York City,Manhattan,7002053,001463,NYU Langone Hospitals,0 to 17,100,M,White,Unknown,5,Newborn,Home or Self Care,2019,PNL001,LIVEBORN,CNS002,LUMBAR PUNCTURE,625,NEONATE BWT 2000-2499G W OTHER SIGNIFICANT CONDITION,15,NEWBORNS AND OTHER NEONATES WITH CONDITIONS ORIGINATING IN THE PERINATAL PERIOD,1,Minor,Minor,Medical,Blue Cross/Blue Shield,,,02400,,false,69733.99,27129.34
New York City,Manhattan,7002053,001463,NYU Langone Hospitals,0 to 17,112,M,White,Unknown,6,Newborn,Home or Self Care,2019,PNL001,LIVEBORN,EST002,PHOTOTHERAPY,625,NEONATE BWT 2000-2499G W OTHER SIGNIFICANT CONDITION,15,NEWBORNS AND OTHER NEONATES WITH CONDITIONS ORIGINATING IN THE PERINATAL PERIOD,1,Minor,Minor,Medical,Private Health Insurance,,,02400,,false,81081.99,32324.72
New York City,Manhattan,7002053,001463,NYU Langone Hospitals,0 to 17,112,M,White,Unknown,14,Newborn,Home or Self Care,2019,PNL001,LIVEBORN,EST002,PHOTOTHERAPY,625,NEONATE BWT 2000-2499G W OTHER SIGNIFICANT CONDITION,15,NEWBORNS AND OTHER NEONATES WITH CONDITIONS ORIGINATING IN THE PERINATAL PERIOD,1,Minor,Minor,Medical,Private Health Insurance,,,02100,,false,183189.98,73774.44
New York City,Manhattan,7002053,001463,NYU Langone Hospitals,0 to 17,100,M,White,Not Span/Hispanic,9,Newborn,Home or Self Care,2019,PNL001,LIVEBORN,MRS001,CIRCUMCISION,625,NEONATE BWT 2000-2499G W OTHER SIGNIFICANT CONDITION,15,NEWBORNS AND OTHER NEONATES WITH CONDITIONS ORIGINATING IN THE PERINATAL PERIOD,1,Minor,Minor,Medical,Private Health Insurance,,,02400,,false,117698.89,47692.87
New York City,Manhattan,7002053,001463,NYU Langone Hospitals,0 to 17,112,F,Black/African American,Unknown,2,Newborn,Home or Self Care,2019,PNL001,LIVEBORN,,,625,NEONATE BWT 2000-2499G W OTHER SIGNIFICANT CONDITION,15,NEWBORNS AND OTHER NEONATES WITH CONDITIONS ORIGINATING IN THE PERINATAL PERIOD,1,Minor,Minor,Medical,Blue Cross/Blue Shield,,,02300,,false,27446.58,10201.07
