Hospital Service Area,Hospital County,Operating Certificate Number,Permanent Facility Id,Facility Name,Age Group,Zip Code - 3 digits,Gender,Race,Ethnicity,Length of Stay,Type of Admission,Patient Disposition,Discharge Year,CCS Diagnosis Code,CCS Diagnosis Description,CCS Procedure Code,CCS Procedure Description,APR DRG Code,APR DRG Description,APR MDC Code,APR MDC Description,APR Severity of Illness Code,APR Severity of Illness Description,APR Risk of Mortality,APR Medical Surgical Description,Payment Typology 1,Payment Typology 2,Payment Typology 3,Birth Weight,Abortion Edit Indicator,Emergency Department Indicator,Total Charges,Total Costs
Hudson Valley,Sullivan,5263000,000971,Catskill Regional Medical Center,0 to 17,127,F,Other Race,Spanish/Hispanic,3,Newborn,Home or Self Care,2017,218,Liveborn,000,NO PROC,626,"Neonate bwt 2000-2499g, normal newborn or neonate w other problem",15,Newborns and Other Neonates with Conditions Originating in the Perinatal Period,2,Moderate,Minor,Medical,Medicaid,,,02300,N,N,7379.71,2403.80
New York City,Manhattan,7002002,001439,Mount Sinai Beth Israel,0 to 17,112,F,Other Race,Not Span/Hispanic,4,Newborn,Home or Self Care,2017,218,Liveborn,220,OPHTHALM-/OT-OLOGIC DX,626,"Neonate bwt 2000-2499g, normal newborn or neonate w other problem",15,Newborns and Other Neonates with Conditions Originating in the Perinatal Period,2,Moderate,Minor,Medical,Medicaid,Self-Pay,,02400,N,N,16435.00,1720.74
New York City,Manhattan,7002032,001466,Mount Sinai West,0 to 17,100,F,White,Not Span/Hispanic,3,Newborn,Home or Self Care,2017,218,Liveborn,228,PROPHYLACTIC VAC/INOCUL,626,"Neonate bwt 2000-2499g, normal newborn or neonate w other problem",15,Newborns and Other Neonates with Conditions Originating in the Perinatal Period,2,Moderate,Minor,Medical,Private Health Insurance,Self-Pay,,02200,N,N,13000.53,5508.20
New York City,Bronx,7000006,001168,Montefiore Medical Center-Wakefield Hospital,0 to 17,104,F,Other Race,Not Span/Hispanic,5,Newborn,Home or Self Care,2017,218,Liveborn,228,PROPHYLACTIC VAC/INOCUL,626,"Neonate bwt 2000-2499g, normal newborn or neonate w other problem",15,Newborns and Other Neonates with Conditions Originating in the Perinatal Period,3,Major,Minor,Medical,Medicaid,,,02400,N,N,62473.89,8912.16
New York City,Manhattan,7002002,001439,Mount Sinai Beth Israel,0 to 17,112,F,Other Race,Not Span/Hispanic,3,Newborn,Home or Self Care,2017,218,Liveborn,220,OPHTHALM-/OT-OLOGIC DX,626,"Neonate bwt 2000-2499g, normal newborn or neonate w other problem",15,Newborns and Other Neonates with Conditions Originating in the Perinatal Period,1,Minor,Minor,Medical,Blue Cross/Blue Shield,Self-Pay,,02300,N,N,12238.20,1306.77
New York City,Manhattan,7002024,001456,Mount Sinai Hospital,0 to 17,100,M,White,Not Span/Hispanic,4,Newborn,Home or Self Care,2017,218,Liveborn,231,OTHER THERAPEUTIC PRCS,626,"Neonate bwt 2000-2499g, normal newborn or neonate w other problem",15,Newborns and Other Neonates with Conditions Originating in the Perinatal Period,2,Moderate,Minor,Medical,Private Health Insurance,Self-Pay,,02300,N,N,38875.43,14709.48
New York City,Manhattan,7002024,001456,Mount Sinai Hospital,0 to 17,100,M,Other Race,Not Span/Hispanic,2,Newborn,Home or Self Care,2017,218,Liveborn,220,OPHTHALM-/OT-OLOGIC DX,626,"Neonate bwt 2000-2499g, normal newborn or neonate w other problem",15,Newborns and Other Neonates with Conditions Originating in the Perinatal Period,2,Moderate,Minor,Medical,Self-Pay,Self-Pay,,02200,N,N,10143.13,1499.59
New York City,Manhattan,7002024,001456,Mount Sinai Hospital,0 to 17,100,F,Black/African American,Not Span/Hispanic,3,Newborn,Home or Self Care,2017,218,Liveborn,220,OPHTHALM-/OT-OLOGIC DX,626,"Neonate bwt 2000-2499g, normal newborn or neonate w other problem",15,Newborns and Other Neonates with Conditions Originating in the Perinatal Period,2,Moderate,Minor,Medical,Private Health Insurance,Self-Pay,,02400,N,N,13353.13,1727.59
New York City,Manhattan,7002032,001466,Mount Sinai West,0 to 17,100,M,White,Not Span/Hispanic,4,Newborn,Home or Self Care,2017,218,Liveborn,228,PROPHYLACTIC VAC/INOCUL,626,"Neonate bwt 2000-2499g, normal newborn or neonate w other problem",15,Newborns and Other Neonates with Conditions Originating in the Perinatal Period,1,Minor,Minor,Medical,Blue Cross/Blue Shield,Self-Pay,,02000,N,N,16847.63,7288.65
New York City,Manhattan,7002032,001466,Mount Sinai West,0 to 17,112,F,Other Race,Unknown,3,Newborn,Home or Self Care,2017,218,Liveborn,228,PROPHYLACTIC VAC/INOCUL,626,"Neonate bwt 2000-2499g, normal newborn or neonate w other problem",15,Newborns and Other Neonates with Conditions Originating in the Perinatal Period,1,Minor,Minor,Medical,Private Health Insurance,Self-Pay,,02400,N,N,12685.53,5479.78
New York City,Manhattan,7002032,001466,Mount Sinai West,0 to 17,100,M,Black/African American,Not Span/Hispanic,2,Newborn,Home or Self Care,2017,218,Liveborn,228,PROPHYLACTIC VAC/INOCUL,626,"Neonate bwt 2000-2499g, normal newborn or neonate w other problem",15,Newborns and Other Neonates with Conditions Originating in the Perinatal Period,1,Minor,Minor,Medical,Medicaid,Medicaid,Self-Pay,02400,N,N,9184.53,3736.95
New York City,Manhattan,7002032,001466,Mount Sinai West,0 to 17,100,F,Other Race,Not Span/Hispanic,9,Newborn,Home or Self Care,2017,218,Liveborn,228,PROPHYLACTIC VAC/INOCUL,626,"Neonate bwt 2000-2499g, normal newborn or neonate w other problem",15,Newborns and Other Neonates with Conditions Originating in the Perinatal Period,3,Major,Minor,Medical,Private Health Insurance,Self-Pay,,02300,N,N,97171.60,42939.00
Hudson Valley,Orange,3523000,000699,Orange Regional Medical Center,0 to 17,125,M,White,Not Span/Hispanic,7,Newborn,Home or Self Care,2017,218,Liveborn,115,CIRCUMCISION,626,"Neonate bwt 2000-2499g, normal newborn or neonate w other problem",15,Newborns and Other Neonates with Conditions Originating in the Perinatal Period,1,Minor,Minor,Medical,Private Health Insurance,,,02300,N,N,36810.31,9638.37
Hudson Valley,Orange,3523000,000699,Orange Regional Medical Center,0 to 17,127,F,White,Not Span/Hispanic,3,Newborn,Home or Self Care,2017,218,Liveborn,000,NO PROC,626,"Neonate bwt 2000-2499g, normal newborn or neonate w other problem",15,Newborns and Other Neonates with Conditions Originating in the Perinatal Period,2,Moderate,Minor,Medical,Medicaid,,,02000,N,N,13987.82,3258.74
Hudson Valley,Orange,3523000,000699,Orange Regional Medical Center,0 to 17,109,M,Other Race,Spanish/Hispanic,8,Newborn,Home or Self Care,2017,218,Liveborn,115,CIRCUMCISION,626,"Neonate bwt 2000-2499g, normal newborn or neonate w other problem",15,Newborns and Other Neonates with Conditions Originating in the Perinatal Period,2,Moderate,Minor,Medical,Blue Cross/Blue Shield,,,02400,N,N,39500.15,10223.97
Hudson Valley,Orange,3523000,000699,Orange Regional Medical Center,0 to 17,127,F,Other Race,Not Span/Hispanic,2,Newborn,Home or Self Care,2017,218,Liveborn,000,NO PROC,626,"Neonate bwt 2000-2499g, normal newborn or neonate w other problem",15,Newborns and Other Neonates with Conditions Originating in the Perinatal Period,3,Major,Minor,Medical,Medicaid,,,02200,N,N,8744.29,1746.14
Hudson Valley,Orange,3523000,000699,Orange Regional Medical Center,0 to 17,125,F,Black/African American,Not Span/Hispanic,4,Newborn,Home or Self Care,2017,218,Liveborn,000,NO PROC,626,"Neonate bwt 2000-2499g, normal newborn or neonate w other problem",15,Newborns and Other Neonates with Conditions Originating in the Perinatal Period,1,Minor,Minor,Medical,Private Health Insurance,,,02200,N,N,21559.96,5634.92
Hudson Valley,Orange,3523000,000699,Orange Regional Medical Center,0 to 17,127,F,White,Not Span/Hispanic,2,Newborn,Home or Self Care,2017,218,Liveborn,000,NO PROC,626,"Neonate bwt 2000-2499g, normal newborn or neonate w other problem",15,Newborns and Other Neonates with Conditions Originating in the Perinatal Period,3,Major,Minor,Medical,Medicaid,,,02200,N,N,7428.16,1111.03
New York City,Bronx,7000006,003058,Montefiore Med Center - Jack D Weiler Hosp of A Einstein College Div,0 to 17,104,F,Other Race,Not Span/Hispanic,3,Newborn,Home or Self Care,2017,218,Liveborn,216,RESP INTUB/MECH VENTIL,626,"Neonate bwt 2000-2499g, normal newborn or neonate w other problem",15,Newborns and Other Neonates with Conditions Originating in the Perinatal Period,3,Major,Minor,Medical,Private Health Insurance,,,02200,N,N,14947.27,2806.95
New York City,Bronx,7000006,003058,Montefiore Med Center - Jack D Weiler Hosp of A Einstein College Div,0 to 17,108,F,Other Race,Not Span/Hispanic,2,Newborn,Home or Self Care,2017,218,Liveborn,216,RESP INTUB/MECH VENTIL,626,"Neonate bwt 2000-2499g, normal newborn or neonate w other problem",15,Newborns and Other Neonates with Conditions Originating in the Perinatal Period,3,Major,Minor,Medical,Private Health Insurance,,,02400,N,N,10793.98,1938.27
New York City,Manhattan,7002024,001456,Mount Sinai Hospital,0 to 17,113,F,Other Race,Not Span/Hispanic,4,Newborn,Home or Self Care,2017,218,Liveborn,220,OPHTHALM-/OT-OLOGIC DX,626,"Neonate bwt 2000-2499g, normal newborn or neonate w other problem",15,Newborns and Other Neonates with Conditions Originating in the Perinatal Period,1,Minor,Minor,Medical,Medicaid,Medicaid,Self-Pay,02400,N,N,17473.20,2213.37
New York City,Manhattan,7002024,001456,Mount Sinai Hospital,0 to 17,100,F,Other Race,Not Span/Hispanic,3,Newborn,Home or Self Care,2017,218,Liveborn,220,OPHTHALM-/OT-OLOGIC DX,626,"Neonate bwt 2000-2499g, normal newborn or neonate w other problem",15,Newborns and Other Neonates with Conditions Originating in the Perinatal Period,1,Minor,Minor,Medical,Private Health Insurance,Self-Pay,,02400,N,N,13063.20,1661.81
New York City,Manhattan,7002024,001456,Mount Sinai Hospital,0 to 17,118,M,White,Not Span/Hispanic,3,Newborn,Home or Self Care,2017,218,Liveborn,220,OPHTHALM-/OT-OLOGIC DX,626,"Neonate bwt 2000-2499g, normal newborn or neonate w other problem",15,Newborns and Other Neonates with Conditions Originating in the Perinatal Period,3,Major,Minor,Medical,Blue Cross/Blue Shield,Self-Pay,,02200,N,N,13178.70,1683.05
New York City,Manhattan,7002024,001456,Mount Sinai Hospital,0 to 17,112,F,White,Not Span/Hispanic,4,Newborn,Home or Self Care,2017,218,Liveborn,220,OPHTHALM-/OT-OLOGIC DX,626,"Neonate bwt 2000-2499g, normal newborn or neonate w other problem",15,Newborns and Other Neonates with Conditions Originating in the Perinatal Period,2,Moderate,Minor,Medical,Private Health Insurance,Self-Pay,,02400,N,N,19915.00,2907.45
New York City,Manhattan,7002032,001466,Mount Sinai West,0 to 17,,F,White,Spanish/Hispanic,10,Newborn,Home w/ Home Health Services,2017,218,Liveborn,228,PROPHYLACTIC VAC/INOCUL,626,"Neonate bwt 2000-2499g, normal newborn or neonate w other problem",15,Newborns and Other Neonates with Conditions Originating in the Perinatal Period,1,Minor,Minor,Medical,Medicaid,Medicaid,Self-Pay,02100,N,N,105973.15,46733.21
New York City,Manhattan,7002032,001466,Mount Sinai West,0 to 17,OOS,F,White,Not Span/Hispanic,12,Newborn,Home w/ Home Health Services,2017,218,Liveborn,228,PROPHYLACTIC VAC/INOCUL,626,"Neonate bwt 2000-2499g, normal newborn or neonate w other problem",15,Newborns and Other Neonates with Conditions Originating in the Perinatal Period,1,Minor,Minor,Medical,Blue Cross/Blue Shield,Self-Pay,,02100,N,N,126903.90,56069.10
New York City,Manhattan,7002032,001466,Mount Sinai West,0 to 17,100,F,White,Unknown,11,Newborn,Home or Self Care,2017,218,Liveborn,217,OTHER RESP THERAPY,626,"Neonate bwt 2000-2499g, normal newborn or neonate w other problem",15,Newborns and Other Neonates with Conditions Originating in the Perinatal Period,3,Major,Minor,Medical,Private Health Insurance,Medicaid,Self-Pay,02100,N,N,121624.95,53830.15
New York City,Manhattan,7002032,001466,Mount Sinai West,0 to 17,112,M,White,Not Span/Hispanic,2,Newborn,Home or Self Care,2017,218,Liveborn,220,OPHTHALM-/OT-OLOGIC DX,626,"Neonate bwt 2000-2499g, normal newborn or neonate w other problem",15,Newborns and Other Neonates with Conditions Originating in the Perinatal Period,1,Minor,Minor,Medical,Blue Cross/Blue Shield,Self-Pay,,02200,N,N,8987.15,3714.09
New York City,Manhattan,7002032,001466,Mount Sinai West,0 to 17,113,F,Black/African American,Not Span/Hispanic,3,Newborn,Home or Self Care,2017,218,Liveborn,228,PROPHYLACTIC VAC/INOCUL,626,"Neonate bwt 2000-2499g, normal newborn or neonate w other problem",15,Newborns and Other Neonates with Conditions Originating in the Perinatal Period,2,Moderate,Minor,Medical,Blue Cross/Blue Shield,Self-Pay,,02300,N,N,12745.53,5485.20
New York City,Manhattan,7002032,001466,Mount Sinai West,0 to 17,112,M,White,Spanish/Hispanic,3,Newborn,Home or Self Care,2017,218,Liveborn,115,CIRCUMCISION,626,"Neonate bwt 2000-2499g, normal newborn or neonate w other problem",15,Newborns and Other Neonates with Conditions Originating in the Perinatal Period,1,Minor,Minor,Medical,Blue Cross/Blue Shield,Self-Pay,,02300,N,N,12553.83,5468.68
New York City,Manhattan,7002032,001466,Mount Sinai West,0 to 17,104,F,White,Not Span/Hispanic,2,Newborn,Home or Self Care,2017,218,Liveborn,228,PROPHYLACTIC VAC/INOCUL,626,"Neonate bwt 2000-2499g, normal newborn or neonate w other problem",15,Newborns and Other Neonates with Conditions Originating in the Perinatal Period,2,Moderate,Minor,Medical,Private Health Insurance,Self-Pay,,02300,N,N,8115.00,3586.07
Hudson Valley,Westchester,5904001,001072,Montefiore New Rochelle Hospital,0 to 17,104,M,White,Spanish/Hispanic,3,Newborn,Home or Self Care,2017,218,Liveborn,228,PROPHYLACTIC VAC/INOCUL,626,"Neonate bwt 2000-2499g, normal newborn or neonate w other problem",15,Newborns and Other Neonates with Conditions Originating in the Perinatal Period,1,Minor,Minor,Medical,Blue Cross/Blue Shield,Self-Pay,,02400,N,N,10092.00,8392.42
New York City,Bronx,7000006,001168,Montefiore Medical Center-Wakefield Hospital,0 to 17,104,F,Other Race,Not Span/Hispanic,11,Newborn,Home w/ Home Health Services,2017,218,Liveborn,216,RESP INTUB/MECH VENTIL,626,"Neonate bwt 2000-2499g, normal newborn or neonate w other problem",15,Newborns and Other Neonates with Conditions Originating in the Perinatal Period,3,Major,Minor,Medical,Medicaid,,,02000,N,N,163888.73,23009.93
New York City,Bronx,7000006,001168,Montefiore Medical Center-Wakefield Hospital,0 to 17,104,F,Other Race,Not Span/Hispanic,3,Newborn,Home or Self Care,2017,218,Liveborn,220,OPHTHALM-/OT-OLOGIC DX,626,"Neonate bwt 2000-2499g, normal newborn or neonate w other problem",15,Newborns and Other Neonates with Conditions Originating in the Perinatal Period,2,Moderate,Minor,Medical,Medicaid,,,02200,N,N,15038.27,2873.70
New York City,Bronx,7000006,001168,Montefiore Medical Center-Wakefield Hospital,0 to 17,104,F,Other Race,Not Span/Hispanic,3,Newborn,Home or Self Care,2017,218,Liveborn,216,RESP INTUB/MECH VENTIL,626,"Neonate bwt 2000-2499g, normal newborn or neonate w other problem",15,Newborns and Other Neonates with Conditions Originating in the Perinatal Period,3,Major,Minor,Medical,Medicaid,,,02000,N,N,24639.50,3925.48
New York City,Bronx,7000006,003058,Montefiore Med Center - Jack D Weiler Hosp of A Einstein College Div,0 to 17,104,F,Other Race,Not Span/Hispanic,3,Newborn,Home or Self Care,2017,218,Liveborn,228,PROPHYLACTIC VAC/INOCUL,626,"Neonate bwt 2000-2499g, normal newborn or neonate w other problem",15,Newborns and Other Neonates with Conditions Originating in the Perinatal Period,2,Moderate,Minor,Medical,Medicaid,,,02300,N,N,15465.98,2826.36
New York City,Bronx,7000006,003058,Montefiore Med Center - Jack D Weiler Hosp of A Einstein College Div,0 to 17,104,M,Other Race,Not Span/Hispanic,2,Newborn,Home or Self Care,2017,218,Liveborn,115,CIRCUMCISION,626,"Neonate bwt 2000-2499g, normal newborn or neonate w other problem",15,Newborns and Other Neonates with Conditions Originating in the Perinatal Period,1,Minor,Minor,Medical,Medicaid,,,02400,N,N,10469.98,1918.10
New York City,Bronx,7000006,003058,Montefiore Med Center - Jack D Weiler Hosp of A Einstein College Div,0 to 17,104,F,Other Race,Not Span/Hispanic,3,Newborn,Home or Self Care,2017,218,Liveborn,216,RESP INTUB/MECH VENTIL,626,"Neonate bwt 2000-2499g, normal newborn or neonate w other problem",15,Newborns and Other Neonates with Conditions Originating in the Perinatal Period,3,Major,Minor,Medical,Medicaid,,,02100,N,N,15002.98,2809.63
New York City,Bronx,7000006,003058,Montefiore Med Center - Jack D Weiler Hosp of A Einstein College Div,0 to 17,104,F,Other Race,Not Span/Hispanic,2,Newborn,Home or Self Care,2017,218,Liveborn,000,NO PROC,626,"Neonate bwt 2000-2499g, normal newborn or neonate w other problem",15,Newborns and Other Neonates with Conditions Originating in the Perinatal Period,2,Moderate,Minor,Medical,Medicaid,,,02400,N,N,10642.98,1928.87
New York City,Bronx,7000006,003058,Montefiore Med Center - Jack D Weiler Hosp of A Einstein College Div,0 to 17,104,F,Other Race,Not Span/Hispanic,2,Newborn,Home or Self Care,2017,218,Liveborn,228,PROPHYLACTIC VAC/INOCUL,626,"Neonate bwt 2000-2499g, normal newborn or neonate w other problem",15,Newborns and Other Neonates with Conditions Originating in the Perinatal Period,2,Moderate,Minor,Medical,Medicaid,,,02300,N,N,10531.98,1921.96
New York City,Bronx,7000006,003058,Montefiore Med Center - Jack D Weiler Hosp of A Einstein College Div,0 to 17,104,F,Other Race,Not Span/Hispanic,3,Newborn,Home or Self Care,2017,218,Liveborn,228,PROPHYLACTIC VAC/INOCUL,626,"Neonate bwt 2000-2499g, normal newborn or neonate w other problem",15,Newborns and Other Neonates with Conditions Originating in the Perinatal Period,2,Moderate,Minor,Medical,Medicaid,,,02200,N,N,16284.27,2890.15
New York City,Bronx,7000006,003058,Montefiore Med Center - Jack D Weiler Hosp of A Einstein College Div,0 to 17,104,F,Other Race,Not Span/Hispanic,3,Newborn,Home or Self Care,2017,218,Liveborn,228,PROPHYLACTIC VAC/INOCUL,626,"Neonate bwt 2000-2499g, normal newborn or neonate w other problem",15,Newborns and Other Neonates with Conditions Originating in the Perinatal Period,2,Moderate,Minor,Medical,Medicaid,,,02300,N,N,14785.08,2790.44
New York City,Kings,7001003,001288,Brooklyn Hospital Center - Downtown Campus,0 to 17,112,F,White,Unknown,7,Newborn,Home or Self Care,2017,218,Liveborn,220,OPHTHALM-/OT-OLOGIC DX,626,"Neonate bwt 2000-2499g, normal newborn or neonate w other problem",15,Newborns and Other Neonates with Conditions Originating in the Perinatal Period,3,Major,Minor,Medical,Medicaid,Self-Pay,,02100,N,N,71693.63,10419.20
New York City,Kings,7001003,001288,Brooklyn Hospital Center - Downtown Campus,0 to 17,112,M,Black/African American,Unknown,3,Newborn,Home or Self Care,2017,218,Liveborn,115,CIRCUMCISION,626,"Neonate bwt 2000-2499g, normal newborn or neonate w other problem",15,Newborns and Other Neonates with Conditions Originating in the Perinatal Period,2,Moderate,Minor,Medical,Private Health Insurance,Self-Pay,,02300,N,N,17694.93,2738.14
New York City,Kings,7001003,001288,Brooklyn Hospital Center - Downtown Campus,0 to 17,112,M,Black/African American,Unknown,2,Newborn,Home or Self Care,2017,218,Liveborn,115,CIRCUMCISION,626,"Neonate bwt 2000-2499g, normal newborn or neonate w other problem",15,Newborns and Other Neonates with Conditions Originating in the Perinatal Period,2,Moderate,Minor,Medical,Private Health Insurance,Self-Pay,,02400,N,N,12435.84,1960.30
New York City,Kings,7001003,001288,Brooklyn Hospital Center - Downtown Campus,0 to 17,112,M,Black/African American,Spanish/Hispanic,2,Newborn,Home or Self Care,2017,218,Liveborn,115,CIRCUMCISION,626,"Neonate bwt 2000-2499g, normal newborn or neonate w other problem",15,Newborns and Other Neonates with Conditions Originating in the Perinatal Period,2,Moderate,Minor,Medical,Medicaid,Medicaid,Self-Pay,02300,N,N,12674.53,1980.09
New York City,Kings,7001037,001320,University Hospital of Brooklyn,0 to 17,112,F,Black/African American,Not Span/Hispanic,2,Newborn,Home or Self Care,2017,218,Liveborn,220,OPHTHALM-/OT-OLOGIC DX,626,"Neonate bwt 2000-2499g, normal newborn or neonate w other problem",15,Newborns and Other Neonates with Conditions Originating in the Perinatal Period,2,Moderate,Minor,Medical,Private Health Insurance,Self-Pay,,02200,N,N,5546.00,4146.68
New York City,Manhattan,7002024,001456,Mount Sinai Hospital,0 to 17,100,M,White,Not Span/Hispanic,17,Newborn,Home or Self Care,2017,218,Liveborn,220,OPHTHALM-/OT-OLOGIC DX,626,"Neonate bwt 2000-2499g, normal newborn or neonate w other problem",15,Newborns and Other Neonates with Conditions Originating in the Perinatal Period,2,Moderate,Minor,Medical,Private Health Insurance,Private Health Insurance,Self-Pay,02400,N,N,180263.26,75841.73
New York City,Manhattan,7002024,001456,Mount Sinai Hospital,0 to 17,114,M,Other Race,Not Span/Hispanic,2,Newborn,Home or Self Care,2017,218,Liveborn,220,OPHTHALM-/OT-OLOGIC DX,626,"Neonate bwt 2000-2499g, normal newborn or neonate w other problem",15,Newborns and Other Neonates with Conditions Originating in the Perinatal Period,1,Minor,Minor,Medical,Blue Cross/Blue Shield,Self-Pay,,02300,N,N,9418.20,1250.26
New York City,Manhattan,7002024,001456,Mount Sinai Hospital,0 to 17,112,M,White,Not Span/Hispanic,3,Newborn,Home or Self Care,2017,218,Liveborn,216,RESP INTUB/MECH VENTIL,626,"Neonate bwt 2000-2499g, normal newborn or neonate w other problem",15,Newborns and Other Neonates with Conditions Originating in the Perinatal Period,3,Major,Minor,Medical,Blue Cross/Blue Shield,Self-Pay,,02300,N,N,33930.79,13979.58
New York City,Manhattan,7002024,001456,Mount Sinai Hospital,0 to 17,OOS,F,White,Not Span/Hispanic,4,Newborn,Home or Self Care,2017,218,Liveborn,216,RESP INTUB/MECH VENTIL,626,"Neonate bwt 2000-2499g, normal newborn or neonate w other problem",15,Newborns and Other Neonates with Conditions Originating in the Perinatal Period,3,Major,Minor,Medical,Private Health Insurance,Self-Pay,,02300,N,N,44865.52,18490.91
New York City,Manhattan,7002024,001456,Mount Sinai Hospital,0 to 17,112,M,Other Race,Not Span/Hispanic,3,Newborn,Home or Self Care,2017,218,Liveborn,220,OPHTHALM-/OT-OLOGIC DX,626,"Neonate bwt 2000-2499g, normal newborn or neonate w other problem",15,Newborns and Other Neonates with Conditions Originating in the Perinatal Period,2,Moderate,Minor,Medical,Private Health Insurance,Self-Pay,,02200,N,N,13373.20,1718.55
New York City,Manhattan,7002024,001456,Mount Sinai Hospital,0 to 17,100,F,Other Race,Not Span/Hispanic,3,Newborn,Home or Self Care,2017,218,Liveborn,032,OT NON-OR THER PRC NOSE,626,"Neonate bwt 2000-2499g, normal newborn or neonate w other problem",15,Newborns and Other Neonates with Conditions Originating in the Perinatal Period,2,Moderate,Minor,Medical,Blue Cross/Blue Shield,Self-Pay,,02400,N,N,14108.20,2106.92
New York City,Manhattan,7002024,001456,Mount Sinai Hospital,0 to 17,112,M,Other Race,Not Span/Hispanic,3,Newborn,Home or Self Care,2017,218,Liveborn,220,OPHTHALM-/OT-OLOGIC DX,626,"Neonate bwt 2000-2499g, normal newborn or neonate w other problem",15,Newborns and Other Neonates with Conditions Originating in the Perinatal Period,1,Minor,Minor,Medical,Blue Cross/Blue Shield,Self-Pay,,02400,N,N,13313.20,1707.57
New York City,Manhattan,7002024,001456,Mount Sinai Hospital,0 to 17,100,F,Other Race,Not Span/Hispanic,2,Newborn,Home or Self Care,2017,218,Liveborn,220,OPHTHALM-/OT-OLOGIC DX,626,"Neonate bwt 2000-2499g, normal newborn or neonate w other problem",15,Newborns and Other Neonates with Conditions Originating in the Perinatal Period,3,Major,Minor,Medical,Blue Cross/Blue Shield,Self-Pay,,02400,N,N,9248.13,1231.85
New York City,Manhattan,7002024,001456,Mount Sinai Hospital,0 to 17,112,F,Black/African American,Not Span/Hispanic,3,Newborn,Home or Self Care,2017,218,Liveborn,220,OPHTHALM-/OT-OLOGIC DX,626,"Neonate bwt 2000-2499g, normal newborn or neonate w other problem",15,Newborns and Other Neonates with Conditions Originating in the Perinatal Period,2,Moderate,Minor,Medical,Private Health Insurance,Self-Pay,,02000,N,N,12988.20,1648.09