Hospital Service Area,Hospital County,Operating Certificate Number,Permanent Facility Id,Facility Name,Age Group,Zip Code - 3 digits,Gender,Race,Ethnicity,Length of Stay,Type of Admission,Patient Disposition,Discharge Year,CCS Diagnosis Code,CCS Diagnosis Description,CCS Procedure Code,CCS Procedure Description,APR DRG Code,APR DRG Description,APR MDC Code,APR MDC Description,APR Severity of Illness Code,APR Severity of Illness Description,APR Risk of Mortality,APR Medical Surgical Description,Payment Typology 1,Payment Typology 2,Payment Typology 3,Birth Weight,Abortion Edit Indicator,Emergency Department Indicator,Total Charges,Total Costs
New York City,Manhattan,7002001,001438,Bellevue Hospital Center,0 to 17,112,M,Other Race,Spanish/Hispanic,113,Emergency,Short-term Hospital,2017,224,Other perinatal conditions,034,TRACHEOSTOMY; TEMP/PERM,631,Neonate birthwt >2499g w other major procedure,15,Newborns and Other Neonates with Conditions Originating in the Perinatal Period,4,Extreme,Major,Surgical,Medicaid,,,03300,N,N,442995.54,285620.49
New York City,Manhattan,7002001,001438,Bellevue Hospital Center,0 to 17,112,F,Other Race,Not Span/Hispanic,45,Emergency,Home or Self Care,2017,216,Nervous system congenital anomalies,009,OTHER OR THER NERV SYS,631,Neonate birthwt >2499g w other major procedure,15,Newborns and Other Neonates with Conditions Originating in the Perinatal Period,2,Moderate,Minor,Surgical,Self-Pay,,,02900,N,N,205097.34,132236.10
New York City,Manhattan,7002001,001438,Bellevue Hospital Center,0 to 17,103,F,Other Race,Not Span/Hispanic,63,Newborn,Home or Self Care,2017,218,Liveborn,086,OTHER HERNIA REPAIR,631,Neonate birthwt >2499g w other major procedure,15,Newborns and Other Neonates with Conditions Originating in the Perinatal Period,4,Extreme,Major,Surgical,Medicaid,Medicaid,,03000,N,N,259283.20,167172.32
New York City,Manhattan,7002001,001438,Bellevue Hospital Center,0 to 17,113,M,Other Race,Not Span/Hispanic,14,Emergency,Home or Self Care,2017,214,Digestive congenital anomalies,079,LOC EXC LRG INTEST LESN,631,Neonate birthwt >2499g w other major procedure,15,Newborns and Other Neonates with Conditions Originating in the Perinatal Period,2,Moderate,Minor,Surgical,Medicaid,Medicaid,,03000,N,N,54711.87,35275.37
New York City,Manhattan,7002001,001438,Bellevue Hospital Center,0 to 17,104,M,Other Race,Spanish/Hispanic,10,Emergency,Short-term Hospital,2017,214,Digestive congenital anomalies,072,COLOSTOMY; TEMP/PERM,631,Neonate birthwt >2499g w other major procedure,15,Newborns and Other Neonates with Conditions Originating in the Perinatal Period,3,Major,Moderate,Surgical,Self-Pay,,,03600,N,N,47395.78,30558.33
New York City,Manhattan,7002001,001438,Bellevue Hospital Center,0 to 17,113,M,Other Race,Not Span/Hispanic,94,Emergency,Skilled Nursing Home,2017,220,Intrauterine hypoxia and birth asphyxia,034,TRACHEOSTOMY; TEMP/PERM,631,Neonate birthwt >2499g w other major procedure,15,Newborns and Other Neonates with Conditions Originating in the Perinatal Period,4,Extreme,Major,Surgical,Medicaid,,,04200,N,N,462451.83,298164.89
New York City,Manhattan,7002001,001438,Bellevue Hospital Center,0 to 17,112,M,Other Race,Not Span/Hispanic,20,Emergency,Home w/ Home Health Services,2017,214,Digestive congenital anomalies,072,COLOSTOMY; TEMP/PERM,631,Neonate birthwt >2499g w other major procedure,15,Newborns and Other Neonates with Conditions Originating in the Perinatal Period,3,Major,Moderate,Surgical,Medicaid,Medicaid,,02700,N,N,83785.16,54020.31
New York City,Manhattan,7002001,001438,Bellevue Hospital Center,0 to 17,112,F,Other Race,Not Span/Hispanic,12,Emergency,Home w/ Home Health Services,2017,214,Digestive congenital anomalies,080,APPENDECTOMY,631,Neonate birthwt >2499g w other major procedure,15,Newborns and Other Neonates with Conditions Originating in the Perinatal Period,2,Moderate,Minor,Surgical,Medicaid,Medicaid,,03100,N,N,76836.84,49540.40
New York City,Manhattan,7002001,001438,Bellevue Hospital Center,0 to 17,104,M,Other Race,Spanish/Hispanic,7,Emergency,Home or Self Care,2017,224,Other perinatal conditions,010,THYROIDECTOMY;PART/FULL,631,Neonate birthwt >2499g w other major procedure,15,Newborns and Other Neonates with Conditions Originating in the Perinatal Period,2,Moderate,Minor,Surgical,Medicaid,Medicaid,Medicaid,03500,N,Y,45378.17,29257.48
New York City,Manhattan,7002001,001438,Bellevue Hospital Center,0 to 17,100,M,Black/African American,Not Span/Hispanic,7,Newborn,Home or Self Care,2017,218,Liveborn,002,IRR XCRANIAL VENT SHUNT,631,Neonate birthwt >2499g w other major procedure,15,Newborns and Other Neonates with Conditions Originating in the Perinatal Period,3,Major,Major,Surgical,Medicaid,Medicaid,,03300,N,N,29588.50,19077.13
