Hospital Service Area,Hospital County,Operating Certificate Number,Permanent Facility Id,Facility Name,Age Group,Zip Code - 3 digits,Gender,Race,Ethnicity,Length of Stay,Type of Admission,Patient Disposition,Discharge Year,CCS Diagnosis Code,CCS Diagnosis Description,CCS Procedure Code,CCS Procedure Description,APR DRG Code,APR DRG Description,APR MDC Code,APR MDC Description,APR Severity of Illness Code,APR Severity of Illness Description,APR Risk of Mortality,APR Medical Surgical Description,Payment Typology 1,Payment Typology 2,Payment Typology 3,Birth Weight,Abortion Edit Indicator,Emergency Department Indicator,Total Charges,Total Costs
Long Island,Nassau,2908000,000511,NYU Winthrop Hospital,0 to 17,114,M,Black/African American,Not Span/Hispanic,3,Newborn,Home or Self Care,2017,218,Liveborn,033,OTHER OR THER PRCS NOSE,631,Neonate birthwt >2499g w other major procedure,15,Newborns and Other Neonates with Conditions Originating in the Perinatal Period,2,Moderate,Minor,Surgical,Blue Cross/Blue Shield,,,03500,N,N,10598.07,2017.95
Long Island,Nassau,2908000,000511,NYU Winthrop Hospital,0 to 17,115,F,Black/African American,Spanish/Hispanic,15,Urgent,Home or Self Care,2017,214,Digestive congenital anomalies,096,OT OR LOW GI THER PRCS,631,Neonate birthwt >2499g w other major procedure,15,Newborns and Other Neonates with Conditions Originating in the Perinatal Period,3,Major,Minor,Surgical,Medicaid,Medicaid,,03300,N,N,123677.68,26347.62
Long Island,Nassau,2908000,000511,NYU Winthrop Hospital,0 to 17,117,M,Other Race,Spanish/Hispanic,4,Newborn,Home or Self Care,2017,218,Liveborn,033,OTHER OR THER PRCS NOSE,631,Neonate birthwt >2499g w other major procedure,15,Newborns and Other Neonates with Conditions Originating in the Perinatal Period,1,Minor,Minor,Surgical,Medicaid,Medicaid,,04100,N,N,19619.26,3670.04
Long Island,Nassau,2908000,000511,NYU Winthrop Hospital,0 to 17,115,F,Other Race,Not Span/Hispanic,64,Newborn,Home w/ Home Health Services,2017,218,Liveborn,094,OT OR UP GI THER PRCS,631,Neonate birthwt >2499g w other major procedure,15,Newborns and Other Neonates with Conditions Originating in the Perinatal Period,4,Extreme,Extreme,Surgical,Blue Cross/Blue Shield,Medicaid,,03300,N,N,594607.68,115700.19
Long Island,Nassau,2908000,000511,NYU Winthrop Hospital,0 to 17,114,M,Black/African American,Not Span/Hispanic,4,Newborn,Home or Self Care,2017,218,Liveborn,033,OTHER OR THER PRCS NOSE,631,Neonate birthwt >2499g w other major procedure,15,Newborns and Other Neonates with Conditions Originating in the Perinatal Period,3,Major,Minor,Surgical,Blue Cross/Blue Shield,,,03700,N,N,12271.07,2531.20
Long Island,Nassau,2908000,000511,NYU Winthrop Hospital,0 to 17,115,M,White,Not Span/Hispanic,3,Newborn,Home or Self Care,2017,218,Liveborn,033,OTHER OR THER PRCS NOSE,631,Neonate birthwt >2499g w other major procedure,15,Newborns and Other Neonates with Conditions Originating in the Perinatal Period,2,Moderate,Minor,Surgical,Blue Cross/Blue Shield,,,03400,N,N,9466.07,1933.33
Long Island,Nassau,2908000,000511,NYU Winthrop Hospital,0 to 17,115,F,Black/African American,Not Span/Hispanic,19,Newborn,Home w/ Home Health Services,2017,218,Liveborn,094,OT OR UP GI THER PRCS,631,Neonate birthwt >2499g w other major procedure,15,Newborns and Other Neonates with Conditions Originating in the Perinatal Period,3,Major,Minor,Surgical,Blue Cross/Blue Shield,,,03700,N,N,304200.63,69077.43
Long Island,Nassau,2908000,000511,NYU Winthrop Hospital,0 to 17,118,F,White,Spanish/Hispanic,2,Newborn,Home or Self Care,2017,218,Liveborn,033,OTHER OR THER PRCS NOSE,631,Neonate birthwt >2499g w other major procedure,15,Newborns and Other Neonates with Conditions Originating in the Perinatal Period,1,Minor,Minor,Surgical,Private Health Insurance,,,02700,N,N,14956.86,3188.76
Long Island,Nassau,2908000,000511,NYU Winthrop Hospital,0 to 17,117,M,Other Race,Spanish/Hispanic,3,Newborn,Home or Self Care,2017,218,Liveborn,033,OTHER OR THER PRCS NOSE,631,Neonate birthwt >2499g w other major procedure,15,Newborns and Other Neonates with Conditions Originating in the Perinatal Period,2,Moderate,Minor,Surgical,Private Health Insurance,Medicaid,,02700,N,N,26186.66,5131.61
Long Island,Nassau,2908000,000511,NYU Winthrop Hospital,0 to 17,115,F,Other Race,Spanish/Hispanic,11,Urgent,Home w/ Home Health Services,2017,214,Digestive congenital anomalies,096,OT OR LOW GI THER PRCS,631,Neonate birthwt >2499g w other major procedure,15,Newborns and Other Neonates with Conditions Originating in the Perinatal Period,3,Major,Minor,Surgical,Medicaid,Medicaid,,03700,N,N,148600.66,35523.10
Long Island,Nassau,2908000,000511,NYU Winthrop Hospital,0 to 17,117,M,Black/African American,Spanish/Hispanic,13,Newborn,Home w/ Home Health Services,2017,218,Liveborn,002,IRR XCRANIAL VENT SHUNT,631,Neonate birthwt >2499g w other major procedure,15,Newborns and Other Neonates with Conditions Originating in the Perinatal Period,2,Moderate,Moderate,Surgical,Medicaid,Medicaid,,03300,N,N,286012.47,56186.30
Long Island,Nassau,2908000,000511,NYU Winthrop Hospital,0 to 17,110,F,Other Race,Not Span/Hispanic,63,Newborn,Home w/ Home Health Services,2017,218,Liveborn,073,ILEO- & OT ENTER-OSTOMY,631,Neonate birthwt >2499g w other major procedure,15,Newborns and Other Neonates with Conditions Originating in the Perinatal Period,3,Major,Major,Surgical,Medicaid,Medicaid,,02900,N,N,821670.36,181143.29
