Hospital Service Area,Hospital County,Operating Certificate Number,Permanent Facility Id,Facility Name,Age Group,Zip Code - 3 digits,Gender,Race,Ethnicity,Length of Stay,Type of Admission,Patient Disposition,Discharge Year,CCS Diagnosis Code,CCS Diagnosis Description,CCS Procedure Code,CCS Procedure Description,APR DRG Code,APR DRG Description,APR MDC Code,APR MDC Description,APR Severity of Illness Code,APR Severity of Illness Description,APR Risk of Mortality,APR Medical Surgical Description,Payment Typology 1,Payment Typology 2,Payment Typology 3,Birth Weight,Abortion Edit Indicator,Emergency Department Indicator,Total Charges,Total Costs
New York City,Kings,7001020,001305,Maimonides Medical Center,0 to 17,112,M,White,Not Span/Hispanic,14,Newborn,Home or Self Care,2018,PNL001,LIVEBORN,GIS011,SMALL BOWEL RESECTION,631,NEONATE BIRTHWT >2499G W OTHER MAJOR PROCEDURE,15,NEWBORNS AND OTHER NEONATES WITH CONDITIONS ORIGINATING IN THE PERINATAL PERIOD,2,Moderate,Minor,Surgical,Medicaid,Medicaid,Self-Pay,03100,,false,181307.05,30388.16
New York City,Manhattan,7002054,001464,New York-Presbyterian Hospital - Columbia Presbyterian Center,0 to 17,104,F,Multi-racial,Multi-ethnic,14,Newborn,Home or Self Care,2018,PNL001,LIVEBORN,GIS009,COLECTOMY,631,NEONATE BIRTHWT >2499G W OTHER MAJOR PROCEDURE,15,NEWBORNS AND OTHER NEONATES WITH CONDITIONS ORIGINATING IN THE PERINATAL PERIOD,3,Major,Minor,Surgical,Medicaid,Medicaid,Self-Pay,02500,,false,321713.3,69190.01
Central NY,Onondaga,3301008,000636,Crouse Hospital,0 to 17,134,F,Black/African American,Not Span/Hispanic,20,Urgent,Home w/ Home Health Services,2018,MAL008,MUSCULOSKELETAL CONGENITAL CONDITIONS,RES011,DIAPHRAGMATIC HERNIA REPAIR,631,NEONATE BIRTHWT >2499G W OTHER MAJOR PROCEDURE,15,NEWBORNS AND OTHER NEONATES WITH CONDITIONS ORIGINATING IN THE PERINATAL PERIOD,4,Extreme,Extreme,Surgical,Medicaid,,,02800,,false,74410.66,35455.62
New York City,Manhattan,7002024,001456,Mount Sinai Hospital,0 to 17,111,F,Other Race,Unknown,120 +,Urgent,Inpatient Rehabilitation Facility,2018,NEO073,BENIGN NEOPLASMS,ESA003,MECHANICAL VENTILATION,631,NEONATE BIRTHWT >2499G W OTHER MAJOR PROCEDURE,15,NEWBORNS AND OTHER NEONATES WITH CONDITIONS ORIGINATING IN THE PERINATAL PERIOD,4,Extreme,Major,Surgical,Medicaid,Medicaid,Self-Pay,02700,,false,2395419.85,472328.59
New York City,Queens,7003004,003376,Cohen Children's Medical Center,0 to 17,117,M,White,Not Span/Hispanic,4,Urgent,Home or Self Care,2018,MAL002,DIGESTIVE CONGENITAL ANOMALIES,GIS028,"LOWER GI THERAPEUTIC PROCEDURES, NEC (OPEN AND LAPAROSCOPIC)",631,NEONATE BIRTHWT >2499G W OTHER MAJOR PROCEDURE,15,NEWBORNS AND OTHER NEONATES WITH CONDITIONS ORIGINATING IN THE PERINATAL PERIOD,2,Moderate,Minor,Surgical,Private Health Insurance,Self-Pay,,03400,,false,81404.62,16520.45
New York City,Kings,7001020,001305,Maimonides Medical Center,0 to 17,112,M,Other Race,Unknown,19,Newborn,Home or Self Care,2018,PNL001,LIVEBORN,ENT004,DIAGNOSTIC AUDIOLOGY,631,NEONATE BIRTHWT >2499G W OTHER MAJOR PROCEDURE,15,NEWBORNS AND OTHER NEONATES WITH CONDITIONS ORIGINATING IN THE PERINATAL PERIOD,3,Major,Major,Surgical,Medicaid,Medicaid,Self-Pay,04500,,false,284990,53263.07
Western NY,Erie,1401014,000208,John R. Oishei Children's Hospital,0 to 17,140,F,White,Not Span/Hispanic,35,Elective,Home w/ Home Health Services,2018,PNL001,LIVEBORN,CNS010,CEREBROSPINAL FLUID SHUNT PROCEDURES,631,NEONATE BIRTHWT >2499G W OTHER MAJOR PROCEDURE,15,NEWBORNS AND OTHER NEONATES WITH CONDITIONS ORIGINATING IN THE PERINATAL PERIOD,3,Major,Moderate,Surgical,Medicaid,Self-Pay,,03400,,false,217848.49,85174.69
New York City,Kings,7001021,001306,New York - Presbyterian Brooklyn Methodist Hospital,0 to 17,116,F,Black/African American,Not Span/Hispanic,3,Newborn,Home or Self Care,2018,PNL001,LIVEBORN,SKB007,SKIN GRAFT,631,NEONATE BIRTHWT >2499G W OTHER MAJOR PROCEDURE,15,NEWBORNS AND OTHER NEONATES WITH CONDITIONS ORIGINATING IN THE PERINATAL PERIOD,1,Minor,Minor,Surgical,Medicaid,Self-Pay,,03000,,false,12004.46,1369.54
New York City,Kings,7001020,001305,Maimonides Medical Center,0 to 17,112,M,White,Not Span/Hispanic,22,Newborn,Home or Self Care,2018,PNL001,LIVEBORN,GIS018,ILEOSTOMY AND COLOSTOMY,631,NEONATE BIRTHWT >2499G W OTHER MAJOR PROCEDURE,15,NEWBORNS AND OTHER NEONATES WITH CONDITIONS ORIGINATING IN THE PERINATAL PERIOD,3,Major,Minor,Surgical,Medicaid,Medicaid,Self-Pay,02500,,false,276784.08,44338.41
New York City,Kings,7001003,001288,Brooklyn Hospital Center - Downtown Campus,0 to 17,100,F,Other Race,Unknown,15,Newborn,Home or Self Care,2018,PNL001,LIVEBORN,GIS026,"UPPER GI THERAPEUTIC PROCEDURES, NEC (OPEN AND LAPAROSCOPIC)",631,NEONATE BIRTHWT >2499G W OTHER MAJOR PROCEDURE,15,NEWBORNS AND OTHER NEONATES WITH CONDITIONS ORIGINATING IN THE PERINATAL PERIOD,3,Major,Minor,Surgical,Private Health Insurance,Medicaid,Self-Pay,03100,,false,199291.65,28866.56
Western NY,Erie,1401014,000208,John R. Oishei Children's Hospital,0 to 17,147,M,White,Not Span/Hispanic,43,Urgent,Home w/ Home Health Services,2018,MAL002,DIGESTIVE CONGENITAL ANOMALIES,CNS011,MENINGES REPAIR,631,NEONATE BIRTHWT >2499G W OTHER MAJOR PROCEDURE,15,NEWBORNS AND OTHER NEONATES WITH CONDITIONS ORIGINATING IN THE PERINATAL PERIOD,4,Extreme,Major,Surgical,Medicaid,Self-Pay,,02800,,false,462885.55,122705.11
New York City,Kings,7001021,001306,New York - Presbyterian Brooklyn Methodist Hospital,0 to 17,112,F,Black/African American,Not Span/Hispanic,25,Newborn,Home or Self Care,2018,PNL001,LIVEBORN,GIS026,"UPPER GI THERAPEUTIC PROCEDURES, NEC (OPEN AND LAPAROSCOPIC)",631,NEONATE BIRTHWT >2499G W OTHER MAJOR PROCEDURE,15,NEWBORNS AND OTHER NEONATES WITH CONDITIONS ORIGINATING IN THE PERINATAL PERIOD,3,Major,Minor,Surgical,"Managed Care, Unspecified",Medicaid,Self-Pay,02900,,false,305921.35,74689.15
Central NY,Onondaga,3301008,000636,Crouse Hospital,0 to 17,130,M,Other Race,Not Span/Hispanic,20,Urgent,Home w/ Home Health Services,2018,PNL012,NEONATAL DIGESTIVE AND FEEDING DISORDERS,GIS018,ILEOSTOMY AND COLOSTOMY,631,NEONATE BIRTHWT >2499G W OTHER MAJOR PROCEDURE,15,NEWBORNS AND OTHER NEONATES WITH CONDITIONS ORIGINATING IN THE PERINATAL PERIOD,3,Major,Moderate,Surgical,Medicaid,,,02500,,false,71351.5,34552.99
Central NY,Onondaga,3301008,000636,Crouse Hospital,0 to 17,130,F,White,Not Span/Hispanic,19,Newborn,Home or Self Care,2018,PNL001,LIVEBORN,CNS010,CEREBROSPINAL FLUID SHUNT PROCEDURES,631,NEONATE BIRTHWT >2499G W OTHER MAJOR PROCEDURE,15,NEWBORNS AND OTHER NEONATES WITH CONDITIONS ORIGINATING IN THE PERINATAL PERIOD,4,Extreme,Extreme,Surgical,Medicaid,,,02600,,false,66788.5,31868.22
Western NY,Erie,1401014,000208,John R. Oishei Children's Hospital,0 to 17,142,F,Black/African American,Not Span/Hispanic,13,Newborn,Home w/ Home Health Services,2018,PNL001,LIVEBORN,GIS014,ESOPHAGECTOMY,631,NEONATE BIRTHWT >2499G W OTHER MAJOR PROCEDURE,15,NEWBORNS AND OTHER NEONATES WITH CONDITIONS ORIGINATING IN THE PERINATAL PERIOD,4,Extreme,Major,Surgical,Blue Cross/Blue Shield,Self-Pay,,02600,,false,144674.58,40520.98
New York City,Manhattan,7002054,001458,New York-Presbyterian Hospital - New York Weill Cornell Center,0 to 17,113,F,Other Race,Spanish/Hispanic,48,Newborn,Home or Self Care,2018,PNL001,LIVEBORN,RES011,DIAPHRAGMATIC HERNIA REPAIR,631,NEONATE BIRTHWT >2499G W OTHER MAJOR PROCEDURE,15,NEWBORNS AND OTHER NEONATES WITH CONDITIONS ORIGINATING IN THE PERINATAL PERIOD,4,Extreme,Major,Surgical,"Managed Care, Unspecified",Medicaid,Self-Pay,02700,,false,1102124.6,243395.03
New York City,Manhattan,7002054,001458,New York-Presbyterian Hospital - New York Weill Cornell Center,0 to 17,113,M,Other Race,Spanish/Hispanic,7,Emergency,Home or Self Care,2018,MAL002,DIGESTIVE CONGENITAL ANOMALIES,GIS020,ANORECTAL REPAIR (3RD AND 4TH DEGREE OBSTETRICAL REPAIRS AND OTHER),631,NEONATE BIRTHWT >2499G W OTHER MAJOR PROCEDURE,15,NEWBORNS AND OTHER NEONATES WITH CONDITIONS ORIGINATING IN THE PERINATAL PERIOD,2,Moderate,Minor,Surgical,"Managed Care, Unspecified",Medicaid,Self-Pay,03500,,false,158088.51,62383.81
New York City,Manhattan,7002024,001456,Mount Sinai Hospital,0 to 17,100,F,Other Race,Spanish/Hispanic,15,Newborn,Home or Self Care,2018,PNL001,LIVEBORN,ENT004,DIAGNOSTIC AUDIOLOGY,631,NEONATE BIRTHWT >2499G W OTHER MAJOR PROCEDURE,15,NEWBORNS AND OTHER NEONATES WITH CONDITIONS ORIGINATING IN THE PERINATAL PERIOD,3,Major,Major,Surgical,Medicaid,Self-Pay,,04200,,false,236103.15,43328.03
Long Island,Nassau,2908000,000511,NYU Langone Hospital-Long Island,0 to 17,116,F,White,Not Span/Hispanic,31,Newborn,Home w/ Home Health Services,2018,PNL001,LIVEBORN,ADM017,ADMINISTRATION OF NUTRITIONAL AND ELECTROLYTIC SUBSTANCES,631,NEONATE BIRTHWT >2499G W OTHER MAJOR PROCEDURE,15,NEWBORNS AND OTHER NEONATES WITH CONDITIONS ORIGINATING IN THE PERINATAL PERIOD,3,Major,Major,Surgical,Medicaid,Medicaid,,03600,,false,563574.93,88204.54
New York City,Kings,7001021,001306,New York - Presbyterian Brooklyn Methodist Hospital,0 to 17,112,M,Black/African American,Not Span/Hispanic,3,Newborn,Home or Self Care,2018,PNL001,LIVEBORN,MRS001,CIRCUMCISION,631,NEONATE BIRTHWT >2499G W OTHER MAJOR PROCEDURE,15,NEWBORNS AND OTHER NEONATES WITH CONDITIONS ORIGINATING IN THE PERINATAL PERIOD,1,Minor,Minor,Surgical,"Managed Care, Unspecified",Medicaid,Self-Pay,03400,,false,11946.73,1335.04
New York City,Queens,7003004,003376,Cohen Children's Medical Center,0 to 17,117,F,Other Race,Spanish/Hispanic,48,Newborn,Home w/ Home Health Services,2018,PNL001,LIVEBORN,GIS008,APPENDECTOMY,631,NEONATE BIRTHWT >2499G W OTHER MAJOR PROCEDURE,15,NEWBORNS AND OTHER NEONATES WITH CONDITIONS ORIGINATING IN THE PERINATAL PERIOD,3,Major,Minor,Surgical,Private Health Insurance,Self-Pay,,03100,,false,769233.23,148417.7
Western NY,Erie,1401014,000208,John R. Oishei Children's Hospital,0 to 17,140,F,Other Race,Not Span/Hispanic,11,Newborn,Home w/ Home Health Services,2018,PNL001,LIVEBORN,GIS026,"UPPER GI THERAPEUTIC PROCEDURES, NEC (OPEN AND LAPAROSCOPIC)",631,NEONATE BIRTHWT >2499G W OTHER MAJOR PROCEDURE,15,NEWBORNS AND OTHER NEONATES WITH CONDITIONS ORIGINATING IN THE PERINATAL PERIOD,3,Major,Minor,Surgical,Private Health Insurance,Self-Pay,,02700,,false,131245.46,35034.84
New York City,Queens,7003004,003376,Cohen Children's Medical Center,0 to 17,103,M,White,Not Span/Hispanic,13,Urgent,Home or Self Care,2018,MAL002,DIGESTIVE CONGENITAL ANOMALIES,GIS013,PROCTECTOMY OR ANAL RESECTION,631,NEONATE BIRTHWT >2499G W OTHER MAJOR PROCEDURE,15,NEWBORNS AND OTHER NEONATES WITH CONDITIONS ORIGINATING IN THE PERINATAL PERIOD,2,Moderate,Minor,Surgical,Blue Cross/Blue Shield,Self-Pay,,03900,,false,229279.05,45288.21
New York City,Manhattan,7002054,001458,New York-Presbyterian Hospital - New York Weill Cornell Center,0 to 17,112,M,White,Not Span/Hispanic,120 +,Newborn,Cancer Center or Children's Hospital,2018,PNL001,LIVEBORN,RES010,TRACHEOSTOMY,631,NEONATE BIRTHWT >2499G W OTHER MAJOR PROCEDURE,15,NEWBORNS AND OTHER NEONATES WITH CONDITIONS ORIGINATING IN THE PERINATAL PERIOD,4,Extreme,Major,Surgical,Blue Cross/Blue Shield,Self-Pay,,02500,,false,2863882.63,628733.65
Capital/Adirond,Albany,0101000,000001,Albany Medical Center Hospital,0 to 17,120,F,White,Not Span/Hispanic,31,Newborn,Home or Self Care,2018,PNL001,LIVEBORN,GIS021,GI SYSTEM REPAIR (EXCLUDING ANORECTAL),631,NEONATE BIRTHWT >2499G W OTHER MAJOR PROCEDURE,15,NEWBORNS AND OTHER NEONATES WITH CONDITIONS ORIGINATING IN THE PERINATAL PERIOD,3,Major,Minor,Surgical,Blue Cross/Blue Shield,,,03300,,false,268121.49,76288.12
New York City,Manhattan,7002054,001458,New York-Presbyterian Hospital - New York Weill Cornell Center,0 to 17,OOS,M,Multi-racial,Not Span/Hispanic,11,Newborn,Home or Self Care,2018,PNL001,LIVEBORN,URN009,CYSTECTOMY (INCLUDING FULGURATION) AND URETHRECTOMY,631,NEONATE BIRTHWT >2499G W OTHER MAJOR PROCEDURE,15,NEWBORNS AND OTHER NEONATES WITH CONDITIONS ORIGINATING IN THE PERINATAL PERIOD,2,Moderate,Major,Surgical,Private Health Insurance,Self-Pay,,03800,,false,257603.95,57234.42
New York City,Manhattan,7002054,001464,New York-Presbyterian Hospital - Columbia Presbyterian Center,0 to 17,,M,Multi-racial,Not Span/Hispanic,7,Urgent,Home or Self Care,2018,MAL002,DIGESTIVE CONGENITAL ANOMALIES,GIS028,"LOWER GI THERAPEUTIC PROCEDURES, NEC (OPEN AND LAPAROSCOPIC)",631,NEONATE BIRTHWT >2499G W OTHER MAJOR PROCEDURE,15,NEWBORNS AND OTHER NEONATES WITH CONDITIONS ORIGINATING IN THE PERINATAL PERIOD,2,Moderate,Minor,Surgical,Private Health Insurance,Self-Pay,,03000,,false,156612.83,33753.32
New York City,Manhattan,7002054,001458,New York-Presbyterian Hospital - New York Weill Cornell Center,0 to 17,100,M,Other Race,Not Span/Hispanic,17,Emergency,Home or Self Care,2018,PNL011,HEMORRHAGIC AND HEMATOLOGIC DISORDERS OF NEWBORN,CNS005,VENTRICULOSTOMY [PERCUTANEOUS APPROACH],631,NEONATE BIRTHWT >2499G W OTHER MAJOR PROCEDURE,15,NEWBORNS AND OTHER NEONATES WITH CONDITIONS ORIGINATING IN THE PERINATAL PERIOD,4,Extreme,Major,Surgical,Private Health Insurance,Self-Pay,,02900,,true,413128.06,172583.31
Central NY,Onondaga,3301008,000636,Crouse Hospital,0 to 17,131,M,Other Race,Not Span/Hispanic,60,Newborn,Home w/ Home Health Services,2018,PNL001,LIVEBORN,ADM021,"ADMINISTRATION OF THERAPEUTIC SUBSTANCES, NEC",631,NEONATE BIRTHWT >2499G W OTHER MAJOR PROCEDURE,15,NEWBORNS AND OTHER NEONATES WITH CONDITIONS ORIGINATING IN THE PERINATAL PERIOD,3,Major,Major,Surgical,Medicaid,,,03300,,false,196316.23,94469.76
New York City,Kings,7001021,001306,New York - Presbyterian Brooklyn Methodist Hospital,0 to 17,112,F,White,Not Span/Hispanic,82,Newborn,Home or Self Care,2018,PNL001,LIVEBORN,GIS022,GI SYSTEM LYSIS OF ADHESIONS,631,NEONATE BIRTHWT >2499G W OTHER MAJOR PROCEDURE,15,NEWBORNS AND OTHER NEONATES WITH CONDITIONS ORIGINATING IN THE PERINATAL PERIOD,4,Extreme,Major,Surgical,Medicaid,Self-Pay,,03500,,false,855103.02,202137.94
New York City,Manhattan,7002054,001464,New York-Presbyterian Hospital - Columbia Presbyterian Center,0 to 17,104,F,White,Spanish/Hispanic,42,Newborn,Home w/ Home Health Services,2018,PNL001,LIVEBORN,ADM017,ADMINISTRATION OF NUTRITIONAL AND ELECTROLYTIC SUBSTANCES,631,NEONATE BIRTHWT >2499G W OTHER MAJOR PROCEDURE,15,NEWBORNS AND OTHER NEONATES WITH CONDITIONS ORIGINATING IN THE PERINATAL PERIOD,3,Major,Major,Surgical,Medicaid,Medicaid,Self-Pay,02800,,false,927610.52,195247.73
New York City,Manhattan,7002054,001464,New York-Presbyterian Hospital - Columbia Presbyterian Center,0 to 17,OOS,M,White,Spanish/Hispanic,22,Newborn,Home or Self Care,2018,PNL001,LIVEBORN,RES011,DIAPHRAGMATIC HERNIA REPAIR,631,NEONATE BIRTHWT >2499G W OTHER MAJOR PROCEDURE,15,NEWBORNS AND OTHER NEONATES WITH CONDITIONS ORIGINATING IN THE PERINATAL PERIOD,4,Extreme,Extreme,Surgical,Private Health Insurance,Self-Pay,,03000,,false,478703.85,100833.7
Western NY,Erie,1401014,000208,John R. Oishei Children's Hospital,0 to 17,142,M,White,Spanish/Hispanic,37,Newborn,Home w/ Home Health Services,2018,PNL001,LIVEBORN,GIS018,ILEOSTOMY AND COLOSTOMY,631,NEONATE BIRTHWT >2499G W OTHER MAJOR PROCEDURE,15,NEWBORNS AND OTHER NEONATES WITH CONDITIONS ORIGINATING IN THE PERINATAL PERIOD,4,Extreme,Moderate,Surgical,Medicaid,Self-Pay,,02500,,false,337743.85,85717.87
New York City,Manhattan,7002054,001464,New York-Presbyterian Hospital - Columbia Presbyterian Center,0 to 17,100,F,Multi-racial,Multi-ethnic,7,Newborn,Home w/ Home Health Services,2018,PNL001,LIVEBORN,CNS007,CNS EXCISION PROCEDURES,631,NEONATE BIRTHWT >2499G W OTHER MAJOR PROCEDURE,15,NEWBORNS AND OTHER NEONATES WITH CONDITIONS ORIGINATING IN THE PERINATAL PERIOD,2,Moderate,Minor,Surgical,Private Health Insurance,Self-Pay,,03200,,false,105244.48,18982.08
New York City,Manhattan,7002053,001463,NYU Langone Hospitals,0 to 17,112,F,Other Race,Unknown,2,Newborn,Home or Self Care,2018,PNL001,LIVEBORN,GNR002,ABDOMINAL WALL REPAIR (INCLUDING HERNIA),631,NEONATE BIRTHWT >2499G W OTHER MAJOR PROCEDURE,15,NEWBORNS AND OTHER NEONATES WITH CONDITIONS ORIGINATING IN THE PERINATAL PERIOD,1,Minor,Minor,Surgical,Medicaid,,,02700,,false,29992.64,10832.89
Long Island,Nassau,2908000,000511,NYU Langone Hospital-Long Island,0 to 17,115,F,White,Not Span/Hispanic,36,Newborn,Home w/ Home Health Services,2018,PNL001,LIVEBORN,GIS018,ILEOSTOMY AND COLOSTOMY,631,NEONATE BIRTHWT >2499G W OTHER MAJOR PROCEDURE,15,NEWBORNS AND OTHER NEONATES WITH CONDITIONS ORIGINATING IN THE PERINATAL PERIOD,4,Extreme,Extreme,Surgical,Blue Cross/Blue Shield,,,02800,,false,510901.57,96229.19
New York City,Manhattan,7002054,001464,New York-Presbyterian Hospital - Columbia Presbyterian Center,0 to 17,105,M,White,Not Span/Hispanic,51,Elective,Home or Self Care,2018,MAL002,DIGESTIVE CONGENITAL ANOMALIES,GIS011,SMALL BOWEL RESECTION,631,NEONATE BIRTHWT >2499G W OTHER MAJOR PROCEDURE,15,NEWBORNS AND OTHER NEONATES WITH CONDITIONS ORIGINATING IN THE PERINATAL PERIOD,4,Extreme,Major,Surgical,Private Health Insurance,Self-Pay,,03400,,false,1131817.11,238157.79
New York City,Bronx,7000006,001169,Montefiore Medical Center - Henry & Lucy Moses Div,0 to 17,109,F,Other Race,Unknown,10,Emergency,Home or Self Care,2018,MAL002,DIGESTIVE CONGENITAL ANOMALIES,GIS028,"LOWER GI THERAPEUTIC PROCEDURES, NEC (OPEN AND LAPAROSCOPIC)",631,NEONATE BIRTHWT >2499G W OTHER MAJOR PROCEDURE,15,NEWBORNS AND OTHER NEONATES WITH CONDITIONS ORIGINATING IN THE PERINATAL PERIOD,2,Moderate,Minor,Surgical,Medicaid,,,03400,,false,122090.76,33290.19
New York City,Manhattan,7002054,001464,New York-Presbyterian Hospital - Columbia Presbyterian Center,0 to 17,104,F,Multi-racial,Multi-ethnic,23,Newborn,Home or Self Care,2018,PNL001,LIVEBORN,CNS011,MENINGES REPAIR,631,NEONATE BIRTHWT >2499G W OTHER MAJOR PROCEDURE,15,NEWBORNS AND OTHER NEONATES WITH CONDITIONS ORIGINATING IN THE PERINATAL PERIOD,2,Moderate,Minor,Surgical,Medicaid,Medicaid,Self-Pay,02700,,false,474959.85,98005.57
New York City,Kings,7001020,001305,Maimonides Medical Center,0 to 17,112,F,White,Not Span/Hispanic,21,Newborn,Home or Self Care,2018,PNL001,LIVEBORN,GIS026,"UPPER GI THERAPEUTIC PROCEDURES, NEC (OPEN AND LAPAROSCOPIC)",631,NEONATE BIRTHWT >2499G W OTHER MAJOR PROCEDURE,15,NEWBORNS AND OTHER NEONATES WITH CONDITIONS ORIGINATING IN THE PERINATAL PERIOD,2,Moderate,Minor,Surgical,Blue Cross/Blue Shield,Self-Pay,,02900,,false,270409.15,44762.28
New York City,Queens,7003004,003376,Cohen Children's Medical Center,0 to 17,118,F,Other Race,Not Span/Hispanic,4,Newborn,Home or Self Care,2018,MAL008,MUSCULOSKELETAL CONGENITAL CONDITIONS,MST002,BONE AND JOINT BIOPSY,631,NEONATE BIRTHWT >2499G W OTHER MAJOR PROCEDURE,15,NEWBORNS AND OTHER NEONATES WITH CONDITIONS ORIGINATING IN THE PERINATAL PERIOD,1,Minor,Minor,Surgical,Private Health Insurance,Self-Pay,,05100,,false,19210.65,3996.1
New York City,Manhattan,7002054,001464,New York-Presbyterian Hospital - Columbia Presbyterian Center,0 to 17,104,F,Multi-racial,Multi-ethnic,15,Emergency,Home or Self Care,2018,PNL004,NEONATAL CEREBRAL DISORDERS,CNS007,CNS EXCISION PROCEDURES,631,NEONATE BIRTHWT >2499G W OTHER MAJOR PROCEDURE,15,NEWBORNS AND OTHER NEONATES WITH CONDITIONS ORIGINATING IN THE PERINATAL PERIOD,4,Extreme,Extreme,Surgical,Medicaid,Medicaid,Self-Pay,03000,,true,330124.61,69701.01
Western NY,Erie,1401014,000208,John R. Oishei Children's Hospital,0 to 17,142,F,White,Not Span/Hispanic,13,Newborn,Home w/ Home Health Services,2018,PNL001,LIVEBORN,CNS010,CEREBROSPINAL FLUID SHUNT PROCEDURES,631,NEONATE BIRTHWT >2499G W OTHER MAJOR PROCEDURE,15,NEWBORNS AND OTHER NEONATES WITH CONDITIONS ORIGINATING IN THE PERINATAL PERIOD,3,Major,Major,Surgical,Medicaid,Self-Pay,,04200,,false,143542.66,43715.28
Western NY,Erie,1401014,000208,John R. Oishei Children's Hospital,0 to 17,142,F,Other Race,Spanish/Hispanic,8,Newborn,Home w/ Home Health Services,2018,PNL001,LIVEBORN,CNS011,MENINGES REPAIR,631,NEONATE BIRTHWT >2499G W OTHER MAJOR PROCEDURE,15,NEWBORNS AND OTHER NEONATES WITH CONDITIONS ORIGINATING IN THE PERINATAL PERIOD,2,Moderate,Minor,Surgical,Medicaid,Self-Pay,,03600,,false,93753.69,25285.02
New York City,Manhattan,7002054,001458,New York-Presbyterian Hospital - New York Weill Cornell Center,0 to 17,104,F,White,Spanish/Hispanic,33,Emergency,Home or Self Care,2018,PNL006,RESPIRATORY PERINATAL CONDITION,ENT017,"ENT PROCEDURES, NEC",631,NEONATE BIRTHWT >2499G W OTHER MAJOR PROCEDURE,15,NEWBORNS AND OTHER NEONATES WITH CONDITIONS ORIGINATING IN THE PERINATAL PERIOD,4,Extreme,Major,Surgical,"Managed Care, Unspecified",Medicaid,Self-Pay,03300,,false,643119.9,293802.19
Western NY,Erie,1401014,000208,John R. Oishei Children's Hospital,0 to 17,141,M,White,Not Span/Hispanic,15,Newborn,Home or Self Care,2018,PNL001,LIVEBORN,GIS026,"UPPER GI THERAPEUTIC PROCEDURES, NEC (OPEN AND LAPAROSCOPIC)",631,NEONATE BIRTHWT >2499G W OTHER MAJOR PROCEDURE,15,NEWBORNS AND OTHER NEONATES WITH CONDITIONS ORIGINATING IN THE PERINATAL PERIOD,3,Major,Moderate,Surgical,Private Health Insurance,Self-Pay,,03200,,false,150182.59,38836
Western NY,Erie,1401014,000208,John R. Oishei Children's Hospital,0 to 17,141,M,White,Not Span/Hispanic,19,Newborn,Home w/ Home Health Services,2018,PNL001,LIVEBORN,CNS010,CEREBROSPINAL FLUID SHUNT PROCEDURES,631,NEONATE BIRTHWT >2499G W OTHER MAJOR PROCEDURE,15,NEWBORNS AND OTHER NEONATES WITH CONDITIONS ORIGINATING IN THE PERINATAL PERIOD,3,Major,Major,Surgical,Blue Cross/Blue Shield,Self-Pay,,03800,,false,183464.11,50341.65
New York City,Manhattan,7002024,001456,Mount Sinai Hospital,0 to 17,104,F,Other Race,Unknown,13,Urgent,Home or Self Care,2018,MAL002,DIGESTIVE CONGENITAL ANOMALIES,GIS013,PROCTECTOMY OR ANAL RESECTION,631,NEONATE BIRTHWT >2499G W OTHER MAJOR PROCEDURE,15,NEWBORNS AND OTHER NEONATES WITH CONDITIONS ORIGINATING IN THE PERINATAL PERIOD,2,Moderate,Minor,Surgical,Medicaid,Medicaid,Self-Pay,03000,,false,216526.3,42553.86
New York City,Manhattan,7002054,001464,New York-Presbyterian Hospital - Columbia Presbyterian Center,0 to 17,100,M,Multi-racial,Not Span/Hispanic,25,Newborn,Home or Self Care,2018,PNL001,LIVEBORN,CAR024,VENOUS AND ARTERIAL CATHETER PLACEMENT,631,NEONATE BIRTHWT >2499G W OTHER MAJOR PROCEDURE,15,NEWBORNS AND OTHER NEONATES WITH CONDITIONS ORIGINATING IN THE PERINATAL PERIOD,4,Extreme,Major,Surgical,Private Health Insurance,Self-Pay,,02800,,false,530616.94,110388.93
Central NY,Onondaga,3301008,000636,Crouse Hospital,0 to 17,132,M,Other Race,Not Span/Hispanic,43,Newborn,Home w/ Home Health Services,2018,PNL001,LIVEBORN,GIS026,"UPPER GI THERAPEUTIC PROCEDURES, NEC (OPEN AND LAPAROSCOPIC)",631,NEONATE BIRTHWT >2499G W OTHER MAJOR PROCEDURE,15,NEWBORNS AND OTHER NEONATES WITH CONDITIONS ORIGINATING IN THE PERINATAL PERIOD,3,Major,Moderate,Surgical,Medicaid,,,03600,,false,146662.85,71002.73
New York City,Queens,7003004,003376,Cohen Children's Medical Center,0 to 17,116,F,White,Not Span/Hispanic,13,Emergency,Home or Self Care,2018,MAL002,DIGESTIVE CONGENITAL ANOMALIES,GIS013,PROCTECTOMY OR ANAL RESECTION,631,NEONATE BIRTHWT >2499G W OTHER MAJOR PROCEDURE,15,NEWBORNS AND OTHER NEONATES WITH CONDITIONS ORIGINATING IN THE PERINATAL PERIOD,3,Major,Moderate,Surgical,Blue Cross/Blue Shield,Self-Pay,,03000,,true,232128.84,45143.47
New York City,Manhattan,7002024,001456,Mount Sinai Hospital,0 to 17,113,M,Other Race,Spanish/Hispanic,28,Urgent,Home or Self Care,2018,MAL002,DIGESTIVE CONGENITAL ANOMALIES,GIS021,GI SYSTEM REPAIR (EXCLUDING ANORECTAL),631,NEONATE BIRTHWT >2499G W OTHER MAJOR PROCEDURE,15,NEWBORNS AND OTHER NEONATES WITH CONDITIONS ORIGINATING IN THE PERINATAL PERIOD,3,Major,Moderate,Surgical,Medicaid,Self-Pay,,02800,,false,403619.84,78318.84