Hospital Service Area,Hospital County,Operating Certificate Number,Permanent Facility Id,Facility Name,Age Group,Zip Code - 3 digits,Gender,Race,Ethnicity,Length of Stay,Type of Admission,Patient Disposition,Discharge Year,CCS Diagnosis Code,CCS Diagnosis Description,CCS Procedure Code,CCS Procedure Description,APR DRG Code,APR DRG Description,APR MDC Code,APR MDC Description,APR Severity of Illness Code,APR Severity of Illness Description,APR Risk of Mortality,APR Medical Surgical Description,Payment Typology 1,Payment Typology 2,Payment Typology 3,Birth Weight,Abortion Edit Indicator,Emergency Department Indicator,Total Charges,Total Costs
New York City,Manhattan,7002053,001463,NYU Langone Hospitals,0 to 17,100,M,Multi-racial,Not Span/Hispanic,18,Newborn,Home w/ Home Health Services,2019,PNL001,LIVEBORN,GIS011,SMALL BOWEL RESECTION,631,NEONATE BIRTHWT >2499G W OTHER MAJOR PROCEDURE,15,NEWBORNS AND OTHER NEONATES WITH CONDITIONS ORIGINATING IN THE PERINATAL PERIOD,3,Major,Major,Surgical,Private Health Insurance,,,02700,,false,291354.05,102485.24
New York City,Manhattan,7002054,001464,New York-Presbyterian Hospital - Columbia Presbyterian Center,0 to 17,OOS,F,White,Spanish/Hispanic,11,Newborn,Home or Self Care,2019,PNL001,LIVEBORN,RES011,DIAPHRAGMATIC HERNIA REPAIR,631,NEONATE BIRTHWT >2499G W OTHER MAJOR PROCEDURE,15,NEWBORNS AND OTHER NEONATES WITH CONDITIONS ORIGINATING IN THE PERINATAL PERIOD,4,Extreme,Major,Surgical,Medicaid,Self-Pay,,03400,,false,282950.28,60661.89
Capital/Adirond,Albany,0101000,000001,Albany Medical Center Hospital,0 to 17,128,F,Other Race,Unknown,10,Newborn,Home or Self Care,2019,PNL001,LIVEBORN,GIS021,GI SYSTEM REPAIR (EXCLUDING ANORECTAL),631,NEONATE BIRTHWT >2499G W OTHER MAJOR PROCEDURE,15,NEWBORNS AND OTHER NEONATES WITH CONDITIONS ORIGINATING IN THE PERINATAL PERIOD,2,Moderate,Minor,Surgical,"Managed Care, Unspecified",,,03500,,false,106352.75,30228.93
New York City,Manhattan,7002054,001464,New York-Presbyterian Hospital - Columbia Presbyterian Center,0 to 17,112,F,Black/African American,Not Span/Hispanic,120 +,Newborn,Short-term Hospital,2019,PNL001,LIVEBORN,GNR002,ABDOMINAL WALL REPAIR (INCLUDING HERNIA),631,NEONATE BIRTHWT >2499G W OTHER MAJOR PROCEDURE,15,NEWBORNS AND OTHER NEONATES WITH CONDITIONS ORIGINATING IN THE PERINATAL PERIOD,4,Extreme,Major,Surgical,Medicaid,Self-Pay,,02900,,false,3354543.67,720287.54
New York City,Manhattan,7002054,001464,New York-Presbyterian Hospital - Columbia Presbyterian Center,0 to 17,105,F,White,Spanish/Hispanic,22,Newborn,Expired,2019,PNL001,LIVEBORN,CNS010,CEREBROSPINAL FLUID SHUNT PROCEDURES,631,NEONATE BIRTHWT >2499G W OTHER MAJOR PROCEDURE,15,NEWBORNS AND OTHER NEONATES WITH CONDITIONS ORIGINATING IN THE PERINATAL PERIOD,4,Extreme,Major,Surgical,Medicaid,Medicaid,Self-Pay,02700,,false,581129.75,121577.28
New York City,Manhattan,7002054,001464,New York-Presbyterian Hospital - Columbia Presbyterian Center,0 to 17,104,F,White,Not Span/Hispanic,56,Emergency,Hospice - Home,2019,MAL008,MUSCULOSKELETAL CONGENITAL CONDITIONS,GIS011,SMALL BOWEL RESECTION,631,NEONATE BIRTHWT >2499G W OTHER MAJOR PROCEDURE,15,NEWBORNS AND OTHER NEONATES WITH CONDITIONS ORIGINATING IN THE PERINATAL PERIOD,3,Major,Extreme,Surgical,Medicaid,Medicaid,Self-Pay,02500,,false,1170296.68,237110.9
New York City,Manhattan,7002054,001464,New York-Presbyterian Hospital - Columbia Presbyterian Center,0 to 17,100,F,Multi-racial,Multi-ethnic,12,Newborn,Home or Self Care,2019,PNL001,LIVEBORN,RES011,DIAPHRAGMATIC HERNIA REPAIR,631,NEONATE BIRTHWT >2499G W OTHER MAJOR PROCEDURE,15,NEWBORNS AND OTHER NEONATES WITH CONDITIONS ORIGINATING IN THE PERINATAL PERIOD,4,Extreme,Major,Surgical,Medicaid,Medicaid,Self-Pay,03300,,false,300155.39,65255.62
New York City,Manhattan,7002054,001464,New York-Presbyterian Hospital - Columbia Presbyterian Center,0 to 17,112,F,Black/African American,Not Span/Hispanic,34,Newborn,Home w/ Home Health Services,2019,PNL001,LIVEBORN,CNS011,MENINGES REPAIR,631,NEONATE BIRTHWT >2499G W OTHER MAJOR PROCEDURE,15,NEWBORNS AND OTHER NEONATES WITH CONDITIONS ORIGINATING IN THE PERINATAL PERIOD,3,Major,Minor,Surgical,Medicaid,Medicaid,Self-Pay,03300,,false,749490.96,156698.2
New York City,Manhattan,7002054,001464,New York-Presbyterian Hospital - Columbia Presbyterian Center,0 to 17,109,M,White,Not Span/Hispanic,14,Newborn,Home or Self Care,2019,PNL001,LIVEBORN,RES011,DIAPHRAGMATIC HERNIA REPAIR,631,NEONATE BIRTHWT >2499G W OTHER MAJOR PROCEDURE,15,NEWBORNS AND OTHER NEONATES WITH CONDITIONS ORIGINATING IN THE PERINATAL PERIOD,3,Major,Moderate,Surgical,Blue Cross/Blue Shield,Self-Pay,,03500,,false,350119.68,76449.7
New York City,Manhattan,7002054,001458,New York-Presbyterian Hospital - New York Weill Cornell Center,0 to 17,100,F,White,Not Span/Hispanic,2,Emergency,Home or Self Care,2019,INJ037,"COMPLICATION OF OTHER SURGICAL OR MEDICAL CARE, INJURY, INITIAL ENCOUNTER",GIS005,EXPLORATION OF PERITONEAL CAVITY,631,NEONATE BIRTHWT >2499G W OTHER MAJOR PROCEDURE,15,NEWBORNS AND OTHER NEONATES WITH CONDITIONS ORIGINATING IN THE PERINATAL PERIOD,2,Moderate,Minor,Surgical,Blue Cross/Blue Shield,Self-Pay,,04000,,true,53056.25,22548.15
New York City,Queens,7003004,003376,Cohen Children's Medical Center,0 to 17,114,M,Black/African American,Not Span/Hispanic,11,Urgent,Home or Self Care,2019,MAL002,DIGESTIVE CONGENITAL ANOMALIES,GIS013,PROCTECTOMY OR ANAL RESECTION,631,NEONATE BIRTHWT >2499G W OTHER MAJOR PROCEDURE,15,NEWBORNS AND OTHER NEONATES WITH CONDITIONS ORIGINATING IN THE PERINATAL PERIOD,2,Moderate,Minor,Surgical,Medicaid,Self-Pay,,02700,,false,207651.64,40868.88
Capital/Adirond,Albany,0101000,000001,Albany Medical Center Hospital,0 to 17,123,M,Other Race,Not Span/Hispanic,13,Newborn,Home w/ Home Health Services,2019,PNL001,LIVEBORN,CNS010,CEREBROSPINAL FLUID SHUNT PROCEDURES,631,NEONATE BIRTHWT >2499G W OTHER MAJOR PROCEDURE,15,NEWBORNS AND OTHER NEONATES WITH CONDITIONS ORIGINATING IN THE PERINATAL PERIOD,2,Moderate,Minor,Surgical,"Managed Care, Unspecified",Medicaid,,04100,,false,132781.72,39505.42
Western NY,Erie,1401014,000208,John R. Oishei Children's Hospital,0 to 17,140,M,White,Not Span/Hispanic,16,Newborn,Home w/ Home Health Services,2019,PNL001,LIVEBORN,MST005,INCISION AND DRAINAGE OF SUBCUTANEOUS TISSUE AND FASCIA,631,NEONATE BIRTHWT >2499G W OTHER MAJOR PROCEDURE,15,NEWBORNS AND OTHER NEONATES WITH CONDITIONS ORIGINATING IN THE PERINATAL PERIOD,2,Moderate,Minor,Surgical,Blue Cross/Blue Shield,Self-Pay,,03600,,false,145169.73,36777.76
Central NY,Onondaga,3301008,000636,Crouse Hospital,0 to 17,130,F,White,Not Span/Hispanic,57,Urgent,Home w/ Home Health Services,2019,PNL012,NEONATAL DIGESTIVE AND FEEDING DISORDERS,GIS022,GI SYSTEM LYSIS OF ADHESIONS,631,NEONATE BIRTHWT >2499G W OTHER MAJOR PROCEDURE,15,NEWBORNS AND OTHER NEONATES WITH CONDITIONS ORIGINATING IN THE PERINATAL PERIOD,3,Major,Major,Surgical,Private Health Insurance,,,03800,,false,253234.69,115777.16
Central NY,Onondaga,3301008,000636,Crouse Hospital,0 to 17,136,F,White,Not Span/Hispanic,14,Newborn,Home w/ Home Health Services,2019,PNL001,LIVEBORN,CNS010,CEREBROSPINAL FLUID SHUNT PROCEDURES,631,NEONATE BIRTHWT >2499G W OTHER MAJOR PROCEDURE,15,NEWBORNS AND OTHER NEONATES WITH CONDITIONS ORIGINATING IN THE PERINATAL PERIOD,2,Moderate,Minor,Surgical,Medicaid,,,03200,,false,73350.99,33573.98
New York City,Manhattan,7002054,001458,New York-Presbyterian Hospital - New York Weill Cornell Center,0 to 17,101,M,White,Not Span/Hispanic,11,Newborn,Home w/ Home Health Services,2019,PNL001,LIVEBORN,GIS018,ILEOSTOMY AND COLOSTOMY,631,NEONATE BIRTHWT >2499G W OTHER MAJOR PROCEDURE,15,NEWBORNS AND OTHER NEONATES WITH CONDITIONS ORIGINATING IN THE PERINATAL PERIOD,2,Moderate,Minor,Surgical,Private Health Insurance,Self-Pay,,02900,,false,241877.02,50991.23
Central NY,Onondaga,3301008,000636,Crouse Hospital,0 to 17,131,M,White,Not Span/Hispanic,10,Urgent,Home w/ Home Health Services,2019,MAL008,MUSCULOSKELETAL CONGENITAL CONDITIONS,RES011,DIAPHRAGMATIC HERNIA REPAIR,631,NEONATE BIRTHWT >2499G W OTHER MAJOR PROCEDURE,15,NEWBORNS AND OTHER NEONATES WITH CONDITIONS ORIGINATING IN THE PERINATAL PERIOD,3,Major,Moderate,Surgical,Blue Cross/Blue Shield,,,02800,,false,63722.3,27184.01
Central NY,Onondaga,3301008,000636,Crouse Hospital,0 to 17,136,M,White,Not Span/Hispanic,5,Urgent,Home or Self Care,2019,MAL002,DIGESTIVE CONGENITAL ANOMALIES,GIS011,SMALL BOWEL RESECTION,631,NEONATE BIRTHWT >2499G W OTHER MAJOR PROCEDURE,15,NEWBORNS AND OTHER NEONATES WITH CONDITIONS ORIGINATING IN THE PERINATAL PERIOD,1,Minor,Minor,Surgical,Medicaid,,,04000,,false,31059.53,13545.41
Central NY,Onondaga,3301008,000636,Crouse Hospital,0 to 17,135,F,Other Race,Not Span/Hispanic,12,Urgent,Home w/ Home Health Services,2019,MAL002,DIGESTIVE CONGENITAL ANOMALIES,GIS021,GI SYSTEM REPAIR (EXCLUDING ANORECTAL),631,NEONATE BIRTHWT >2499G W OTHER MAJOR PROCEDURE,15,NEWBORNS AND OTHER NEONATES WITH CONDITIONS ORIGINATING IN THE PERINATAL PERIOD,4,Extreme,Moderate,Surgical,Medicaid,,,02600,,false,68306.57,29801.82
Western NY,Erie,1401014,000208,John R. Oishei Children's Hospital,0 to 17,142,F,Other Race,Not Span/Hispanic,120 +,Newborn,Home w/ Home Health Services,2019,PNL001,LIVEBORN,GIS026,"UPPER GI THERAPEUTIC PROCEDURES, NEC (OPEN AND LAPAROSCOPIC)",631,NEONATE BIRTHWT >2499G W OTHER MAJOR PROCEDURE,15,NEWBORNS AND OTHER NEONATES WITH CONDITIONS ORIGINATING IN THE PERINATAL PERIOD,4,Extreme,Extreme,Surgical,Medicaid,Self-Pay,,04000,,false,1730089.78,563286.91
New York City,Queens,7003004,003376,Cohen Children's Medical Center,0 to 17,114,F,Black/African American,Not Span/Hispanic,40,Newborn,Home w/ Home Health Services,2019,PNL001,LIVEBORN,CNS011,MENINGES REPAIR,631,NEONATE BIRTHWT >2499G W OTHER MAJOR PROCEDURE,15,NEWBORNS AND OTHER NEONATES WITH CONDITIONS ORIGINATING IN THE PERINATAL PERIOD,4,Extreme,Moderate,Surgical,Medicaid,Self-Pay,,02800,,false,834122.82,160618.69
Capital/Adirond,Albany,0101000,000001,Albany Medical Center Hospital,0 to 17,123,M,Other Race,Unknown,48,Newborn,Short-term Hospital,2019,PNL001,LIVEBORN,CAR012,VESSEL REPAIR AND REPLACEMENT,631,NEONATE BIRTHWT >2499G W OTHER MAJOR PROCEDURE,15,NEWBORNS AND OTHER NEONATES WITH CONDITIONS ORIGINATING IN THE PERINATAL PERIOD,4,Extreme,Major,Surgical,"Managed Care, Unspecified",Medicaid,,02900,,false,662600.03,210775.98
Capital/Adirond,Albany,0101000,000001,Albany Medical Center Hospital,0 to 17,120,M,Other Race,Unknown,51,Newborn,Home w/ Home Health Services,2019,PNL001,LIVEBORN,MST029,"MUSCULOSKELETAL DEVICE PROCEDURES, NEC",631,NEONATE BIRTHWT >2499G W OTHER MAJOR PROCEDURE,15,NEWBORNS AND OTHER NEONATES WITH CONDITIONS ORIGINATING IN THE PERINATAL PERIOD,3,Major,Major,Surgical,Medicaid,Medicaid,,03800,,false,495802.64,154100.77
New York City,Manhattan,7002024,001456,Mount Sinai Hospital,0 to 17,100,M,Black/African American,Not Span/Hispanic,9,Newborn,Home or Self Care,2019,PNL001,LIVEBORN,RES007,AIRWAY INTUBATION,631,NEONATE BIRTHWT >2499G W OTHER MAJOR PROCEDURE,15,NEWBORNS AND OTHER NEONATES WITH CONDITIONS ORIGINATING IN THE PERINATAL PERIOD,4,Extreme,Major,Surgical,Medicaid,Self-Pay,,03500,,false,275619.11,59980.89
Long Island,Nassau,2908000,000511,NYU Langone Hospital-Long Island,0 to 17,114,F,Other Race,Not Span/Hispanic,2,Newborn,Home or Self Care,2019,PNL001,LIVEBORN,MST018,BONE EXCISION,631,NEONATE BIRTHWT >2499G W OTHER MAJOR PROCEDURE,15,NEWBORNS AND OTHER NEONATES WITH CONDITIONS ORIGINATING IN THE PERINATAL PERIOD,2,Moderate,Minor,Surgical,Private Health Insurance,Private Health Insurance,,02700,,false,22710.39,2943.88
New York City,Manhattan,7002024,001456,Mount Sinai Hospital,0 to 17,100,F,Black/African American,Not Span/Hispanic,10,Newborn,Home w/ Home Health Services,2019,PNL001,LIVEBORN,CNS004,INTRACRANIAL EPIDURAL AND SUBDURAL SPACE DRAINAGE,631,NEONATE BIRTHWT >2499G W OTHER MAJOR PROCEDURE,15,NEWBORNS AND OTHER NEONATES WITH CONDITIONS ORIGINATING IN THE PERINATAL PERIOD,3,Major,Moderate,Surgical,Medicaid,Medicaid,Self-Pay,03000,,false,263608,54763.41
Western NY,Erie,1401014,000208,John R. Oishei Children's Hospital,0 to 17,142,M,White,Not Span/Hispanic,13,Newborn,Home or Self Care,2019,PNL001,LIVEBORN,CNS010,CEREBROSPINAL FLUID SHUNT PROCEDURES,631,NEONATE BIRTHWT >2499G W OTHER MAJOR PROCEDURE,15,NEWBORNS AND OTHER NEONATES WITH CONDITIONS ORIGINATING IN THE PERINATAL PERIOD,3,Major,Moderate,Surgical,Blue Cross/Blue Shield,Self-Pay,,04000,,false,147965.71,40796.85
Western NY,Erie,1401014,000208,John R. Oishei Children's Hospital,0 to 17,142,M,White,Not Span/Hispanic,40,Newborn,Home w/ Home Health Services,2019,MAL002,DIGESTIVE CONGENITAL ANOMALIES,GIS021,GI SYSTEM REPAIR (EXCLUDING ANORECTAL),631,NEONATE BIRTHWT >2499G W OTHER MAJOR PROCEDURE,15,NEWBORNS AND OTHER NEONATES WITH CONDITIONS ORIGINATING IN THE PERINATAL PERIOD,4,Extreme,Major,Surgical,Private Health Insurance,Self-Pay,,03000,,false,412519.99,107570.3
New York City,Queens,7003004,003376,Cohen Children's Medical Center,0 to 17,110,M,Other Race,Spanish/Hispanic,30,Newborn,Home or Self Care,2019,PNL001,LIVEBORN,GIS018,ILEOSTOMY AND COLOSTOMY,631,NEONATE BIRTHWT >2499G W OTHER MAJOR PROCEDURE,15,NEWBORNS AND OTHER NEONATES WITH CONDITIONS ORIGINATING IN THE PERINATAL PERIOD,2,Moderate,Minor,Surgical,Medicaid,Medicaid,Self-Pay,03500,,false,518727.94,100723.4
Western NY,Erie,1401014,000208,John R. Oishei Children's Hospital,0 to 17,140,F,White,Not Span/Hispanic,90,Urgent,Home w/ Home Health Services,2019,MAL010,OTHER SPECIFIED AND UNSPECIFIED CONGENITAL ANOMALIES,MST018,BONE EXCISION,631,NEONATE BIRTHWT >2499G W OTHER MAJOR PROCEDURE,15,NEWBORNS AND OTHER NEONATES WITH CONDITIONS ORIGINATING IN THE PERINATAL PERIOD,4,Extreme,Moderate,Surgical,Medicaid,Self-Pay,,02500,,false,835017.48,230402.71
Central NY,Onondaga,3301008,000636,Crouse Hospital,0 to 17,131,M,Other Race,Not Span/Hispanic,9,Newborn,Home or Self Care,2019,PNL001,LIVEBORN,RES011,DIAPHRAGMATIC HERNIA REPAIR,631,NEONATE BIRTHWT >2499G W OTHER MAJOR PROCEDURE,15,NEWBORNS AND OTHER NEONATES WITH CONDITIONS ORIGINATING IN THE PERINATAL PERIOD,4,Extreme,Moderate,Surgical,Blue Cross/Blue Shield,,,03700,,false,68306.27,29112.5
Central NY,Onondaga,3301008,000636,Crouse Hospital,0 to 17,132,F,Other Race,Not Span/Hispanic,45,Newborn,Home w/ Home Health Services,2019,PNL001,LIVEBORN,EST002,PHOTOTHERAPY,631,NEONATE BIRTHWT >2499G W OTHER MAJOR PROCEDURE,15,NEWBORNS AND OTHER NEONATES WITH CONDITIONS ORIGINATING IN THE PERINATAL PERIOD,3,Major,Moderate,Surgical,Medicaid,,,03000,,false,153774.17,73598.26
New York City,Manhattan,7002024,001456,Mount Sinai Hospital,0 to 17,100,F,White,Not Span/Hispanic,10,Urgent,Home or Self Care,2019,PNL001,LIVEBORN,CAR024,VENOUS AND ARTERIAL CATHETER PLACEMENT,631,NEONATE BIRTHWT >2499G W OTHER MAJOR PROCEDURE,15,NEWBORNS AND OTHER NEONATES WITH CONDITIONS ORIGINATING IN THE PERINATAL PERIOD,3,Major,Minor,Surgical,Private Health Insurance,Self-Pay,,03100,,false,223222.67,43539.63
New York City,Bronx,7000006,001169,Montefiore Medical Center - Henry & Lucy Moses Div,0 to 17,104,F,Other Race,Unknown,10,Emergency,Home or Self Care,2019,PNL006,RESPIRATORY PERINATAL CONDITION,RES011,DIAPHRAGMATIC HERNIA REPAIR,631,NEONATE BIRTHWT >2499G W OTHER MAJOR PROCEDURE,15,NEWBORNS AND OTHER NEONATES WITH CONDITIONS ORIGINATING IN THE PERINATAL PERIOD,4,Extreme,Major,Surgical,Medicaid,,,03500,,false,272726.14,50169.45
New York City,Bronx,7000006,003058,Montefiore Med Center - Jack D Weiler Hosp of A Einstein College Div,0 to 17,104,F,Black/African American,Unknown,68,Emergency,Home or Self Care,2019,MAL002,DIGESTIVE CONGENITAL ANOMALIES,ESA003,MECHANICAL VENTILATION,631,NEONATE BIRTHWT >2499G W OTHER MAJOR PROCEDURE,15,NEWBORNS AND OTHER NEONATES WITH CONDITIONS ORIGINATING IN THE PERINATAL PERIOD,4,Extreme,Major,Surgical,Medicaid,,,02500,,false,1310721.77,163539.75
New York City,Queens,7003004,003376,Cohen Children's Medical Center,0 to 17,110,M,Other Race,Spanish/Hispanic,15,Newborn,Home w/ Home Health Services,2019,PNL001,LIVEBORN,GIS009,COLECTOMY,631,NEONATE BIRTHWT >2499G W OTHER MAJOR PROCEDURE,15,NEWBORNS AND OTHER NEONATES WITH CONDITIONS ORIGINATING IN THE PERINATAL PERIOD,2,Moderate,Minor,Surgical,Private Health Insurance,Blue Cross/Blue Shield,Medicaid,02900,,false,266879.96,52531.69
New York City,Queens,7003004,003376,Cohen Children's Medical Center,0 to 17,117,F,White,Spanish/Hispanic,21,Newborn,Home or Self Care,2019,MAL002,DIGESTIVE CONGENITAL ANOMALIES,GIS021,GI SYSTEM REPAIR (EXCLUDING ANORECTAL),631,NEONATE BIRTHWT >2499G W OTHER MAJOR PROCEDURE,15,NEWBORNS AND OTHER NEONATES WITH CONDITIONS ORIGINATING IN THE PERINATAL PERIOD,3,Major,Moderate,Surgical,Medicaid,Medicaid,Self-Pay,02800,,false,401908.41,79001.43
New York City,Manhattan,7002024,001456,Mount Sinai Hospital,0 to 17,100,M,White,Not Span/Hispanic,8,Urgent,Home or Self Care,2019,PNL001,LIVEBORN,ADM017,ADMINISTRATION OF NUTRITIONAL AND ELECTROLYTIC SUBSTANCES,631,NEONATE BIRTHWT >2499G W OTHER MAJOR PROCEDURE,15,NEWBORNS AND OTHER NEONATES WITH CONDITIONS ORIGINATING IN THE PERINATAL PERIOD,3,Major,Moderate,Surgical,Private Health Insurance,Self-Pay,,03600,,false,199540.36,41145.87
New York City,Queens,7003004,003376,Cohen Children's Medical Center,0 to 17,114,F,Black/African American,Not Span/Hispanic,27,Newborn,Home or Self Care,2019,PNL001,LIVEBORN,CNS010,CEREBROSPINAL FLUID SHUNT PROCEDURES,631,NEONATE BIRTHWT >2499G W OTHER MAJOR PROCEDURE,15,NEWBORNS AND OTHER NEONATES WITH CONDITIONS ORIGINATING IN THE PERINATAL PERIOD,2,Moderate,Minor,Surgical,Medicaid,Medicaid,Self-Pay,03000,,false,481707.93,92028.88
Capital/Adirond,Albany,0101000,000001,Albany Medical Center Hospital,0 to 17,122,M,White,Not Span/Hispanic,14,Emergency,Home or Self Care,2019,MAL008,MUSCULOSKELETAL CONGENITAL CONDITIONS,RES011,DIAPHRAGMATIC HERNIA REPAIR,631,NEONATE BIRTHWT >2499G W OTHER MAJOR PROCEDURE,15,NEWBORNS AND OTHER NEONATES WITH CONDITIONS ORIGINATING IN THE PERINATAL PERIOD,4,Extreme,Extreme,Surgical,Private Health Insurance,,,03000,,true,155474.19,40228.33
Western NY,Erie,1401014,000208,John R. Oishei Children's Hospital,0 to 17,140,F,Other Race,Spanish/Hispanic,47,Newborn,Home w/ Home Health Services,2019,PNL001,LIVEBORN,CNS005,VENTRICULOSTOMY [PERCUTANEOUS APPROACH],631,NEONATE BIRTHWT >2499G W OTHER MAJOR PROCEDURE,15,NEWBORNS AND OTHER NEONATES WITH CONDITIONS ORIGINATING IN THE PERINATAL PERIOD,3,Major,Major,Surgical,Medicaid,Self-Pay,,03900,,false,485420.44,126535.71
New York City,Queens,7003004,003376,Cohen Children's Medical Center,0 to 17,115,M,Black/African American,Not Span/Hispanic,16,Newborn,Home or Self Care,2019,PNL001,LIVEBORN,CNS010,CEREBROSPINAL FLUID SHUNT PROCEDURES,631,NEONATE BIRTHWT >2499G W OTHER MAJOR PROCEDURE,15,NEWBORNS AND OTHER NEONATES WITH CONDITIONS ORIGINATING IN THE PERINATAL PERIOD,3,Major,Moderate,Surgical,Medicaid,Medicaid,Self-Pay,03800,,false,337236.88,65494.27
New York City,Manhattan,7002054,001464,New York-Presbyterian Hospital - Columbia Presbyterian Center,0 to 17,112,F,White,Spanish/Hispanic,28,Newborn,Home or Self Care,2019,PNL001,LIVEBORN,GIS021,GI SYSTEM REPAIR (EXCLUDING ANORECTAL),631,NEONATE BIRTHWT >2499G W OTHER MAJOR PROCEDURE,15,NEWBORNS AND OTHER NEONATES WITH CONDITIONS ORIGINATING IN THE PERINATAL PERIOD,3,Major,Minor,Surgical,Medicaid,Medicaid,Self-Pay,02500,,false,633471.37,135228.31
Central NY,Onondaga,3301008,000636,Crouse Hospital,0 to 17,130,F,White,Not Span/Hispanic,14,Urgent,Home w/ Home Health Services,2019,MAL002,DIGESTIVE CONGENITAL ANOMALIES,GIS021,GI SYSTEM REPAIR (EXCLUDING ANORECTAL),631,NEONATE BIRTHWT >2499G W OTHER MAJOR PROCEDURE,15,NEWBORNS AND OTHER NEONATES WITH CONDITIONS ORIGINATING IN THE PERINATAL PERIOD,2,Moderate,Moderate,Surgical,Medicaid,,,02600,,false,79495.1,34662.49
Capital/Adirond,Albany,0101000,000001,Albany Medical Center Hospital,0 to 17,120,M,Other Race,Unknown,12,Newborn,Home or Self Care,2019,PNL001,LIVEBORN,CNS011,MENINGES REPAIR,631,NEONATE BIRTHWT >2499G W OTHER MAJOR PROCEDURE,15,NEWBORNS AND OTHER NEONATES WITH CONDITIONS ORIGINATING IN THE PERINATAL PERIOD,3,Major,Major,Surgical,"Managed Care, Unspecified",,,02500,,false,131822.72,36095.82
New York City,Manhattan,7002024,001456,Mount Sinai Hospital,0 to 17,100,F,White,Not Span/Hispanic,9,Newborn,Home or Self Care,2019,PNL001,LIVEBORN,GIS018,ILEOSTOMY AND COLOSTOMY,631,NEONATE BIRTHWT >2499G W OTHER MAJOR PROCEDURE,15,NEWBORNS AND OTHER NEONATES WITH CONDITIONS ORIGINATING IN THE PERINATAL PERIOD,2,Moderate,Minor,Surgical,Private Health Insurance,Self-Pay,,02600,,false,201488,39599.48
New York City,Manhattan,7002054,001458,New York-Presbyterian Hospital - New York Weill Cornell Center,0 to 17,112,F,White,Not Span/Hispanic,17,Emergency,Home or Self Care,2019,MAL002,DIGESTIVE CONGENITAL ANOMALIES,GIS026,"UPPER GI THERAPEUTIC PROCEDURES, NEC (OPEN AND LAPAROSCOPIC)",631,NEONATE BIRTHWT >2499G W OTHER MAJOR PROCEDURE,15,NEWBORNS AND OTHER NEONATES WITH CONDITIONS ORIGINATING IN THE PERINATAL PERIOD,3,Major,Minor,Surgical,"Managed Care, Unspecified",Medicaid,Self-Pay,04200,,true,315417.9,147611.11
New York City,Kings,7001021,001306,New York - Presbyterian Brooklyn Methodist Hospital,0 to 17,112,M,Other Race,Not Span/Hispanic,2,Newborn,Home or Self Care,2019,PNL001,LIVEBORN,SKB007,SKIN GRAFT,631,NEONATE BIRTHWT >2499G W OTHER MAJOR PROCEDURE,15,NEWBORNS AND OTHER NEONATES WITH CONDITIONS ORIGINATING IN THE PERINATAL PERIOD,1,Minor,Minor,Surgical,Private Health Insurance,Self-Pay,,02600,,false,8641,998.13
New York City,Manhattan,7002054,001458,New York-Presbyterian Hospital - New York Weill Cornell Center,0 to 17,OOS,M,Other Race,Not Span/Hispanic,71,Newborn,Home or Self Care,2019,PNL001,LIVEBORN,GIS022,GI SYSTEM LYSIS OF ADHESIONS,631,NEONATE BIRTHWT >2499G W OTHER MAJOR PROCEDURE,15,NEWBORNS AND OTHER NEONATES WITH CONDITIONS ORIGINATING IN THE PERINATAL PERIOD,4,Extreme,Major,Surgical,Blue Cross/Blue Shield,Self-Pay,,03700,,false,1546783.15,322527.09
New York City,Manhattan,7002054,001464,New York-Presbyterian Hospital - Columbia Presbyterian Center,0 to 17,112,F,Other Race,Not Span/Hispanic,48,Newborn,Home w/ Home Health Services,2019,PNL001,LIVEBORN,ADM017,ADMINISTRATION OF NUTRITIONAL AND ELECTROLYTIC SUBSTANCES,631,NEONATE BIRTHWT >2499G W OTHER MAJOR PROCEDURE,15,NEWBORNS AND OTHER NEONATES WITH CONDITIONS ORIGINATING IN THE PERINATAL PERIOD,3,Major,Moderate,Surgical,Medicaid,Medicaid,Self-Pay,05200,,false,1104933.32,229237.59
New York City,Manhattan,7002054,001464,New York-Presbyterian Hospital - Columbia Presbyterian Center,0 to 17,117,M,Black/African American,Not Span/Hispanic,13,Newborn,Home or Self Care,2019,PNL001,LIVEBORN,CNS007,CNS EXCISION PROCEDURES,631,NEONATE BIRTHWT >2499G W OTHER MAJOR PROCEDURE,15,NEWBORNS AND OTHER NEONATES WITH CONDITIONS ORIGINATING IN THE PERINATAL PERIOD,3,Major,Minor,Surgical,Private Health Insurance,Self-Pay,,03400,,false,330099.9,72296.83
New York City,Manhattan,7002054,001464,New York-Presbyterian Hospital - Columbia Presbyterian Center,0 to 17,106,M,White,Spanish/Hispanic,8,Newborn,Home or Self Care,2019,PNL001,LIVEBORN,RES011,DIAPHRAGMATIC HERNIA REPAIR,631,NEONATE BIRTHWT >2499G W OTHER MAJOR PROCEDURE,15,NEWBORNS AND OTHER NEONATES WITH CONDITIONS ORIGINATING IN THE PERINATAL PERIOD,3,Major,Moderate,Surgical,Blue Cross/Blue Shield,Self-Pay,,03000,,false,222862.42,48946.42
Capital/Adirond,Albany,0101000,000001,Albany Medical Center Hospital,0 to 17,121,M,Other Race,Unknown,10,Newborn,Home or Self Care,2019,PNL001,LIVEBORN,GIS026,"UPPER GI THERAPEUTIC PROCEDURES, NEC (OPEN AND LAPAROSCOPIC)",631,NEONATE BIRTHWT >2499G W OTHER MAJOR PROCEDURE,15,NEWBORNS AND OTHER NEONATES WITH CONDITIONS ORIGINATING IN THE PERINATAL PERIOD,2,Moderate,Minor,Surgical,"Managed Care, Unspecified",,,02900,,false,99458.12,28280.46