Hospital Service Area,Hospital County,Operating Certificate Number,Permanent Facility Id,Facility Name,Age Group,Zip Code - 3 digits,Gender,Race,Ethnicity,Length of Stay,Type of Admission,Patient Disposition,Discharge Year,CCS Diagnosis Code,CCS Diagnosis Description,CCS Procedure Code,CCS Procedure Description,APR DRG Code,APR DRG Description,APR MDC Code,APR MDC Description,APR Severity of Illness Code,APR Severity of Illness Description,APR Risk of Mortality,APR Medical Surgical Description,Payment Typology 1,Payment Typology 2,Payment Typology 3,Birth Weight,Abortion Edit Indicator,Emergency Department Indicator,Total Charges,Total Costs
New York City,Kings,7002053,001304,NYU Langone Hospital-Brooklyn,0 to 17,112,M,Black/African American,Not Span/Hispanic,2,Newborn,Home or Self Care,2020,PNL001,LIVEBORN,MRS001,CIRCUMCISION,633,NEONATE BIRTHWT >2499G W MAJOR ANOMALY,15,NEWBORNS AND OTHER NEONATES WITH CONDITIONS ORIGINATING IN THE PERINATAL PERIOD,1,Minor,Minor,Medical,Private Health Insurance,,,02600,,N,25637.21,8218.61
New York City,Kings,7002053,001304,NYU Langone Hospital-Brooklyn,0 to 17,112,F,White,Unknown,2,Newborn,Home or Self Care,2020,PNL001,LIVEBORN,ADM010,VACCINATIONS,633,NEONATE BIRTHWT >2499G W MAJOR ANOMALY,15,NEWBORNS AND OTHER NEONATES WITH CONDITIONS ORIGINATING IN THE PERINATAL PERIOD,1,Minor,Minor,Medical,Medicaid,,,03400,,N,23328.81,7843.6
New York City,Kings,7002053,001304,NYU Langone Hospital-Brooklyn,0 to 17,112,F,Black/African American,Not Span/Hispanic,6,Newborn,Home or Self Care,2020,PNL001,LIVEBORN,ENT004,DIAGNOSTIC AUDIOLOGY,633,NEONATE BIRTHWT >2499G W MAJOR ANOMALY,15,NEWBORNS AND OTHER NEONATES WITH CONDITIONS ORIGINATING IN THE PERINATAL PERIOD,2,Moderate,Moderate,Medical,Private Health Insurance,,,02900,,N,79882.61,24452.85
New York City,Kings,7002053,001304,NYU Langone Hospital-Brooklyn,0 to 17,112,M,White,Unknown,3,Newborn,Home or Self Care,2020,PNL001,LIVEBORN,,,633,NEONATE BIRTHWT >2499G W MAJOR ANOMALY,15,NEWBORNS AND OTHER NEONATES WITH CONDITIONS ORIGINATING IN THE PERINATAL PERIOD,2,Moderate,Minor,Medical,Medicaid,,,03600,,N,51647.73,15096.47
New York City,Kings,7002053,001304,NYU Langone Hospital-Brooklyn,0 to 17,112,M,Other Race,Spanish/Hispanic,3,Newborn,Home or Self Care,2020,PNL001,LIVEBORN,,,633,NEONATE BIRTHWT >2499G W MAJOR ANOMALY,15,NEWBORNS AND OTHER NEONATES WITH CONDITIONS ORIGINATING IN THE PERINATAL PERIOD,1,Minor,Minor,Medical,Medicaid,,,02500,,N,34243.5,10954.8
New York City,Kings,7002053,001304,NYU Langone Hospital-Brooklyn,0 to 17,112,M,Other Race,Not Span/Hispanic,2,Newborn,Home or Self Care,2020,PNL001,LIVEBORN,ADM010,VACCINATIONS,633,NEONATE BIRTHWT >2499G W MAJOR ANOMALY,15,NEWBORNS AND OTHER NEONATES WITH CONDITIONS ORIGINATING IN THE PERINATAL PERIOD,1,Minor,Minor,Medical,Blue Cross/Blue Shield,,,02700,,N,22983.39,7731.87
New York City,Kings,7002053,001304,NYU Langone Hospital-Brooklyn,0 to 17,112,F,Other Race,Not Span/Hispanic,12,Newborn,Home or Self Care,2020,PNL001,LIVEBORN,ADM010,VACCINATIONS,633,NEONATE BIRTHWT >2499G W MAJOR ANOMALY,15,NEWBORNS AND OTHER NEONATES WITH CONDITIONS ORIGINATING IN THE PERINATAL PERIOD,2,Moderate,Minor,Medical,Medicaid,,,03800,,N,281855.87,56970.79
New York City,Kings,7002053,001304,NYU Langone Hospital-Brooklyn,0 to 17,112,M,Other Race,Not Span/Hispanic,1,Newborn,Home or Self Care,2020,PNL001,LIVEBORN,ADM010,VACCINATIONS,633,NEONATE BIRTHWT >2499G W MAJOR ANOMALY,15,NEWBORNS AND OTHER NEONATES WITH CONDITIONS ORIGINATING IN THE PERINATAL PERIOD,1,Minor,Minor,Medical,Medicaid,,,02700,,N,13641.43,4336.63
New York City,Kings,7002053,001304,NYU Langone Hospital-Brooklyn,0 to 17,112,M,White,Unknown,2,Newborn,Home or Self Care,2020,PNL001,LIVEBORN,,,633,NEONATE BIRTHWT >2499G W MAJOR ANOMALY,15,NEWBORNS AND OTHER NEONATES WITH CONDITIONS ORIGINATING IN THE PERINATAL PERIOD,1,Minor,Moderate,Medical,Medicaid,,,03300,,N,22995.89,7201.62
New York City,Kings,7002053,001304,NYU Langone Hospital-Brooklyn,0 to 17,112,F,Other Race,Not Span/Hispanic,2,Newborn,Home or Self Care,2020,PNL001,LIVEBORN,ADM010,VACCINATIONS,633,NEONATE BIRTHWT >2499G W MAJOR ANOMALY,15,NEWBORNS AND OTHER NEONATES WITH CONDITIONS ORIGINATING IN THE PERINATAL PERIOD,1,Minor,Minor,Medical,Medicaid,,,03200,,N,23083.68,7817.95
New York City,Kings,7002053,001304,NYU Langone Hospital-Brooklyn,0 to 17,112,M,Other Race,Unknown,9,Newborn,Home or Self Care,2020,PNL001,LIVEBORN,ADM010,VACCINATIONS,633,NEONATE BIRTHWT >2499G W MAJOR ANOMALY,15,NEWBORNS AND OTHER NEONATES WITH CONDITIONS ORIGINATING IN THE PERINATAL PERIOD,2,Moderate,Minor,Medical,Medicaid,,,03300,,N,103415.43,36750.34
New York City,Kings,7002053,001304,NYU Langone Hospital-Brooklyn,0 to 17,112,M,Black/African American,Not Span/Hispanic,2,Newborn,Home or Self Care,2020,PNL001,LIVEBORN,ESA004,NON-INVASIVE VENTILATION,633,NEONATE BIRTHWT >2499G W MAJOR ANOMALY,15,NEWBORNS AND OTHER NEONATES WITH CONDITIONS ORIGINATING IN THE PERINATAL PERIOD,3,Major,Major,Medical,Medicaid,,,03000,,N,23328.81,7843.6
New York City,Kings,7002053,001304,NYU Langone Hospital-Brooklyn,0 to 17,112,M,Black/African American,Not Span/Hispanic,2,Newborn,Home or Self Care,2020,PNL001,LIVEBORN,ADM010,VACCINATIONS,633,NEONATE BIRTHWT >2499G W MAJOR ANOMALY,15,NEWBORNS AND OTHER NEONATES WITH CONDITIONS ORIGINATING IN THE PERINATAL PERIOD,1,Minor,Minor,Medical,Medicaid,,,02500,,N,22838,7982.09
New York City,Kings,7002053,001304,NYU Langone Hospital-Brooklyn,0 to 17,112,M,White,Unknown,5,Newborn,Home or Self Care,2020,PNL001,LIVEBORN,ADM010,VACCINATIONS,633,NEONATE BIRTHWT >2499G W MAJOR ANOMALY,15,NEWBORNS AND OTHER NEONATES WITH CONDITIONS ORIGINATING IN THE PERINATAL PERIOD,1,Minor,Moderate,Medical,Medicaid,,,02600,,N,59025.38,18954.47
New York City,Kings,7002053,001304,NYU Langone Hospital-Brooklyn,0 to 17,112,M,White,Spanish/Hispanic,3,Newborn,Home or Self Care,2020,PNL001,LIVEBORN,ADM010,VACCINATIONS,633,NEONATE BIRTHWT >2499G W MAJOR ANOMALY,15,NEWBORNS AND OTHER NEONATES WITH CONDITIONS ORIGINATING IN THE PERINATAL PERIOD,1,Minor,Minor,Medical,Medicaid,,,03200,,N,38374.52,12946.62
New York City,Kings,7002053,001304,NYU Langone Hospital-Brooklyn,0 to 17,112,M,Other Race,Not Span/Hispanic,24,Newborn,Home or Self Care,2020,PNL001,LIVEBORN,ADM021,"ADMINISTRATION OF THERAPEUTIC SUBSTANCES, NEC",633,NEONATE BIRTHWT >2499G W MAJOR ANOMALY,15,NEWBORNS AND OTHER NEONATES WITH CONDITIONS ORIGINATING IN THE PERINATAL PERIOD,4,Extreme,Major,Medical,Medicaid,,,04500,,N,306747.02,106038.14
New York City,Kings,7002053,001304,NYU Langone Hospital-Brooklyn,0 to 17,103,F,Other Race,Not Span/Hispanic,2,Newborn,Home or Self Care,2020,PNL001,LIVEBORN,ESA004,NON-INVASIVE VENTILATION,633,NEONATE BIRTHWT >2499G W MAJOR ANOMALY,15,NEWBORNS AND OTHER NEONATES WITH CONDITIONS ORIGINATING IN THE PERINATAL PERIOD,1,Minor,Minor,Medical,Private Health Insurance,,,02800,,N,23324.32,7851.46
New York City,Kings,7002053,001304,NYU Langone Hospital-Brooklyn,0 to 17,,M,Multi-racial,Unknown,6,Newborn,Home or Self Care,2020,PNL001,LIVEBORN,ESA004,NON-INVASIVE VENTILATION,633,NEONATE BIRTHWT >2499G W MAJOR ANOMALY,15,NEWBORNS AND OTHER NEONATES WITH CONDITIONS ORIGINATING IN THE PERINATAL PERIOD,3,Major,Minor,Medical,Medicaid,,,03900,,N,89651.26,28330.89
New York City,Kings,7002053,001304,NYU Langone Hospital-Brooklyn,0 to 17,103,M,White,Not Span/Hispanic,1,Newborn,Home or Self Care,2020,PNL001,LIVEBORN,ADM010,VACCINATIONS,633,NEONATE BIRTHWT >2499G W MAJOR ANOMALY,15,NEWBORNS AND OTHER NEONATES WITH CONDITIONS ORIGINATING IN THE PERINATAL PERIOD,1,Minor,Minor,Medical,Blue Cross/Blue Shield,,,03200,,N,14494.48,4819.45
New York City,Kings,7002053,001304,NYU Langone Hospital-Brooklyn,0 to 17,113,F,Other Race,Not Span/Hispanic,1,Newborn,Home or Self Care,2020,PNL001,LIVEBORN,ADM010,VACCINATIONS,633,NEONATE BIRTHWT >2499G W MAJOR ANOMALY,15,NEWBORNS AND OTHER NEONATES WITH CONDITIONS ORIGINATING IN THE PERINATAL PERIOD,1,Minor,Minor,Medical,Medicaid,,,02500,,N,15744.17,4950.2
New York City,Kings,7002053,001304,NYU Langone Hospital-Brooklyn,0 to 17,112,F,White,Not Span/Hispanic,2,Newborn,Home or Self Care,2020,PNL001,LIVEBORN,ENT004,DIAGNOSTIC AUDIOLOGY,633,NEONATE BIRTHWT >2499G W MAJOR ANOMALY,15,NEWBORNS AND OTHER NEONATES WITH CONDITIONS ORIGINATING IN THE PERINATAL PERIOD,1,Minor,Minor,Medical,Medicaid,,,03100,,N,23933.56,7985.83
New York City,Kings,7002053,001304,NYU Langone Hospital-Brooklyn,0 to 17,112,F,Other Race,Spanish/Hispanic,6,Newborn,Home or Self Care,2020,PNL001,LIVEBORN,ESA004,NON-INVASIVE VENTILATION,633,NEONATE BIRTHWT >2499G W MAJOR ANOMALY,15,NEWBORNS AND OTHER NEONATES WITH CONDITIONS ORIGINATING IN THE PERINATAL PERIOD,2,Moderate,Minor,Medical,Medicaid,,,02500,,N,92474.96,27870.29
New York City,Kings,7002053,001304,NYU Langone Hospital-Brooklyn,0 to 17,112,F,White,Not Span/Hispanic,2,Newborn,Home or Self Care,2020,PNL001,LIVEBORN,,,633,NEONATE BIRTHWT >2499G W MAJOR ANOMALY,15,NEWBORNS AND OTHER NEONATES WITH CONDITIONS ORIGINATING IN THE PERINATAL PERIOD,2,Moderate,Minor,Medical,Medicaid,,,03400,,N,24641.36,8077.75
New York City,Kings,7002053,001304,NYU Langone Hospital-Brooklyn,0 to 17,112,F,Black/African American,Spanish/Hispanic,1,Newborn,Home or Self Care,2020,PNL001,LIVEBORN,ADM010,VACCINATIONS,633,NEONATE BIRTHWT >2499G W MAJOR ANOMALY,15,NEWBORNS AND OTHER NEONATES WITH CONDITIONS ORIGINATING IN THE PERINATAL PERIOD,2,Moderate,Moderate,Medical,Medicaid,,,02800,,N,16184.98,5071.9
New York City,Kings,7002053,001304,NYU Langone Hospital-Brooklyn,0 to 17,112,F,Other Race,Not Span/Hispanic,2,Newborn,Home or Self Care,2020,PNL001,LIVEBORN,,,633,NEONATE BIRTHWT >2499G W MAJOR ANOMALY,15,NEWBORNS AND OTHER NEONATES WITH CONDITIONS ORIGINATING IN THE PERINATAL PERIOD,1,Minor,Minor,Medical,Medicaid,,,02600,,N,26136.16,8224.22
New York City,Kings,7002053,001304,NYU Langone Hospital-Brooklyn,0 to 17,100,F,Other Race,Not Span/Hispanic,2,Newborn,Home or Self Care,2020,PNL001,LIVEBORN,ADM010,VACCINATIONS,633,NEONATE BIRTHWT >2499G W MAJOR ANOMALY,15,NEWBORNS AND OTHER NEONATES WITH CONDITIONS ORIGINATING IN THE PERINATAL PERIOD,1,Minor,Minor,Medical,Private Health Insurance,,,02600,,N,22793.88,7712.04
New York City,Kings,7002053,001304,NYU Langone Hospital-Brooklyn,0 to 17,112,F,White,Spanish/Hispanic,7,Newborn,Home or Self Care,2020,PNL001,LIVEBORN,EST002,PHOTOTHERAPY,633,NEONATE BIRTHWT >2499G W MAJOR ANOMALY,15,NEWBORNS AND OTHER NEONATES WITH CONDITIONS ORIGINATING IN THE PERINATAL PERIOD,2,Moderate,Minor,Medical,Medicaid,,,03900,,N,100473.13,37583.57
New York City,Kings,7002053,001304,NYU Langone Hospital-Brooklyn,0 to 17,112,M,Other Race,Not Span/Hispanic,9,Newborn,Home or Self Care,2020,PNL001,LIVEBORN,ADM021,"ADMINISTRATION OF THERAPEUTIC SUBSTANCES, NEC",633,NEONATE BIRTHWT >2499G W MAJOR ANOMALY,15,NEWBORNS AND OTHER NEONATES WITH CONDITIONS ORIGINATING IN THE PERINATAL PERIOD,2,Moderate,Minor,Medical,Medicaid,,,03400,,N,122268.45,40621.31
New York City,Kings,7002053,001304,NYU Langone Hospital-Brooklyn,0 to 17,112,M,White,Unknown,2,Newborn,Home or Self Care,2020,PNL001,LIVEBORN,ENT004,DIAGNOSTIC AUDIOLOGY,633,NEONATE BIRTHWT >2499G W MAJOR ANOMALY,15,NEWBORNS AND OTHER NEONATES WITH CONDITIONS ORIGINATING IN THE PERINATAL PERIOD,2,Moderate,Minor,Medical,Medicaid,,,03100,,N,23115.47,8055.07
New York City,Kings,7002053,001304,NYU Langone Hospital-Brooklyn,0 to 17,112,F,Other Race,Unknown,3,Newborn,Home or Self Care,2020,PNL001,LIVEBORN,ADM010,VACCINATIONS,633,NEONATE BIRTHWT >2499G W MAJOR ANOMALY,15,NEWBORNS AND OTHER NEONATES WITH CONDITIONS ORIGINATING IN THE PERINATAL PERIOD,1,Minor,Minor,Medical,Medicaid,,,03400,,N,44390.65,15008.74
New York City,Kings,7002053,001304,NYU Langone Hospital-Brooklyn,0 to 17,112,F,Other Race,Not Span/Hispanic,2,Newborn,Home or Self Care,2020,PNL001,LIVEBORN,ADM010,VACCINATIONS,633,NEONATE BIRTHWT >2499G W MAJOR ANOMALY,15,NEWBORNS AND OTHER NEONATES WITH CONDITIONS ORIGINATING IN THE PERINATAL PERIOD,1,Minor,Minor,Medical,Medicaid,,,02800,,N,25197.69,8719.79
New York City,Kings,7002053,001304,NYU Langone Hospital-Brooklyn,0 to 17,103,F,Other Race,Unknown,1,Newborn,Home or Self Care,2020,PNL001,LIVEBORN,ADM010,VACCINATIONS,633,NEONATE BIRTHWT >2499G W MAJOR ANOMALY,15,NEWBORNS AND OTHER NEONATES WITH CONDITIONS ORIGINATING IN THE PERINATAL PERIOD,1,Minor,Minor,Medical,Medicaid,,,02900,,N,14724.69,4843.54
New York City,Kings,7002053,001304,NYU Langone Hospital-Brooklyn,0 to 17,112,M,Other Race,Not Span/Hispanic,1,Newborn,Home or Self Care,2020,PNL001,LIVEBORN,ADM010,VACCINATIONS,633,NEONATE BIRTHWT >2499G W MAJOR ANOMALY,15,NEWBORNS AND OTHER NEONATES WITH CONDITIONS ORIGINATING IN THE PERINATAL PERIOD,1,Minor,Minor,Medical,Medicaid,,,02700,,N,14218.95,5012.52
New York City,Kings,7002053,001304,NYU Langone Hospital-Brooklyn,0 to 17,112,M,Other Race,Unknown,11,Newborn,Home or Self Care,2020,PNL001,LIVEBORN,MRS001,CIRCUMCISION,633,NEONATE BIRTHWT >2499G W MAJOR ANOMALY,15,NEWBORNS AND OTHER NEONATES WITH CONDITIONS ORIGINATING IN THE PERINATAL PERIOD,3,Major,Moderate,Medical,Private Health Insurance,,,04600,,N,129540.61,45280.85
New York City,Kings,7002053,001304,NYU Langone Hospital-Brooklyn,0 to 17,112,M,Other Race,Spanish/Hispanic,5,Newborn,Home or Self Care,2020,PNL001,LIVEBORN,ADM010,VACCINATIONS,633,NEONATE BIRTHWT >2499G W MAJOR ANOMALY,15,NEWBORNS AND OTHER NEONATES WITH CONDITIONS ORIGINATING IN THE PERINATAL PERIOD,1,Minor,Minor,Medical,Medicaid,,,03500,,N,67279.87,23744.35
New York City,Kings,7002053,001304,NYU Langone Hospital-Brooklyn,0 to 17,112,M,Other Race,Spanish/Hispanic,3,Newborn,Home or Self Care,2020,PNL001,LIVEBORN,ADM010,VACCINATIONS,633,NEONATE BIRTHWT >2499G W MAJOR ANOMALY,15,NEWBORNS AND OTHER NEONATES WITH CONDITIONS ORIGINATING IN THE PERINATAL PERIOD,2,Moderate,Minor,Medical,Medicaid,,,02800,,N,55035.28,24633.84
New York City,Kings,7002053,001304,NYU Langone Hospital-Brooklyn,0 to 17,,F,White,Unknown,2,Newborn,Home or Self Care,2020,PNL001,LIVEBORN,ADM010,VACCINATIONS,633,NEONATE BIRTHWT >2499G W MAJOR ANOMALY,15,NEWBORNS AND OTHER NEONATES WITH CONDITIONS ORIGINATING IN THE PERINATAL PERIOD,1,Minor,Minor,Medical,Blue Cross/Blue Shield,,,03400,,N,25884.2,8791.03
New York City,Kings,7002053,001304,NYU Langone Hospital-Brooklyn,0 to 17,112,M,White,Not Span/Hispanic,3,Newborn,Home or Self Care,2020,PNL001,LIVEBORN,ADM010,VACCINATIONS,633,NEONATE BIRTHWT >2499G W MAJOR ANOMALY,15,NEWBORNS AND OTHER NEONATES WITH CONDITIONS ORIGINATING IN THE PERINATAL PERIOD,1,Minor,Minor,Medical,Blue Cross/Blue Shield,,,03200,,N,37705.54,12790.24
New York City,Kings,7002053,001304,NYU Langone Hospital-Brooklyn,0 to 17,112,M,White,Spanish/Hispanic,2,Newborn,Home or Self Care,2020,PNL001,LIVEBORN,ADM010,VACCINATIONS,633,NEONATE BIRTHWT >2499G W MAJOR ANOMALY,15,NEWBORNS AND OTHER NEONATES WITH CONDITIONS ORIGINATING IN THE PERINATAL PERIOD,1,Minor,Minor,Medical,Medicaid,,,03200,,N,26415.9,8846.65
New York City,Kings,7002053,001304,NYU Langone Hospital-Brooklyn,0 to 17,112,F,White,Not Span/Hispanic,1,Newborn,Home or Self Care,2020,PNL001,LIVEBORN,ENT004,DIAGNOSTIC AUDIOLOGY,633,NEONATE BIRTHWT >2499G W MAJOR ANOMALY,15,NEWBORNS AND OTHER NEONATES WITH CONDITIONS ORIGINATING IN THE PERINATAL PERIOD,1,Minor,Minor,Medical,Medicaid,,,03400,,N,14042.99,4170.52
New York City,Kings,7002053,001304,NYU Langone Hospital-Brooklyn,0 to 17,112,M,Other Race,Unknown,2,Newborn,Home or Self Care,2020,PNL001,LIVEBORN,ADM010,VACCINATIONS,633,NEONATE BIRTHWT >2499G W MAJOR ANOMALY,15,NEWBORNS AND OTHER NEONATES WITH CONDITIONS ORIGINATING IN THE PERINATAL PERIOD,1,Minor,Minor,Medical,Medicaid,,,03200,,N,27113.98,9127.24
New York City,Kings,7002053,001304,NYU Langone Hospital-Brooklyn,0 to 17,112,M,Black/African American,Not Span/Hispanic,3,Newborn,Home or Self Care,2020,PNL001,LIVEBORN,ADM010,VACCINATIONS,633,NEONATE BIRTHWT >2499G W MAJOR ANOMALY,15,NEWBORNS AND OTHER NEONATES WITH CONDITIONS ORIGINATING IN THE PERINATAL PERIOD,1,Minor,Minor,Medical,Medicaid,,,04300,,N,41384.33,14247.84
New York City,Kings,7002053,001304,NYU Langone Hospital-Brooklyn,0 to 17,112,M,White,Not Span/Hispanic,2,Newborn,Home or Self Care,2020,PNL001,LIVEBORN,,,633,NEONATE BIRTHWT >2499G W MAJOR ANOMALY,15,NEWBORNS AND OTHER NEONATES WITH CONDITIONS ORIGINATING IN THE PERINATAL PERIOD,1,Minor,Minor,Medical,Medicaid,,,03500,,N,24802.96,8152.38
New York City,Kings,7002053,001304,NYU Langone Hospital-Brooklyn,0 to 17,112,M,Other Race,Spanish/Hispanic,2,Newborn,Home or Self Care,2020,PNL001,LIVEBORN,ADM010,VACCINATIONS,633,NEONATE BIRTHWT >2499G W MAJOR ANOMALY,15,NEWBORNS AND OTHER NEONATES WITH CONDITIONS ORIGINATING IN THE PERINATAL PERIOD,1,Minor,Minor,Medical,Medicaid,,,02700,,N,25596.36,8760.91
New York City,Kings,7002053,001304,NYU Langone Hospital-Brooklyn,0 to 17,112,M,Other Race,Spanish/Hispanic,26,Newborn,Home or Self Care,2020,PNL001,LIVEBORN,ESA004,NON-INVASIVE VENTILATION,633,NEONATE BIRTHWT >2499G W MAJOR ANOMALY,15,NEWBORNS AND OTHER NEONATES WITH CONDITIONS ORIGINATING IN THE PERINATAL PERIOD,3,Major,Moderate,Medical,Medicaid,,,03500,,N,400913.48,133622.28
New York City,Kings,7002053,001304,NYU Langone Hospital-Brooklyn,0 to 17,103,M,Other Race,Not Span/Hispanic,48,Newborn,Home or Self Care,2020,PNL001,LIVEBORN,ESA003,MECHANICAL VENTILATION,633,NEONATE BIRTHWT >2499G W MAJOR ANOMALY,15,NEWBORNS AND OTHER NEONATES WITH CONDITIONS ORIGINATING IN THE PERINATAL PERIOD,4,Extreme,Major,Medical,Medicaid,,,02700,,N,785357.56,252568.7
New York City,Kings,7002053,001304,NYU Langone Hospital-Brooklyn,0 to 17,112,F,Other Race,Spanish/Hispanic,2,Newborn,Home or Self Care,2020,PNL001,LIVEBORN,ADM010,VACCINATIONS,633,NEONATE BIRTHWT >2499G W MAJOR ANOMALY,15,NEWBORNS AND OTHER NEONATES WITH CONDITIONS ORIGINATING IN THE PERINATAL PERIOD,1,Minor,Minor,Medical,Medicaid,,,02800,,N,25066.79,8781.09
New York City,Kings,7002053,001304,NYU Langone Hospital-Brooklyn,0 to 17,112,F,White,Spanish/Hispanic,8,Newborn,Home or Self Care,2020,PNL001,LIVEBORN,ADM021,"ADMINISTRATION OF THERAPEUTIC SUBSTANCES, NEC",633,NEONATE BIRTHWT >2499G W MAJOR ANOMALY,15,NEWBORNS AND OTHER NEONATES WITH CONDITIONS ORIGINATING IN THE PERINATAL PERIOD,3,Major,Major,Medical,Medicaid,,,03300,,N,130057.67,41524.53
New York City,Kings,7002053,001304,NYU Langone Hospital-Brooklyn,0 to 17,112,F,Black/African American,Not Span/Hispanic,3,Newborn,Home or Self Care,2020,PNL001,LIVEBORN,ADM010,VACCINATIONS,633,NEONATE BIRTHWT >2499G W MAJOR ANOMALY,15,NEWBORNS AND OTHER NEONATES WITH CONDITIONS ORIGINATING IN THE PERINATAL PERIOD,1,Minor,Minor,Medical,Medicaid,,,02800,,N,36976.27,12807.64
New York City,Kings,7002053,001304,NYU Langone Hospital-Brooklyn,0 to 17,112,F,Black/African American,Unknown,2,Newborn,Home or Self Care,2020,PNL001,LIVEBORN,ESA004,NON-INVASIVE VENTILATION,633,NEONATE BIRTHWT >2499G W MAJOR ANOMALY,15,NEWBORNS AND OTHER NEONATES WITH CONDITIONS ORIGINATING IN THE PERINATAL PERIOD,1,Minor,Minor,Medical,Medicaid,,,03100,,N,30092.92,9676.58
New York City,Kings,7002053,001304,NYU Langone Hospital-Brooklyn,0 to 17,112,M,Other Race,Spanish/Hispanic,2,Newborn,Home or Self Care,2020,PNL001,LIVEBORN,ADM010,VACCINATIONS,633,NEONATE BIRTHWT >2499G W MAJOR ANOMALY,15,NEWBORNS AND OTHER NEONATES WITH CONDITIONS ORIGINATING IN THE PERINATAL PERIOD,2,Moderate,Minor,Medical,Medicaid,,,03300,,N,21876.18,7616.03
New York City,Kings,7002053,001304,NYU Langone Hospital-Brooklyn,0 to 17,112,F,Other Race,Not Span/Hispanic,8,Newborn,Home or Self Care,2020,PNL001,LIVEBORN,ESA004,NON-INVASIVE VENTILATION,633,NEONATE BIRTHWT >2499G W MAJOR ANOMALY,15,NEWBORNS AND OTHER NEONATES WITH CONDITIONS ORIGINATING IN THE PERINATAL PERIOD,1,Minor,Minor,Medical,Medicaid,,,03700,,N,128707.51,42915.44
New York City,Kings,7002053,001304,NYU Langone Hospital-Brooklyn,0 to 17,112,M,Other Race,Unknown,1,Newborn,Home or Self Care,2020,PNL001,LIVEBORN,ADM010,VACCINATIONS,633,NEONATE BIRTHWT >2499G W MAJOR ANOMALY,15,NEWBORNS AND OTHER NEONATES WITH CONDITIONS ORIGINATING IN THE PERINATAL PERIOD,1,Minor,Minor,Medical,Medicaid,,,03300,,N,14494.48,4819.45
New York City,Kings,7002053,001304,NYU Langone Hospital-Brooklyn,0 to 17,112,M,Other Race,Unknown,2,Newborn,Home or Self Care,2020,PNL001,LIVEBORN,ADM010,VACCINATIONS,633,NEONATE BIRTHWT >2499G W MAJOR ANOMALY,15,NEWBORNS AND OTHER NEONATES WITH CONDITIONS ORIGINATING IN THE PERINATAL PERIOD,2,Moderate,Moderate,Medical,Medicaid,,,03100,,N,25164.6,8715.74
New York City,Kings,7002053,001304,NYU Langone Hospital-Brooklyn,0 to 17,112,F,White,Not Span/Hispanic,2,Newborn,Home or Self Care,2020,PNL001,LIVEBORN,ENT004,DIAGNOSTIC AUDIOLOGY,633,NEONATE BIRTHWT >2499G W MAJOR ANOMALY,15,NEWBORNS AND OTHER NEONATES WITH CONDITIONS ORIGINATING IN THE PERINATAL PERIOD,1,Minor,Moderate,Medical,Medicaid,,,03600,,N,25164.6,8715.74
