Hospital Service Area,Hospital County,Operating Certificate Number,Permanent Facility Id,Facility Name,Age Group,Zip Code - 3 digits,Gender,Race,Ethnicity,Length of Stay,Type of Admission,Patient Disposition,Discharge Year,CCS Diagnosis Code,CCS Diagnosis Description,CCS Procedure Code,CCS Procedure Description,APR DRG Code,APR DRG Description,APR MDC Code,APR MDC Description,APR Severity of Illness Code,APR Severity of Illness Description,APR Risk of Mortality,APR Medical Surgical Description,Payment Typology 1,Payment Typology 2,Payment Typology 3,Birth Weight,Abortion Edit Indicator,Emergency Department Indicator,Total Charges,Total Costs
Long Island,Nassau,2908000,000511,NYU Langone Hospital-Long Island,0 to 17,117,F,White,Not Span/Hispanic,7,Newborn,Home or Self Care,2020,PNL001,LIVEBORN,CNS002,LUMBAR PUNCTURE,633,NEONATE BIRTHWT >2499G W MAJOR ANOMALY,15,NEWBORNS AND OTHER NEONATES WITH CONDITIONS ORIGINATING IN THE PERINATAL PERIOD,3,Major,Moderate,Medical,Medicaid,,,03400,,N,103185.78,32458.41
Long Island,Nassau,2908000,000511,NYU Langone Hospital-Long Island,0 to 17,115,M,White,Spanish/Hispanic,3,Newborn,Home or Self Care,2020,PNL001,LIVEBORN,,,633,NEONATE BIRTHWT >2499G W MAJOR ANOMALY,15,NEWBORNS AND OTHER NEONATES WITH CONDITIONS ORIGINATING IN THE PERINATAL PERIOD,1,Minor,Minor,Medical,Medicaid,,,03300,,N,32753.16,11171.87
Long Island,Nassau,2908000,000511,NYU Langone Hospital-Long Island,0 to 17,117,M,White,Not Span/Hispanic,3,Newborn,Home or Self Care,2020,PNL001,LIVEBORN,MRS001,CIRCUMCISION,633,NEONATE BIRTHWT >2499G W MAJOR ANOMALY,15,NEWBORNS AND OTHER NEONATES WITH CONDITIONS ORIGINATING IN THE PERINATAL PERIOD,1,Minor,Minor,Medical,Private Health Insurance,,,04600,,N,31353.72,11046.41
Long Island,Nassau,2908000,000511,NYU Langone Hospital-Long Island,0 to 17,115,F,White,Not Span/Hispanic,3,Newborn,Home or Self Care,2020,PNL001,LIVEBORN,ADM010,VACCINATIONS,633,NEONATE BIRTHWT >2499G W MAJOR ANOMALY,15,NEWBORNS AND OTHER NEONATES WITH CONDITIONS ORIGINATING IN THE PERINATAL PERIOD,1,Minor,Minor,Medical,Blue Cross/Blue Shield,,,03300,,N,34787.41,11405.65
Long Island,Nassau,2908000,000511,NYU Langone Hospital-Long Island,0 to 17,110,M,White,Not Span/Hispanic,2,Elective,Home or Self Care,2020,PNL001,LIVEBORN,,,633,NEONATE BIRTHWT >2499G W MAJOR ANOMALY,15,NEWBORNS AND OTHER NEONATES WITH CONDITIONS ORIGINATING IN THE PERINATAL PERIOD,1,Minor,Minor,Medical,Blue Cross/Blue Shield,,,02700,,N,23969.84,7835.08
Long Island,Nassau,2908000,000511,NYU Langone Hospital-Long Island,0 to 17,115,F,Other Race,Spanish/Hispanic,2,Newborn,Home or Self Care,2020,PNL001,LIVEBORN,ADM010,VACCINATIONS,633,NEONATE BIRTHWT >2499G W MAJOR ANOMALY,15,NEWBORNS AND OTHER NEONATES WITH CONDITIONS ORIGINATING IN THE PERINATAL PERIOD,1,Minor,Minor,Medical,Medicaid,,,03100,,N,24627.69,7938.85
Long Island,Nassau,2908000,000511,NYU Langone Hospital-Long Island,0 to 17,115,F,White,Not Span/Hispanic,6,Newborn,Home or Self Care,2020,PNL001,LIVEBORN,ADM010,VACCINATIONS,633,NEONATE BIRTHWT >2499G W MAJOR ANOMALY,15,NEWBORNS AND OTHER NEONATES WITH CONDITIONS ORIGINATING IN THE PERINATAL PERIOD,3,Major,Minor,Medical,Private Health Insurance,,,02600,,N,90521.98,28550.02
Long Island,Nassau,2908000,000511,NYU Langone Hospital-Long Island,0 to 17,115,M,Other Race,Not Span/Hispanic,15,Newborn,Home or Self Care,2020,PNL001,LIVEBORN,ESA004,NON-INVASIVE VENTILATION,633,NEONATE BIRTHWT >2499G W MAJOR ANOMALY,15,NEWBORNS AND OTHER NEONATES WITH CONDITIONS ORIGINATING IN THE PERINATAL PERIOD,3,Major,Minor,Medical,Medicaid,,,04100,,N,201201.42,67424.59
Long Island,Nassau,2908000,000511,NYU Langone Hospital-Long Island,0 to 17,117,M,White,Not Span/Hispanic,1,Urgent,Home or Self Care,2020,PNL007,HEMOLYTIC JAUNDICE AND PERINATAL JAUNDICE,EST002,PHOTOTHERAPY,633,NEONATE BIRTHWT >2499G W MAJOR ANOMALY,15,NEWBORNS AND OTHER NEONATES WITH CONDITIONS ORIGINATING IN THE PERINATAL PERIOD,2,Moderate,Minor,Medical,Private Health Insurance,,,03700,,N,5473.6,1930.09
Long Island,Nassau,2908000,000511,NYU Langone Hospital-Long Island,0 to 17,110,F,White,Not Span/Hispanic,13,Newborn,Home or Self Care,2020,PNL001,LIVEBORN,ADM017,ADMINISTRATION OF NUTRITIONAL AND ELECTROLYTIC SUBSTANCES,633,NEONATE BIRTHWT >2499G W MAJOR ANOMALY,15,NEWBORNS AND OTHER NEONATES WITH CONDITIONS ORIGINATING IN THE PERINATAL PERIOD,3,Major,Moderate,Medical,Private Health Insurance,,,03900,,N,193145.5,59992.47
Long Island,Nassau,2908000,000511,NYU Langone Hospital-Long Island,0 to 17,117,M,White,Not Span/Hispanic,9,Newborn,Home or Self Care,2020,PNL001,LIVEBORN,MRS001,CIRCUMCISION,633,NEONATE BIRTHWT >2499G W MAJOR ANOMALY,15,NEWBORNS AND OTHER NEONATES WITH CONDITIONS ORIGINATING IN THE PERINATAL PERIOD,2,Moderate,Minor,Medical,Blue Cross/Blue Shield,,,03600,,N,139068.36,42788.13
Long Island,Nassau,2908000,000511,NYU Langone Hospital-Long Island,0 to 17,117,F,White,Not Span/Hispanic,6,Newborn,Home or Self Care,2020,PNL001,LIVEBORN,ESA004,NON-INVASIVE VENTILATION,633,NEONATE BIRTHWT >2499G W MAJOR ANOMALY,15,NEWBORNS AND OTHER NEONATES WITH CONDITIONS ORIGINATING IN THE PERINATAL PERIOD,2,Moderate,Minor,Medical,Blue Cross/Blue Shield,,,03400,,N,84898.45,27154.42
Long Island,Nassau,2908000,000511,NYU Langone Hospital-Long Island,0 to 17,115,F,White,Not Span/Hispanic,8,Newborn,Home or Self Care,2020,PNL001,LIVEBORN,ADM017,ADMINISTRATION OF NUTRITIONAL AND ELECTROLYTIC SUBSTANCES,633,NEONATE BIRTHWT >2499G W MAJOR ANOMALY,15,NEWBORNS AND OTHER NEONATES WITH CONDITIONS ORIGINATING IN THE PERINATAL PERIOD,3,Major,Moderate,Medical,Blue Cross/Blue Shield,,,03500,,N,111043.79,36335.02
Long Island,Nassau,2908000,000511,NYU Langone Hospital-Long Island,0 to 17,115,M,Other Race,Spanish/Hispanic,15,Newborn,Home w/ Home Health Services,2020,PNL001,LIVEBORN,EST002,PHOTOTHERAPY,633,NEONATE BIRTHWT >2499G W MAJOR ANOMALY,15,NEWBORNS AND OTHER NEONATES WITH CONDITIONS ORIGINATING IN THE PERINATAL PERIOD,3,Major,Minor,Medical,Medicaid,,,02500,,N,205073.06,67447.27
Long Island,Nassau,2908000,000511,NYU Langone Hospital-Long Island,0 to 17,117,M,White,Not Span/Hispanic,4,Newborn,Home or Self Care,2020,PNL001,LIVEBORN,MRS001,CIRCUMCISION,633,NEONATE BIRTHWT >2499G W MAJOR ANOMALY,15,NEWBORNS AND OTHER NEONATES WITH CONDITIONS ORIGINATING IN THE PERINATAL PERIOD,2,Moderate,Minor,Medical,Private Health Insurance,,,02500,,N,53531.16,15986.77
Long Island,Nassau,2908000,000511,NYU Langone Hospital-Long Island,0 to 17,113,F,White,Not Span/Hispanic,2,Newborn,Home or Self Care,2020,PNL001,LIVEBORN,,,633,NEONATE BIRTHWT >2499G W MAJOR ANOMALY,15,NEWBORNS AND OTHER NEONATES WITH CONDITIONS ORIGINATING IN THE PERINATAL PERIOD,2,Moderate,Moderate,Medical,Blue Cross/Blue Shield,,,03400,,N,27919.07,8462.68
Long Island,Nassau,2908000,000511,NYU Langone Hospital-Long Island,0 to 17,117,F,Other Race,Spanish/Hispanic,4,Newborn,Home or Self Care,2020,PNL001,LIVEBORN,EST002,PHOTOTHERAPY,633,NEONATE BIRTHWT >2499G W MAJOR ANOMALY,15,NEWBORNS AND OTHER NEONATES WITH CONDITIONS ORIGINATING IN THE PERINATAL PERIOD,2,Moderate,Minor,Medical,Medicaid,,,03600,,N,50324.77,15642.55
Long Island,Nassau,2908000,000511,NYU Langone Hospital-Long Island,0 to 17,117,F,Other Race,Spanish/Hispanic,2,Emergency,Home or Self Care,2020,PNL007,HEMOLYTIC JAUNDICE AND PERINATAL JAUNDICE,EST002,PHOTOTHERAPY,633,NEONATE BIRTHWT >2499G W MAJOR ANOMALY,15,NEWBORNS AND OTHER NEONATES WITH CONDITIONS ORIGINATING IN THE PERINATAL PERIOD,2,Moderate,Minor,Medical,Medicaid,,,03600,,Y,20512.01,5156.61
Long Island,Nassau,2908000,000511,NYU Langone Hospital-Long Island,0 to 17,110,M,White,Not Span/Hispanic,2,Newborn,Home or Self Care,2020,PNL001,LIVEBORN,ADM010,VACCINATIONS,633,NEONATE BIRTHWT >2499G W MAJOR ANOMALY,15,NEWBORNS AND OTHER NEONATES WITH CONDITIONS ORIGINATING IN THE PERINATAL PERIOD,1,Minor,Minor,Medical,Blue Cross/Blue Shield,,,02800,,N,22051.83,7675.91
Long Island,Nassau,2908000,000511,NYU Langone Hospital-Long Island,0 to 17,115,M,White,Spanish/Hispanic,3,Newborn,Home or Self Care,2020,PNL001,LIVEBORN,MRS001,CIRCUMCISION,633,NEONATE BIRTHWT >2499G W MAJOR ANOMALY,15,NEWBORNS AND OTHER NEONATES WITH CONDITIONS ORIGINATING IN THE PERINATAL PERIOD,1,Minor,Minor,Medical,Medicaid,,,02800,,N,37794.07,11934.65
Long Island,Nassau,2908000,000511,NYU Langone Hospital-Long Island,0 to 17,114,F,White,Not Span/Hispanic,4,Newborn,Home or Self Care,2020,PNL001,LIVEBORN,ADM010,VACCINATIONS,633,NEONATE BIRTHWT >2499G W MAJOR ANOMALY,15,NEWBORNS AND OTHER NEONATES WITH CONDITIONS ORIGINATING IN THE PERINATAL PERIOD,2,Moderate,Minor,Medical,Medicaid,,,02900,,N,50307.47,16596.25
Long Island,Nassau,2908000,000511,NYU Langone Hospital-Long Island,0 to 17,117,M,White,Not Span/Hispanic,6,Newborn,Home or Self Care,2020,PNL001,LIVEBORN,MRS001,CIRCUMCISION,633,NEONATE BIRTHWT >2499G W MAJOR ANOMALY,15,NEWBORNS AND OTHER NEONATES WITH CONDITIONS ORIGINATING IN THE PERINATAL PERIOD,3,Major,Minor,Medical,Blue Cross/Blue Shield,,,03200,,N,99536.82,28737.35
Long Island,Nassau,2908000,000511,NYU Langone Hospital-Long Island,0 to 17,110,F,White,Not Span/Hispanic,2,Newborn,Home or Self Care,2020,PNL001,LIVEBORN,ADM010,VACCINATIONS,633,NEONATE BIRTHWT >2499G W MAJOR ANOMALY,15,NEWBORNS AND OTHER NEONATES WITH CONDITIONS ORIGINATING IN THE PERINATAL PERIOD,1,Minor,Minor,Medical,Private Health Insurance,,,02800,,N,24676.77,7964.06
Long Island,Nassau,2908000,000511,NYU Langone Hospital-Long Island,0 to 17,114,F,Black/African American,Not Span/Hispanic,3,Newborn,Home or Self Care,2020,PNL001,LIVEBORN,ADM010,VACCINATIONS,633,NEONATE BIRTHWT >2499G W MAJOR ANOMALY,15,NEWBORNS AND OTHER NEONATES WITH CONDITIONS ORIGINATING IN THE PERINATAL PERIOD,2,Moderate,Minor,Medical,Blue Cross/Blue Shield,,,02700,,N,38115,11947.27
Long Island,Nassau,2908000,000511,NYU Langone Hospital-Long Island,0 to 17,,F,Black/African American,Unknown,4,Newborn,Home or Self Care,2020,PNL001,LIVEBORN,ENT015,DENTAL PROCEDURES,633,NEONATE BIRTHWT >2499G W MAJOR ANOMALY,15,NEWBORNS AND OTHER NEONATES WITH CONDITIONS ORIGINATING IN THE PERINATAL PERIOD,2,Moderate,Minor,Medical,Blue Cross/Blue Shield,,,02700,,N,53557.88,18131
Long Island,Nassau,2908000,000511,NYU Langone Hospital-Long Island,0 to 17,115,F,White,Spanish/Hispanic,19,Newborn,Home w/ Home Health Services,2020,PNL001,LIVEBORN,ESA003,MECHANICAL VENTILATION,633,NEONATE BIRTHWT >2499G W MAJOR ANOMALY,15,NEWBORNS AND OTHER NEONATES WITH CONDITIONS ORIGINATING IN THE PERINATAL PERIOD,4,Extreme,Major,Medical,Medicaid,,,03300,,N,317747.46,79257.4
Long Island,Nassau,2908000,000511,NYU Langone Hospital-Long Island,0 to 17,115,M,White,Not Span/Hispanic,48,Newborn,Home w/ Home Health Services,2020,PNL001,LIVEBORN,MRS001,CIRCUMCISION,633,NEONATE BIRTHWT >2499G W MAJOR ANOMALY,15,NEWBORNS AND OTHER NEONATES WITH CONDITIONS ORIGINATING IN THE PERINATAL PERIOD,4,Extreme,Major,Medical,Blue Cross/Blue Shield,,,03400,,N,862076.44,232075.99
Long Island,Nassau,2908000,000511,NYU Langone Hospital-Long Island,0 to 17,115,M,White,Not Span/Hispanic,2,Newborn,Home or Self Care,2020,PNL001,LIVEBORN,ADM010,VACCINATIONS,633,NEONATE BIRTHWT >2499G W MAJOR ANOMALY,15,NEWBORNS AND OTHER NEONATES WITH CONDITIONS ORIGINATING IN THE PERINATAL PERIOD,2,Moderate,Minor,Medical,Medicaid,,,03600,,N,27056.34,8372.42
Long Island,Nassau,2908000,000511,NYU Langone Hospital-Long Island,0 to 17,117,M,Other Race,Not Span/Hispanic,13,Newborn,Home or Self Care,2020,PNL001,LIVEBORN,ADM010,VACCINATIONS,633,NEONATE BIRTHWT >2499G W MAJOR ANOMALY,15,NEWBORNS AND OTHER NEONATES WITH CONDITIONS ORIGINATING IN THE PERINATAL PERIOD,4,Extreme,Major,Medical,Private Health Insurance,,,04000,,N,169471.68,50778.08
Long Island,Nassau,2908000,000511,NYU Langone Hospital-Long Island,0 to 17,115,M,White,Not Span/Hispanic,4,Newborn,Home or Self Care,2020,PNL001,LIVEBORN,ESA004,NON-INVASIVE VENTILATION,633,NEONATE BIRTHWT >2499G W MAJOR ANOMALY,15,NEWBORNS AND OTHER NEONATES WITH CONDITIONS ORIGINATING IN THE PERINATAL PERIOD,2,Moderate,Moderate,Medical,Blue Cross/Blue Shield,,,02900,,N,57720.69,16785.71
Long Island,Nassau,2908000,000511,NYU Langone Hospital-Long Island,0 to 17,114,M,Black/African American,Not Span/Hispanic,7,Newborn,Home or Self Care,2020,PNL001,LIVEBORN,CNS002,LUMBAR PUNCTURE,633,NEONATE BIRTHWT >2499G W MAJOR ANOMALY,15,NEWBORNS AND OTHER NEONATES WITH CONDITIONS ORIGINATING IN THE PERINATAL PERIOD,2,Moderate,Major,Medical,Blue Cross/Blue Shield,,,02800,,N,74729.09,25181.36
Long Island,Nassau,2908000,000511,NYU Langone Hospital-Long Island,0 to 17,115,M,White,Not Span/Hispanic,7,Newborn,Home or Self Care,2020,PNL001,LIVEBORN,CNS002,LUMBAR PUNCTURE,633,NEONATE BIRTHWT >2499G W MAJOR ANOMALY,15,NEWBORNS AND OTHER NEONATES WITH CONDITIONS ORIGINATING IN THE PERINATAL PERIOD,3,Major,Moderate,Medical,Blue Cross/Blue Shield,,,03600,,N,86568.57,26244.15
Long Island,Nassau,2908000,000511,NYU Langone Hospital-Long Island,0 to 17,110,M,White,Not Span/Hispanic,2,Newborn,Home or Self Care,2020,PNL001,LIVEBORN,MRS001,CIRCUMCISION,633,NEONATE BIRTHWT >2499G W MAJOR ANOMALY,15,NEWBORNS AND OTHER NEONATES WITH CONDITIONS ORIGINATING IN THE PERINATAL PERIOD,2,Moderate,Minor,Medical,Blue Cross/Blue Shield,,,03500,,N,21959.53,7240.41
Long Island,Nassau,2908000,000511,NYU Langone Hospital-Long Island,0 to 17,112,F,White,Not Span/Hispanic,2,Newborn,Home or Self Care,2020,PNL001,LIVEBORN,,,633,NEONATE BIRTHWT >2499G W MAJOR ANOMALY,15,NEWBORNS AND OTHER NEONATES WITH CONDITIONS ORIGINATING IN THE PERINATAL PERIOD,2,Moderate,Minor,Medical,Medicaid,,,03200,,N,31032.82,8939.6
Long Island,Nassau,2908000,000511,NYU Langone Hospital-Long Island,0 to 17,110,F,White,Unknown,22,Newborn,Home or Self Care,2020,PNL001,LIVEBORN,,,633,NEONATE BIRTHWT >2499G W MAJOR ANOMALY,15,NEWBORNS AND OTHER NEONATES WITH CONDITIONS ORIGINATING IN THE PERINATAL PERIOD,3,Major,Minor,Medical,Medicaid,,,03000,,N,216932.96,76721.57
Long Island,Nassau,2908000,000511,NYU Langone Hospital-Long Island,0 to 17,115,M,Black/African American,Spanish/Hispanic,8,Newborn,Home or Self Care,2020,PNL001,LIVEBORN,CNS002,LUMBAR PUNCTURE,633,NEONATE BIRTHWT >2499G W MAJOR ANOMALY,15,NEWBORNS AND OTHER NEONATES WITH CONDITIONS ORIGINATING IN THE PERINATAL PERIOD,3,Major,Major,Medical,Private Health Insurance,,,03600,,N,102688.62,33247.31
Long Island,Nassau,2908000,000511,NYU Langone Hospital-Long Island,0 to 17,115,F,White,Not Span/Hispanic,3,Newborn,Home or Self Care,2020,PNL001,LIVEBORN,,,633,NEONATE BIRTHWT >2499G W MAJOR ANOMALY,15,NEWBORNS AND OTHER NEONATES WITH CONDITIONS ORIGINATING IN THE PERINATAL PERIOD,2,Moderate,Moderate,Medical,Blue Cross/Blue Shield,,,03700,,N,49598.75,13632.51
Long Island,Nassau,2908000,000511,NYU Langone Hospital-Long Island,0 to 17,117,M,Black/African American,Not Span/Hispanic,44,Newborn,Home w/ Home Health Services,2020,PNL001,LIVEBORN,CNS002,LUMBAR PUNCTURE,633,NEONATE BIRTHWT >2499G W MAJOR ANOMALY,15,NEWBORNS AND OTHER NEONATES WITH CONDITIONS ORIGINATING IN THE PERINATAL PERIOD,3,Major,Extreme,Medical,Medicaid,,,03400,,N,648676.02,188664.53
Long Island,Nassau,2908000,000511,NYU Langone Hospital-Long Island,0 to 17,117,F,White,Unknown,2,Newborn,Home or Self Care,2020,PNL001,LIVEBORN,ADM010,VACCINATIONS,633,NEONATE BIRTHWT >2499G W MAJOR ANOMALY,15,NEWBORNS AND OTHER NEONATES WITH CONDITIONS ORIGINATING IN THE PERINATAL PERIOD,1,Minor,Minor,Medical,Blue Cross/Blue Shield,,,03600,,N,30401.55,9490.32
Long Island,Nassau,2908000,000511,NYU Langone Hospital-Long Island,0 to 17,113,F,White,Not Span/Hispanic,11,Newborn,Home or Self Care,2020,PNL001,LIVEBORN,EST002,PHOTOTHERAPY,633,NEONATE BIRTHWT >2499G W MAJOR ANOMALY,15,NEWBORNS AND OTHER NEONATES WITH CONDITIONS ORIGINATING IN THE PERINATAL PERIOD,3,Major,Moderate,Medical,Private Health Insurance,,,02600,,N,153367.6,47729.84
Long Island,Nassau,2908000,000511,NYU Langone Hospital-Long Island,0 to 17,118,M,Other Race,Spanish/Hispanic,3,Newborn,Home or Self Care,2020,PNL001,LIVEBORN,MRS001,CIRCUMCISION,633,NEONATE BIRTHWT >2499G W MAJOR ANOMALY,15,NEWBORNS AND OTHER NEONATES WITH CONDITIONS ORIGINATING IN THE PERINATAL PERIOD,1,Minor,Minor,Medical,Private Health Insurance,,,02700,,N,54772.01,13940.54
Long Island,Nassau,2908000,000511,NYU Langone Hospital-Long Island,0 to 17,113,F,White,Unknown,2,Newborn,Home or Self Care,2020,PNL001,LIVEBORN,,,633,NEONATE BIRTHWT >2499G W MAJOR ANOMALY,15,NEWBORNS AND OTHER NEONATES WITH CONDITIONS ORIGINATING IN THE PERINATAL PERIOD,1,Minor,Minor,Medical,Medicaid,,,04200,,N,25001.24,8719.31
Long Island,Nassau,2908000,000511,NYU Langone Hospital-Long Island,0 to 17,117,F,Other Race,Spanish/Hispanic,14,Newborn,Home w/ Home Health Services,2020,PNL001,LIVEBORN,ESA004,NON-INVASIVE VENTILATION,633,NEONATE BIRTHWT >2499G W MAJOR ANOMALY,15,NEWBORNS AND OTHER NEONATES WITH CONDITIONS ORIGINATING IN THE PERINATAL PERIOD,2,Moderate,Minor,Medical,Private Health Insurance,,,02900,,N,174609.28,58462.17
Long Island,Nassau,2908000,000511,NYU Langone Hospital-Long Island,0 to 17,115,M,Black/African American,Not Span/Hispanic,5,Newborn,Home or Self Care,2020,PNL001,LIVEBORN,ESA004,NON-INVASIVE VENTILATION,633,NEONATE BIRTHWT >2499G W MAJOR ANOMALY,15,NEWBORNS AND OTHER NEONATES WITH CONDITIONS ORIGINATING IN THE PERINATAL PERIOD,3,Major,Major,Medical,Private Health Insurance,,,04900,,N,85628.08,24683.81
Long Island,Nassau,2908000,000511,NYU Langone Hospital-Long Island,0 to 17,115,M,Black/African American,Unknown,4,Newborn,Home or Self Care,2020,PNL001,LIVEBORN,ESA004,NON-INVASIVE VENTILATION,633,NEONATE BIRTHWT >2499G W MAJOR ANOMALY,15,NEWBORNS AND OTHER NEONATES WITH CONDITIONS ORIGINATING IN THE PERINATAL PERIOD,2,Moderate,Minor,Medical,Private Health Insurance,,,03600,,N,58218.44,18133.69
Long Island,Nassau,2908000,000511,NYU Langone Hospital-Long Island,0 to 17,115,M,Other Race,Spanish/Hispanic,16,Newborn,Home w/ Home Health Services,2020,PNL001,LIVEBORN,CAR024,VENOUS AND ARTERIAL CATHETER PLACEMENT,633,NEONATE BIRTHWT >2499G W MAJOR ANOMALY,15,NEWBORNS AND OTHER NEONATES WITH CONDITIONS ORIGINATING IN THE PERINATAL PERIOD,2,Moderate,Minor,Medical,Medicaid,,,05000,,N,256679.1,85158.27
Long Island,Nassau,2908000,000511,NYU Langone Hospital-Long Island,0 to 17,115,M,White,Not Span/Hispanic,2,Newborn,Home or Self Care,2020,PNL001,LIVEBORN,MRS001,CIRCUMCISION,633,NEONATE BIRTHWT >2499G W MAJOR ANOMALY,15,NEWBORNS AND OTHER NEONATES WITH CONDITIONS ORIGINATING IN THE PERINATAL PERIOD,2,Moderate,Minor,Medical,Private Health Insurance,,,02900,,N,32040.98,9660.2
Long Island,Nassau,2908000,000511,NYU Langone Hospital-Long Island,0 to 17,117,M,White,Not Span/Hispanic,1,Newborn,Home or Self Care,2020,PNL001,LIVEBORN,ENT001,LARYNGOSCOPY (DIAGNOSTIC),633,NEONATE BIRTHWT >2499G W MAJOR ANOMALY,15,NEWBORNS AND OTHER NEONATES WITH CONDITIONS ORIGINATING IN THE PERINATAL PERIOD,2,Moderate,Minor,Medical,Blue Cross/Blue Shield,,,03800,,N,16779.71,5282.98
Long Island,Nassau,2908000,000511,NYU Langone Hospital-Long Island,0 to 17,110,F,White,Not Span/Hispanic,3,Newborn,Home or Self Care,2020,PNL001,LIVEBORN,ESA004,NON-INVASIVE VENTILATION,633,NEONATE BIRTHWT >2499G W MAJOR ANOMALY,15,NEWBORNS AND OTHER NEONATES WITH CONDITIONS ORIGINATING IN THE PERINATAL PERIOD,1,Minor,Minor,Medical,Blue Cross/Blue Shield,,,04100,,N,56723.53,16086.77
Long Island,Nassau,2908000,000511,NYU Langone Hospital-Long Island,0 to 17,114,F,Black/African American,Not Span/Hispanic,7,Newborn,Home or Self Care,2020,PNL001,LIVEBORN,ESA004,NON-INVASIVE VENTILATION,633,NEONATE BIRTHWT >2499G W MAJOR ANOMALY,15,NEWBORNS AND OTHER NEONATES WITH CONDITIONS ORIGINATING IN THE PERINATAL PERIOD,3,Major,Moderate,Medical,Medicaid,,,02600,,N,88939.81,28374.12
Long Island,Nassau,2908000,000511,NYU Langone Hospital-Long Island,0 to 17,117,F,Black/African American,Not Span/Hispanic,12,Newborn,Home w/ Home Health Services,2020,PNL001,LIVEBORN,CAR024,VENOUS AND ARTERIAL CATHETER PLACEMENT,633,NEONATE BIRTHWT >2499G W MAJOR ANOMALY,15,NEWBORNS AND OTHER NEONATES WITH CONDITIONS ORIGINATING IN THE PERINATAL PERIOD,4,Extreme,Major,Medical,Private Health Insurance,Private Health Insurance,,04300,,N,189612.73,48450.36
Long Island,Nassau,2908000,000511,NYU Langone Hospital-Long Island,0 to 17,118,F,White,Not Span/Hispanic,4,Newborn,Home or Self Care,2020,PNL001,LIVEBORN,ESA004,NON-INVASIVE VENTILATION,633,NEONATE BIRTHWT >2499G W MAJOR ANOMALY,15,NEWBORNS AND OTHER NEONATES WITH CONDITIONS ORIGINATING IN THE PERINATAL PERIOD,2,Moderate,Minor,Medical,Private Health Insurance,,,02800,,N,54878.61,16446.14
Long Island,Nassau,2908000,000511,NYU Langone Hospital-Long Island,0 to 17,117,F,White,Not Span/Hispanic,5,Newborn,Home or Self Care,2020,PNL001,LIVEBORN,ADM017,ADMINISTRATION OF NUTRITIONAL AND ELECTROLYTIC SUBSTANCES,633,NEONATE BIRTHWT >2499G W MAJOR ANOMALY,15,NEWBORNS AND OTHER NEONATES WITH CONDITIONS ORIGINATING IN THE PERINATAL PERIOD,2,Moderate,Moderate,Medical,Private Health Insurance,,,03100,,N,76228.63,26112.04
Long Island,Nassau,2908000,000511,NYU Langone Hospital-Long Island,0 to 17,115,M,White,Spanish/Hispanic,2,Newborn,Home or Self Care,2020,PNL001,LIVEBORN,MST018,BONE EXCISION,633,NEONATE BIRTHWT >2499G W MAJOR ANOMALY,15,NEWBORNS AND OTHER NEONATES WITH CONDITIONS ORIGINATING IN THE PERINATAL PERIOD,1,Minor,Minor,Medical,Medicaid,,,03000,,N,28053.93,9078.16
Long Island,Nassau,2908000,000511,NYU Langone Hospital-Long Island,0 to 17,117,M,White,Not Span/Hispanic,18,Newborn,Home w/ Home Health Services,2020,PNL001,LIVEBORN,ESA004,NON-INVASIVE VENTILATION,633,NEONATE BIRTHWT >2499G W MAJOR ANOMALY,15,NEWBORNS AND OTHER NEONATES WITH CONDITIONS ORIGINATING IN THE PERINATAL PERIOD,3,Major,Moderate,Medical,Medicaid,,,03000,,N,324168.31,99875.38
Long Island,Nassau,2908000,000511,NYU Langone Hospital-Long Island,0 to 17,110,F,White,Not Span/Hispanic,4,Newborn,Home or Self Care,2020,PNL001,LIVEBORN,EST002,PHOTOTHERAPY,633,NEONATE BIRTHWT >2499G W MAJOR ANOMALY,15,NEWBORNS AND OTHER NEONATES WITH CONDITIONS ORIGINATING IN THE PERINATAL PERIOD,2,Moderate,Minor,Medical,Private Health Insurance,,,02800,,N,49469.31,16865.69
Long Island,Nassau,2908000,000511,NYU Langone Hospital-Long Island,0 to 17,113,M,White,Not Span/Hispanic,2,Newborn,Home or Self Care,2020,PNL001,LIVEBORN,MRS001,CIRCUMCISION,633,NEONATE BIRTHWT >2499G W MAJOR ANOMALY,15,NEWBORNS AND OTHER NEONATES WITH CONDITIONS ORIGINATING IN THE PERINATAL PERIOD,1,Minor,Minor,Medical,Blue Cross/Blue Shield,,,03300,,N,26434.03,9095.79
Long Island,Nassau,2908000,000511,NYU Langone Hospital-Long Island,0 to 17,110,F,Black/African American,Not Span/Hispanic,2,Elective,Home or Self Care,2020,PNL007,HEMOLYTIC JAUNDICE AND PERINATAL JAUNDICE,EST002,PHOTOTHERAPY,633,NEONATE BIRTHWT >2499G W MAJOR ANOMALY,15,NEWBORNS AND OTHER NEONATES WITH CONDITIONS ORIGINATING IN THE PERINATAL PERIOD,1,Minor,Minor,Medical,Blue Cross/Blue Shield,,,02800,,N,16975.89,5610.21
Long Island,Nassau,2908000,000511,NYU Langone Hospital-Long Island,0 to 17,117,M,Other Race,Not Span/Hispanic,4,Newborn,Home w/ Home Health Services,2020,PNL001,LIVEBORN,RES007,AIRWAY INTUBATION,633,NEONATE BIRTHWT >2499G W MAJOR ANOMALY,15,NEWBORNS AND OTHER NEONATES WITH CONDITIONS ORIGINATING IN THE PERINATAL PERIOD,4,Extreme,Major,Medical,Private Health Insurance,,,03900,,N,85943.14,22552.48
Long Island,Nassau,2908000,000511,NYU Langone Hospital-Long Island,0 to 17,115,F,Other Race,Spanish/Hispanic,8,Newborn,Home or Self Care,2020,PNL001,LIVEBORN,EST002,PHOTOTHERAPY,633,NEONATE BIRTHWT >2499G W MAJOR ANOMALY,15,NEWBORNS AND OTHER NEONATES WITH CONDITIONS ORIGINATING IN THE PERINATAL PERIOD,2,Moderate,Minor,Medical,Blue Cross/Blue Shield,,,02800,,N,123691.84,40794.93