Hospital Service Area,Hospital County,Operating Certificate Number,Permanent Facility Id,Facility Name,Age Group,Zip Code - 3 digits,Gender,Race,Ethnicity,Length of Stay,Type of Admission,Patient Disposition,Discharge Year,CCS Diagnosis Code,CCS Diagnosis Description,CCS Procedure Code,CCS Procedure Description,APR DRG Code,APR DRG Description,APR MDC Code,APR MDC Description,APR Severity of Illness Code,APR Severity of Illness Description,APR Risk of Mortality,APR Medical Surgical Description,Payment Typology 1,Payment Typology 2,Payment Typology 3,Birth Weight,Abortion Edit Indicator,Emergency Department Indicator,Total Charges,Total Costs
New York City,Manhattan,7002001,001438,Bellevue Hospital Center,0 to 17,OOS,M,Other Race,Not Span/Hispanic,14,Emergency,Home or Self Care,2017,220,Intrauterine hypoxia and birth asphyxia,231,OTHER THERAPEUTIC PRCS,634,"Neonate, birthwt >2499g w resp dist synd/oth maj resp cond",15,Newborns and Other Neonates with Conditions Originating in the Perinatal Period,4,Extreme,Major,Medical,Blue Cross/Blue Shield,,,03500,N,N,60067.53,38728.42
New York City,Manhattan,7002001,001438,Bellevue Hospital Center,0 to 17,112,F,Other Race,Not Span/Hispanic,3,Newborn,Home or Self Care,2017,218,Liveborn,216,RESP INTUB/MECH VENTIL,634,"Neonate, birthwt >2499g w resp dist synd/oth maj resp cond",15,Newborns and Other Neonates with Conditions Originating in the Perinatal Period,1,Minor,Minor,Medical,Self-Pay,,,02800,N,N,12663.91,8165.03
New York City,Manhattan,7002001,001438,Bellevue Hospital Center,0 to 17,104,M,Other Race,Spanish/Hispanic,13,Emergency,Home or Self Care,2017,220,Intrauterine hypoxia and birth asphyxia,216,RESP INTUB/MECH VENTIL,634,"Neonate, birthwt >2499g w resp dist synd/oth maj resp cond",15,Newborns and Other Neonates with Conditions Originating in the Perinatal Period,3,Major,Extreme,Medical,Self-Pay,,,02900,N,N,56752.42,36591.01
New York City,Manhattan,7002001,001438,Bellevue Hospital Center,0 to 17,104,F,Other Race,Not Span/Hispanic,2,Newborn,Home or Self Care,2017,218,Liveborn,217,OTHER RESP THERAPY,634,"Neonate, birthwt >2499g w resp dist synd/oth maj resp cond",15,Newborns and Other Neonates with Conditions Originating in the Perinatal Period,1,Minor,Minor,Medical,Self-Pay,,,03200,N,N,6430.60,4146.12
New York City,Manhattan,7002001,001438,Bellevue Hospital Center,0 to 17,100,F,Other Race,Spanish/Hispanic,3,Newborn,Home or Self Care,2017,218,Liveborn,216,RESP INTUB/MECH VENTIL,634,"Neonate, birthwt >2499g w resp dist synd/oth maj resp cond",15,Newborns and Other Neonates with Conditions Originating in the Perinatal Period,1,Minor,Minor,Medical,Medicaid,Medicaid,,04500,N,N,14447.23,9314.82
New York City,Manhattan,7002001,001438,Bellevue Hospital Center,0 to 17,100,F,Other Race,Not Span/Hispanic,13,Newborn,Home or Self Care,2017,218,Liveborn,004,DIAGNOSTIC SPINAL TAP,634,"Neonate, birthwt >2499g w resp dist synd/oth maj resp cond",15,Newborns and Other Neonates with Conditions Originating in the Perinatal Period,3,Major,Minor,Medical,Medicaid,Medicaid,,03200,N,N,51918.45,33474.32
New York City,Manhattan,7002001,001438,Bellevue Hospital Center,0 to 17,112,M,Other Race,Not Span/Hispanic,4,Newborn,Home or Self Care,2017,218,Liveborn,228,PROPHYLACTIC VAC/INOCUL,634,"Neonate, birthwt >2499g w resp dist synd/oth maj resp cond",15,Newborns and Other Neonates with Conditions Originating in the Perinatal Period,1,Minor,Minor,Medical,Medicaid,Medicaid,,03400,N,N,15555.41,10029.32
New York City,Manhattan,7002001,001438,Bellevue Hospital Center,0 to 17,100,M,Other Race,Not Span/Hispanic,23,Emergency,Home or Self Care,2017,213,Cardiac and circulatory congenital anomalies,216,RESP INTUB/MECH VENTIL,634,"Neonate, birthwt >2499g w resp dist synd/oth maj resp cond",15,Newborns and Other Neonates with Conditions Originating in the Perinatal Period,1,Minor,Minor,Medical,Private Health Insurance,,,03100,N,N,90078.21,58077.75
New York City,Manhattan,7002001,001438,Bellevue Hospital Center,0 to 17,114,M,Other Race,Not Span/Hispanic,7,Newborn,Home or Self Care,2017,218,Liveborn,216,RESP INTUB/MECH VENTIL,634,"Neonate, birthwt >2499g w resp dist synd/oth maj resp cond",15,Newborns and Other Neonates with Conditions Originating in the Perinatal Period,3,Major,Moderate,Medical,Medicaid,Medicaid,,03100,N,N,27617.55,17806.36
New York City,Manhattan,7002001,001438,Bellevue Hospital Center,0 to 17,104,M,Other Race,Spanish/Hispanic,3,Newborn,Home or Self Care,2017,218,Liveborn,216,RESP INTUB/MECH VENTIL,634,"Neonate, birthwt >2499g w resp dist synd/oth maj resp cond",15,Newborns and Other Neonates with Conditions Originating in the Perinatal Period,1,Minor,Minor,Medical,Medicaid,Medicaid,,03400,N,N,14237.87,9179.84
New York City,Manhattan,7002001,001438,Bellevue Hospital Center,0 to 17,104,F,Other Race,Not Span/Hispanic,23,Newborn,Short-term Hospital,2017,220,Intrauterine hypoxia and birth asphyxia,231,OTHER THERAPEUTIC PRCS,634,"Neonate, birthwt >2499g w resp dist synd/oth maj resp cond",15,Newborns and Other Neonates with Conditions Originating in the Perinatal Period,4,Extreme,Major,Medical,Blue Cross/Blue Shield,Medicaid,,03200,N,N,98295.91,63376.09
New York City,Manhattan,7002001,001438,Bellevue Hospital Center,0 to 17,112,F,Other Race,Not Span/Hispanic,7,Emergency,Home w/ Home Health Services,2017,220,Intrauterine hypoxia and birth asphyxia,231,OTHER THERAPEUTIC PRCS,634,"Neonate, birthwt >2499g w resp dist synd/oth maj resp cond",15,Newborns and Other Neonates with Conditions Originating in the Perinatal Period,3,Major,Minor,Medical,Medicaid,Medicaid,,03400,N,N,34896.79,22499.64
New York City,Manhattan,7002001,001438,Bellevue Hospital Center,0 to 17,104,M,Other Race,Not Span/Hispanic,17,Emergency,Home or Self Care,2017,224,Other perinatal conditions,216,RESP INTUB/MECH VENTIL,634,"Neonate, birthwt >2499g w resp dist synd/oth maj resp cond",15,Newborns and Other Neonates with Conditions Originating in the Perinatal Period,4,Extreme,Major,Medical,Medicaid,,,02500,N,N,73661.01,47492.79
New York City,Manhattan,7002001,001438,Bellevue Hospital Center,0 to 17,114,M,Black/African American,Not Span/Hispanic,6,Emergency,Home or Self Care,2017,221,Respiratory distress syndrome,004,DIAGNOSTIC SPINAL TAP,634,"Neonate, birthwt >2499g w resp dist synd/oth maj resp cond",15,Newborns and Other Neonates with Conditions Originating in the Perinatal Period,1,Minor,Minor,Medical,Medicaid,Medicaid,,03700,N,N,28871.07,18614.56
New York City,Manhattan,7002001,001438,Bellevue Hospital Center,0 to 17,113,F,Other Race,Not Span/Hispanic,33,Newborn,Home or Self Care,2017,218,Liveborn,216,RESP INTUB/MECH VENTIL,634,"Neonate, birthwt >2499g w resp dist synd/oth maj resp cond",15,Newborns and Other Neonates with Conditions Originating in the Perinatal Period,4,Extreme,Extreme,Medical,Medicaid,,,03100,N,N,137113.33,88403.55
New York City,Manhattan,7002001,001438,Bellevue Hospital Center,0 to 17,112,M,Other Race,Not Span/Hispanic,4,Newborn,Home or Self Care,2017,218,Liveborn,220,OPHTHALM-/OT-OLOGIC DX,634,"Neonate, birthwt >2499g w resp dist synd/oth maj resp cond",15,Newborns and Other Neonates with Conditions Originating in the Perinatal Period,2,Moderate,Moderate,Medical,Medicaid,Medicaid,,03500,N,N,16528.54,10656.74
New York City,Manhattan,7002001,001438,Bellevue Hospital Center,0 to 17,104,M,Other Race,Not Span/Hispanic,16,Emergency,Home or Self Care,2017,220,Intrauterine hypoxia and birth asphyxia,231,OTHER THERAPEUTIC PRCS,634,"Neonate, birthwt >2499g w resp dist synd/oth maj resp cond",15,Newborns and Other Neonates with Conditions Originating in the Perinatal Period,3,Major,Moderate,Medical,Medicaid,Medicaid,,02900,N,N,68203.68,43974.19
New York City,Manhattan,7002001,001438,Bellevue Hospital Center,0 to 17,113,M,Other Race,Spanish/Hispanic,17,Emergency,Home or Self Care,2017,224,Other perinatal conditions,231,OTHER THERAPEUTIC PRCS,634,"Neonate, birthwt >2499g w resp dist synd/oth maj resp cond",15,Newborns and Other Neonates with Conditions Originating in the Perinatal Period,4,Extreme,Extreme,Medical,Medicaid,Medicaid,,03700,N,N,72062.54,46462.18
New York City,Manhattan,7002001,001438,Bellevue Hospital Center,0 to 17,113,M,Other Race,Spanish/Hispanic,2,Emergency,Home or Self Care,2017,224,Other perinatal conditions,216,RESP INTUB/MECH VENTIL,634,"Neonate, birthwt >2499g w resp dist synd/oth maj resp cond",15,Newborns and Other Neonates with Conditions Originating in the Perinatal Period,3,Major,Minor,Medical,Medicaid,Medicaid,,03100,N,N,10885.85,7018.63
New York City,Manhattan,7002001,001438,Bellevue Hospital Center,0 to 17,113,F,Other Race,Spanish/Hispanic,2,Newborn,Home or Self Care,2017,218,Liveborn,216,RESP INTUB/MECH VENTIL,634,"Neonate, birthwt >2499g w resp dist synd/oth maj resp cond",15,Newborns and Other Neonates with Conditions Originating in the Perinatal Period,1,Minor,Minor,Medical,Medicaid,Medicaid,,03000,N,N,4569.43,2946.13
New York City,Manhattan,7002001,001438,Bellevue Hospital Center,0 to 17,113,F,Other Race,Not Span/Hispanic,57,Emergency,Home or Self Care,2017,220,Intrauterine hypoxia and birth asphyxia,231,OTHER THERAPEUTIC PRCS,634,"Neonate, birthwt >2499g w resp dist synd/oth maj resp cond",15,Newborns and Other Neonates with Conditions Originating in the Perinatal Period,4,Extreme,Major,Medical,Medicaid,Medicaid,,03100,N,N,232784.07,150087.06
New York City,Manhattan,7002001,001438,Bellevue Hospital Center,0 to 17,104,M,Other Race,Not Span/Hispanic,6,Newborn,Home or Self Care,2017,218,Liveborn,216,RESP INTUB/MECH VENTIL,634,"Neonate, birthwt >2499g w resp dist synd/oth maj resp cond",15,Newborns and Other Neonates with Conditions Originating in the Perinatal Period,2,Moderate,Minor,Medical,Private Health Insurance,,,03300,N,N,26048.54,16794.74
New York City,Manhattan,7002001,001438,Bellevue Hospital Center,0 to 17,104,M,Other Race,Not Span/Hispanic,13,Newborn,Home or Self Care,2017,218,Liveborn,216,RESP INTUB/MECH VENTIL,634,"Neonate, birthwt >2499g w resp dist synd/oth maj resp cond",15,Newborns and Other Neonates with Conditions Originating in the Perinatal Period,3,Major,Minor,Medical,Medicaid,Medicaid,,02700,N,N,52430.72,33804.60
New York City,Manhattan,7002001,001438,Bellevue Hospital Center,0 to 17,113,M,Other Race,Not Span/Hispanic,7,Newborn,Home or Self Care,2017,218,Liveborn,231,OTHER THERAPEUTIC PRCS,634,"Neonate, birthwt >2499g w resp dist synd/oth maj resp cond",15,Newborns and Other Neonates with Conditions Originating in the Perinatal Period,1,Minor,Minor,Medical,Medicaid,Medicaid,,03700,N,N,29316.12,18901.51
New York City,Manhattan,7002001,001438,Bellevue Hospital Center,0 to 17,104,F,Other Race,Not Span/Hispanic,25,Emergency,Home w/ Home Health Services,2017,220,Intrauterine hypoxia and birth asphyxia,231,OTHER THERAPEUTIC PRCS,634,"Neonate, birthwt >2499g w resp dist synd/oth maj resp cond",15,Newborns and Other Neonates with Conditions Originating in the Perinatal Period,2,Moderate,Minor,Medical,Self-Pay,,,02600,N,N,102090.71,65822.78
New York City,Manhattan,7002001,001438,Bellevue Hospital Center,0 to 17,112,F,Other Race,Not Span/Hispanic,10,Emergency,Home or Self Care,2017,224,Other perinatal conditions,216,RESP INTUB/MECH VENTIL,634,"Neonate, birthwt >2499g w resp dist synd/oth maj resp cond",15,Newborns and Other Neonates with Conditions Originating in the Perinatal Period,4,Extreme,Extreme,Medical,Medicaid,Medicaid,,03100,N,N,48557.61,31307.42
New York City,Manhattan,7002001,001438,Bellevue Hospital Center,0 to 17,104,F,Other Race,Not Span/Hispanic,25,Emergency,Home w/ Home Health Services,2017,220,Intrauterine hypoxia and birth asphyxia,231,OTHER THERAPEUTIC PRCS,634,"Neonate, birthwt >2499g w resp dist synd/oth maj resp cond",15,Newborns and Other Neonates with Conditions Originating in the Perinatal Period,2,Moderate,Minor,Medical,Medicaid,Medicaid,,02600,N,N,102090.71,65822.78
