Hospital Service Area,Hospital County,Operating Certificate Number,Permanent Facility Id,Facility Name,Age Group,Zip Code - 3 digits,Gender,Race,Ethnicity,Length of Stay,Type of Admission,Patient Disposition,Discharge Year,CCS Diagnosis Code,CCS Diagnosis Description,CCS Procedure Code,CCS Procedure Description,APR DRG Code,APR DRG Description,APR MDC Code,APR MDC Description,APR Severity of Illness Code,APR Severity of Illness Description,APR Risk of Mortality,APR Medical Surgical Description,Payment Typology 1,Payment Typology 2,Payment Typology 3,Birth Weight,Abortion Edit Indicator,Emergency Department Indicator,Total Charges,Total Costs
Long Island,Nassau,2908000,000511,NYU Winthrop Hospital,0 to 17,115,M,White,Spanish/Hispanic,7,Newborn,Home or Self Care,2017,218,Liveborn,004,DIAGNOSTIC SPINAL TAP,636,Neonate birthwt >2499g w congenital/perinatal infection,15,Newborns and Other Neonates with Conditions Originating in the Perinatal Period,1,Minor,Minor,Medical,Medicaid,Medicaid,,03700,N,N,37610.02,7433.62
Long Island,Nassau,2908000,000511,NYU Winthrop Hospital,0 to 17,115,F,White,Spanish/Hispanic,7,Newborn,Home or Self Care,2017,218,Liveborn,004,DIAGNOSTIC SPINAL TAP,636,Neonate birthwt >2499g w congenital/perinatal infection,15,Newborns and Other Neonates with Conditions Originating in the Perinatal Period,1,Minor,Minor,Medical,Medicaid,Medicaid,,03400,N,N,40893.23,7921.51
Long Island,Nassau,2908000,000511,NYU Winthrop Hospital,0 to 17,115,F,Black/African American,Not Span/Hispanic,2,Newborn,Home or Self Care,2017,218,Liveborn,000,NO PROC,636,Neonate birthwt >2499g w congenital/perinatal infection,15,Newborns and Other Neonates with Conditions Originating in the Perinatal Period,1,Minor,Minor,Medical,Blue Cross/Blue Shield,,,03000,N,N,6889.07,1311.00
Long Island,Nassau,2908000,000511,NYU Winthrop Hospital,0 to 17,117,M,White,Not Span/Hispanic,11,Newborn,Home or Self Care,2017,218,Liveborn,004,DIAGNOSTIC SPINAL TAP,636,Neonate birthwt >2499g w congenital/perinatal infection,15,Newborns and Other Neonates with Conditions Originating in the Perinatal Period,4,Extreme,Major,Medical,Blue Cross/Blue Shield,,,03000,N,N,113449.82,16386.71
Long Island,Nassau,2908000,000511,NYU Winthrop Hospital,0 to 17,115,M,Other Race,Spanish/Hispanic,7,Newborn,Home or Self Care,2017,218,Liveborn,004,DIAGNOSTIC SPINAL TAP,636,Neonate birthwt >2499g w congenital/perinatal infection,15,Newborns and Other Neonates with Conditions Originating in the Perinatal Period,1,Minor,Minor,Medical,Medicaid,Medicaid,,03900,N,N,43032.07,8119.04
Long Island,Nassau,2908000,000511,NYU Winthrop Hospital,0 to 17,117,M,White,Not Span/Hispanic,14,Newborn,Home or Self Care,2017,218,Liveborn,054,OT VASC CATH; NOT HEART,636,Neonate birthwt >2499g w congenital/perinatal infection,15,Newborns and Other Neonates with Conditions Originating in the Perinatal Period,2,Moderate,Minor,Medical,Blue Cross/Blue Shield,,,03000,N,N,88160.37,17457.11
Long Island,Nassau,2908000,000511,NYU Winthrop Hospital,0 to 17,115,M,White,Not Span/Hispanic,9,Newborn,Home or Self Care,2017,218,Liveborn,216,RESP INTUB/MECH VENTIL,636,Neonate birthwt >2499g w congenital/perinatal infection,15,Newborns and Other Neonates with Conditions Originating in the Perinatal Period,2,Moderate,Minor,Medical,Medicaid,,,03400,N,N,55220.83,11136.39
Long Island,Nassau,2908000,000511,NYU Winthrop Hospital,0 to 17,110,F,White,Spanish/Hispanic,16,Newborn,Home or Self Care,2017,218,Liveborn,054,OT VASC CATH; NOT HEART,636,Neonate birthwt >2499g w congenital/perinatal infection,15,Newborns and Other Neonates with Conditions Originating in the Perinatal Period,2,Moderate,Minor,Medical,Medicaid,Medicaid,,03400,N,N,186818.32,39022.68
Long Island,Nassau,2908000,000511,NYU Winthrop Hospital,0 to 17,115,F,White,Not Span/Hispanic,7,Newborn,Home or Self Care,2017,218,Liveborn,228,PROPHYLACTIC VAC/INOCUL,636,Neonate birthwt >2499g w congenital/perinatal infection,15,Newborns and Other Neonates with Conditions Originating in the Perinatal Period,1,Minor,Minor,Medical,Blue Cross/Blue Shield,,,04100,N,N,76888.24,15968.54
Long Island,Nassau,2908000,000511,NYU Winthrop Hospital,0 to 17,,F,White,Unknown,6,Newborn,Home or Self Care,2017,218,Liveborn,000,NO PROC,636,Neonate birthwt >2499g w congenital/perinatal infection,15,Newborns and Other Neonates with Conditions Originating in the Perinatal Period,1,Minor,Minor,Medical,Private Health Insurance,,,03400,N,N,65363.47,12812.70
Long Island,Nassau,2908000,000511,NYU Winthrop Hospital,0 to 17,115,M,White,Not Span/Hispanic,7,Newborn,Home or Self Care,2017,218,Liveborn,004,DIAGNOSTIC SPINAL TAP,636,Neonate birthwt >2499g w congenital/perinatal infection,15,Newborns and Other Neonates with Conditions Originating in the Perinatal Period,1,Minor,Minor,Medical,Blue Cross/Blue Shield,,,04100,N,N,64687.70,13309.55
Long Island,Nassau,2908000,000511,NYU Winthrop Hospital,0 to 17,117,M,White,Not Span/Hispanic,7,Newborn,Home or Self Care,2017,218,Liveborn,004,DIAGNOSTIC SPINAL TAP,636,Neonate birthwt >2499g w congenital/perinatal infection,15,Newborns and Other Neonates with Conditions Originating in the Perinatal Period,1,Minor,Minor,Medical,Blue Cross/Blue Shield,,,03600,N,N,74237.93,15190.90
Long Island,Nassau,2908000,000511,NYU Winthrop Hospital,0 to 17,117,M,Other Race,Unknown,7,Newborn,Home or Self Care,2017,218,Liveborn,004,DIAGNOSTIC SPINAL TAP,636,Neonate birthwt >2499g w congenital/perinatal infection,15,Newborns and Other Neonates with Conditions Originating in the Perinatal Period,2,Moderate,Moderate,Medical,Private Health Insurance,,,03500,N,N,73737.76,15110.39
Long Island,Nassau,2908000,000511,NYU Winthrop Hospital,0 to 17,115,M,White,Spanish/Hispanic,7,Newborn,Home or Self Care,2017,218,Liveborn,004,DIAGNOSTIC SPINAL TAP,636,Neonate birthwt >2499g w congenital/perinatal infection,15,Newborns and Other Neonates with Conditions Originating in the Perinatal Period,1,Minor,Minor,Medical,Medicaid,Medicaid,,03200,N,N,81635.79,16265.19
Long Island,Nassau,2908000,000511,NYU Winthrop Hospital,0 to 17,113,M,Other Race,Spanish/Hispanic,7,Newborn,Home or Self Care,2017,218,Liveborn,115,CIRCUMCISION,636,Neonate birthwt >2499g w congenital/perinatal infection,15,Newborns and Other Neonates with Conditions Originating in the Perinatal Period,1,Minor,Minor,Medical,Blue Cross/Blue Shield,,,03300,N,N,80363.81,16120.21
Long Island,Nassau,2908000,000511,NYU Winthrop Hospital,0 to 17,115,F,Other Race,Spanish/Hispanic,3,Newborn,Home or Self Care,2017,218,Liveborn,231,OTHER THERAPEUTIC PRCS,636,Neonate birthwt >2499g w congenital/perinatal infection,15,Newborns and Other Neonates with Conditions Originating in the Perinatal Period,1,Minor,Minor,Medical,Medicaid,Medicaid,,03800,N,N,27374.36,5292.75
Long Island,Nassau,2908000,000511,NYU Winthrop Hospital,0 to 17,117,M,Other Race,Not Span/Hispanic,7,Newborn,Home or Self Care,2017,218,Liveborn,216,RESP INTUB/MECH VENTIL,636,Neonate birthwt >2499g w congenital/perinatal infection,15,Newborns and Other Neonates with Conditions Originating in the Perinatal Period,3,Major,Moderate,Medical,Private Health Insurance,,,03300,N,N,104315.13,21278.24
Long Island,Nassau,2908000,000511,NYU Winthrop Hospital,0 to 17,117,M,White,Not Span/Hispanic,7,Newborn,Home w/ Home Health Services,2017,218,Liveborn,004,DIAGNOSTIC SPINAL TAP,636,Neonate birthwt >2499g w congenital/perinatal infection,15,Newborns and Other Neonates with Conditions Originating in the Perinatal Period,2,Moderate,Moderate,Medical,Private Health Insurance,,,03700,N,N,90960.36,17127.92
Long Island,Nassau,2908000,000511,NYU Winthrop Hospital,0 to 17,110,M,White,Not Span/Hispanic,6,Newborn,Home or Self Care,2017,218,Liveborn,216,RESP INTUB/MECH VENTIL,636,Neonate birthwt >2499g w congenital/perinatal infection,15,Newborns and Other Neonates with Conditions Originating in the Perinatal Period,3,Major,Moderate,Medical,Medicaid,Medicaid,,03800,N,N,82582.42,15065.03
Long Island,Nassau,2908000,000511,NYU Winthrop Hospital,0 to 17,117,F,White,Not Span/Hispanic,4,Newborn,Home or Self Care,2017,218,Liveborn,000,NO PROC,636,Neonate birthwt >2499g w congenital/perinatal infection,15,Newborns and Other Neonates with Conditions Originating in the Perinatal Period,1,Minor,Minor,Medical,Private Health Insurance,,,03400,N,N,38363.19,7759.72
