Hospital Service Area,Hospital County,Operating Certificate Number,Permanent Facility Id,Facility Name,Age Group,Zip Code - 3 digits,Gender,Race,Ethnicity,Length of Stay,Type of Admission,Patient Disposition,Discharge Year,CCS Diagnosis Code,CCS Diagnosis Description,CCS Procedure Code,CCS Procedure Description,APR DRG Code,APR DRG Description,APR MDC Code,APR MDC Description,APR Severity of Illness Code,APR Severity of Illness Description,APR Risk of Mortality,APR Medical Surgical Description,Payment Typology 1,Payment Typology 2,Payment Typology 3,Birth Weight,Abortion Edit Indicator,Emergency Department Indicator,Total Charges,Total Costs
New York City,Manhattan,7002053,001463,NYU Langone Hospitals,0 to 17,111,M,White,Not Span/Hispanic,3,Newborn,Home or Self Care,2019,PNL001,LIVEBORN,ADM010,VACCINATIONS,636,NEONATE BIRTHWT >2499G W CONGENITAL/PERINATAL INFECTION,15,NEWBORNS AND OTHER NEONATES WITH CONDITIONS ORIGINATING IN THE PERINATAL PERIOD,1,Minor,Minor,Medical,Private Health Insurance,,,03000,,false,35909.62,14649.75
New York City,Manhattan,7002053,001463,NYU Langone Hospitals,0 to 17,112,F,Other Race,Not Span/Hispanic,3,Emergency,Home or Self Care,2019,PNL009,PERINATAL INFECTIONS,CNS002,LUMBAR PUNCTURE,636,NEONATE BIRTHWT >2499G W CONGENITAL/PERINATAL INFECTION,15,NEWBORNS AND OTHER NEONATES WITH CONDITIONS ORIGINATING IN THE PERINATAL PERIOD,1,Minor,Minor,Medical,Blue Cross/Blue Shield,,,02700,,true,32796.59,9722.38
New York City,Manhattan,7002053,001463,NYU Langone Hospitals,0 to 17,112,M,Other Race,Unknown,4,Newborn,Home or Self Care,2019,PNL001,LIVEBORN,MRS001,CIRCUMCISION,636,NEONATE BIRTHWT >2499G W CONGENITAL/PERINATAL INFECTION,15,NEWBORNS AND OTHER NEONATES WITH CONDITIONS ORIGINATING IN THE PERINATAL PERIOD,1,Minor,Minor,Medical,Private Health Insurance,,,03500,,false,48269.28,21051.35
New York City,Manhattan,7002053,001463,NYU Langone Hospitals,0 to 17,100,M,Other Race,Spanish/Hispanic,2,Newborn,Home or Self Care,2019,PNL001,LIVEBORN,ADM010,VACCINATIONS,636,NEONATE BIRTHWT >2499G W CONGENITAL/PERINATAL INFECTION,15,NEWBORNS AND OTHER NEONATES WITH CONDITIONS ORIGINATING IN THE PERINATAL PERIOD,1,Minor,Minor,Medical,Private Health Insurance,,,03400,,false,29847.58,11060.69
New York City,Manhattan,7002053,001463,NYU Langone Hospitals,0 to 17,100,F,Other Race,Not Span/Hispanic,4,Newborn,Home or Self Care,2019,PNL001,LIVEBORN,ESA004,NON-INVASIVE VENTILATION,636,NEONATE BIRTHWT >2499G W CONGENITAL/PERINATAL INFECTION,15,NEWBORNS AND OTHER NEONATES WITH CONDITIONS ORIGINATING IN THE PERINATAL PERIOD,1,Minor,Minor,Medical,Blue Cross/Blue Shield,,,02600,,false,50363.9,20914.72
New York City,Manhattan,7002053,001463,NYU Langone Hospitals,0 to 17,112,F,White,Unknown,2,Newborn,Home or Self Care,2019,PNL001,LIVEBORN,ENT004,DIAGNOSTIC AUDIOLOGY,636,NEONATE BIRTHWT >2499G W CONGENITAL/PERINATAL INFECTION,15,NEWBORNS AND OTHER NEONATES WITH CONDITIONS ORIGINATING IN THE PERINATAL PERIOD,1,Minor,Minor,Medical,Private Health Insurance,,,03900,,false,30603.89,11268.16
New York City,Manhattan,7002053,001463,NYU Langone Hospitals,0 to 17,100,F,Other Race,Not Span/Hispanic,2,Emergency,Home or Self Care,2019,PNL013,OTHER SPECIFIED AND UNSPECIFIED PERINATAL CONDITIONS,CNS002,LUMBAR PUNCTURE,636,NEONATE BIRTHWT >2499G W CONGENITAL/PERINATAL INFECTION,15,NEWBORNS AND OTHER NEONATES WITH CONDITIONS ORIGINATING IN THE PERINATAL PERIOD,1,Minor,Minor,Medical,Private Health Insurance,,,03500,,true,33278.71,7982.02
New York City,Manhattan,7002053,001463,NYU Langone Hospitals,0 to 17,112,F,White,Not Span/Hispanic,12,Newborn,Home or Self Care,2019,PNL001,LIVEBORN,CNS002,LUMBAR PUNCTURE,636,NEONATE BIRTHWT >2499G W CONGENITAL/PERINATAL INFECTION,15,NEWBORNS AND OTHER NEONATES WITH CONDITIONS ORIGINATING IN THE PERINATAL PERIOD,2,Moderate,Moderate,Medical,Private Health Insurance,,,02900,,false,279669.7,68368.74
New York City,Manhattan,7002053,001463,NYU Langone Hospitals,0 to 17,,M,Other Race,Not Span/Hispanic,4,Newborn,Home or Self Care,2019,PNL001,LIVEBORN,MRS001,CIRCUMCISION,636,NEONATE BIRTHWT >2499G W CONGENITAL/PERINATAL INFECTION,15,NEWBORNS AND OTHER NEONATES WITH CONDITIONS ORIGINATING IN THE PERINATAL PERIOD,1,Minor,Minor,Medical,Blue Cross/Blue Shield,,,03700,,false,51716.03,19820.57
New York City,Manhattan,7002053,001463,NYU Langone Hospitals,0 to 17,113,F,Other Race,Unknown,5,Newborn,Home or Self Care,2019,PNL001,LIVEBORN,,,636,NEONATE BIRTHWT >2499G W CONGENITAL/PERINATAL INFECTION,15,NEWBORNS AND OTHER NEONATES WITH CONDITIONS ORIGINATING IN THE PERINATAL PERIOD,1,Minor,Minor,Medical,Private Health Insurance,,,03900,,false,66073.72,26120.68
New York City,Manhattan,7002053,001463,NYU Langone Hospitals,0 to 17,112,F,White,Unknown,2,Newborn,Home or Self Care,2019,PNL001,LIVEBORN,ENT004,DIAGNOSTIC AUDIOLOGY,636,NEONATE BIRTHWT >2499G W CONGENITAL/PERINATAL INFECTION,15,NEWBORNS AND OTHER NEONATES WITH CONDITIONS ORIGINATING IN THE PERINATAL PERIOD,1,Minor,Minor,Medical,Blue Cross/Blue Shield,,,03400,,false,23186.53,9232.38
New York City,Manhattan,7002053,001463,NYU Langone Hospitals,0 to 17,OOS,M,Other Race,Unknown,8,Newborn,Home or Self Care,2019,PNL001,LIVEBORN,RES007,AIRWAY INTUBATION,636,NEONATE BIRTHWT >2499G W CONGENITAL/PERINATAL INFECTION,15,NEWBORNS AND OTHER NEONATES WITH CONDITIONS ORIGINATING IN THE PERINATAL PERIOD,3,Major,Moderate,Medical,Blue Cross/Blue Shield,,,03500,,false,153347.62,45323.97
New York City,Manhattan,7002053,001463,NYU Langone Hospitals,0 to 17,112,F,White,Not Span/Hispanic,2,Emergency,Home or Self Care,2019,NVS001,MENINGITIS,CNS002,LUMBAR PUNCTURE,636,NEONATE BIRTHWT >2499G W CONGENITAL/PERINATAL INFECTION,15,NEWBORNS AND OTHER NEONATES WITH CONDITIONS ORIGINATING IN THE PERINATAL PERIOD,2,Moderate,Minor,Medical,Private Health Insurance,,,03600,,true,27307.09,7192.77
New York City,Manhattan,7002053,001463,NYU Langone Hospitals,0 to 17,104,M,White,Unknown,4,Newborn,Home or Self Care,2019,PNL001,LIVEBORN,ADM010,VACCINATIONS,636,NEONATE BIRTHWT >2499G W CONGENITAL/PERINATAL INFECTION,15,NEWBORNS AND OTHER NEONATES WITH CONDITIONS ORIGINATING IN THE PERINATAL PERIOD,1,Minor,Minor,Medical,Private Health Insurance,,,03400,,false,51952.54,20523.8
New York City,Manhattan,7002053,001463,NYU Langone Hospitals,0 to 17,,M,White,Unknown,10,Newborn,Home or Self Care,2019,PNL001,LIVEBORN,ADM010,VACCINATIONS,636,NEONATE BIRTHWT >2499G W CONGENITAL/PERINATAL INFECTION,15,NEWBORNS AND OTHER NEONATES WITH CONDITIONS ORIGINATING IN THE PERINATAL PERIOD,1,Minor,Minor,Medical,Medicare,,,03600,,false,139729.35,54567.24
New York City,Manhattan,7002053,001463,NYU Langone Hospitals,0 to 17,112,M,Other Race,Unknown,21,Emergency,Home or Self Care,2019,PNL009,PERINATAL INFECTIONS,CNS002,LUMBAR PUNCTURE,636,NEONATE BIRTHWT >2499G W CONGENITAL/PERINATAL INFECTION,15,NEWBORNS AND OTHER NEONATES WITH CONDITIONS ORIGINATING IN THE PERINATAL PERIOD,3,Major,Minor,Medical,Blue Cross/Blue Shield,,,03700,,true,168710.5,68300.71
New York City,Manhattan,7002053,001463,NYU Langone Hospitals,0 to 17,112,M,White,Unknown,2,Newborn,Home or Self Care,2019,PNL001,LIVEBORN,ENT004,DIAGNOSTIC AUDIOLOGY,636,NEONATE BIRTHWT >2499G W CONGENITAL/PERINATAL INFECTION,15,NEWBORNS AND OTHER NEONATES WITH CONDITIONS ORIGINATING IN THE PERINATAL PERIOD,1,Minor,Minor,Medical,Private Health Insurance,Medicaid,,03000,,false,21763.82,8485
New York City,Manhattan,7002053,001463,NYU Langone Hospitals,0 to 17,112,F,Multi-racial,Not Span/Hispanic,2,Emergency,Home or Self Care,2019,NVS001,MENINGITIS,CNS002,LUMBAR PUNCTURE,636,NEONATE BIRTHWT >2499G W CONGENITAL/PERINATAL INFECTION,15,NEWBORNS AND OTHER NEONATES WITH CONDITIONS ORIGINATING IN THE PERINATAL PERIOD,2,Moderate,Minor,Medical,Blue Cross/Blue Shield,,,03700,,true,25652.75,6981.84
New York City,Manhattan,7002053,001463,NYU Langone Hospitals,0 to 17,112,M,Black/African American,Unknown,7,Newborn,Home or Self Care,2019,PNL001,LIVEBORN,CNS002,LUMBAR PUNCTURE,636,NEONATE BIRTHWT >2499G W CONGENITAL/PERINATAL INFECTION,15,NEWBORNS AND OTHER NEONATES WITH CONDITIONS ORIGINATING IN THE PERINATAL PERIOD,1,Minor,Moderate,Medical,Private Health Insurance,,,03500,,false,94322.14,37449.55
New York City,Manhattan,7002053,001463,NYU Langone Hospitals,0 to 17,112,M,Other Race,Not Span/Hispanic,6,Newborn,Home or Self Care,2019,PNL001,LIVEBORN,MRS001,CIRCUMCISION,636,NEONATE BIRTHWT >2499G W CONGENITAL/PERINATAL INFECTION,15,NEWBORNS AND OTHER NEONATES WITH CONDITIONS ORIGINATING IN THE PERINATAL PERIOD,1,Minor,Minor,Medical,Medicaid,,,03400,,false,80190.75,32059.74
New York City,Manhattan,7002053,001463,NYU Langone Hospitals,0 to 17,114,F,Other Race,Unknown,14,Newborn,Home or Self Care,2019,PNL001,LIVEBORN,CNS002,LUMBAR PUNCTURE,636,NEONATE BIRTHWT >2499G W CONGENITAL/PERINATAL INFECTION,15,NEWBORNS AND OTHER NEONATES WITH CONDITIONS ORIGINATING IN THE PERINATAL PERIOD,1,Minor,Minor,Medical,Private Health Insurance,,,03100,,false,178856.86,73429.49
New York City,Manhattan,7002053,001463,NYU Langone Hospitals,0 to 17,112,M,White,Not Span/Hispanic,5,Newborn,Home or Self Care,2019,PNL001,LIVEBORN,ENT004,DIAGNOSTIC AUDIOLOGY,636,NEONATE BIRTHWT >2499G W CONGENITAL/PERINATAL INFECTION,15,NEWBORNS AND OTHER NEONATES WITH CONDITIONS ORIGINATING IN THE PERINATAL PERIOD,2,Moderate,Minor,Medical,Medicaid,,,02800,,false,66647.24,26456.12
New York City,Manhattan,7002053,001463,NYU Langone Hospitals,0 to 17,103,F,White,Not Span/Hispanic,10,Emergency,Home or Self Care,2019,PNL004,NEONATAL CEREBRAL DISORDERS,ESA003,MECHANICAL VENTILATION,636,NEONATE BIRTHWT >2499G W CONGENITAL/PERINATAL INFECTION,15,NEWBORNS AND OTHER NEONATES WITH CONDITIONS ORIGINATING IN THE PERINATAL PERIOD,3,Major,Moderate,Medical,Blue Cross/Blue Shield,,,03000,,false,200283.11,58647.46
